FailedConsole Output

Started by upstream project "ADAM-prb" build number 3063
originally caused by:
 GitHub pull request #2217 of commit dcbca14f386d8691e101b40e0186ece59a8c60dd automatically merged.
[EnvInject] - Loading node environment variables.
Building remotely on research-jenkins-worker-09 (ubuntu ubuntu-gpu research-09 ubuntu-avx2) in workspace /home/jenkins/workspace/ADAM-prb/HADOOP_VERSION/2.7.5/SCALAVER/2.11/SPARK_VERSION/2.4.4/label/ubuntu
Wiping out workspace first.
Cloning the remote Git repository
Cloning repository https://github.com/bigdatagenomics/adam.git
 > git init /home/jenkins/workspace/ADAM-prb/HADOOP_VERSION/2.7.5/SCALAVER/2.11/SPARK_VERSION/2.4.4/label/ubuntu # timeout=10
Fetching upstream changes from https://github.com/bigdatagenomics/adam.git
 > git --version # timeout=10
 > git fetch --tags --progress https://github.com/bigdatagenomics/adam.git +refs/heads/*:refs/remotes/origin/* # timeout=15
 > git config remote.origin.url https://github.com/bigdatagenomics/adam.git # timeout=10
 > git config --add remote.origin.fetch +refs/heads/*:refs/remotes/origin/* # timeout=10
 > git config remote.origin.url https://github.com/bigdatagenomics/adam.git # timeout=10
Fetching upstream changes from https://github.com/bigdatagenomics/adam.git
 > git fetch --tags --progress https://github.com/bigdatagenomics/adam.git +refs/pull/*:refs/remotes/origin/pr/* # timeout=15
Checking out Revision df2094885748352418a15759a741ea9938cc9a17 (origin/pr/2217/merge)
 > git config core.sparsecheckout # timeout=10
 > git checkout -f df2094885748352418a15759a741ea9938cc9a17
First time build. Skipping changelog.
[ubuntu] $ /bin/bash /tmp/hudson166982274973514463.sh
+ set -e
+ unset SPARK_TESTING
+ export JAVA_HOME=/usr/lib/jvm/java-8-oracle
+ JAVA_HOME=/usr/lib/jvm/java-8-oracle
+ export CONDA_BIN=/home/anaconda/bin/
+ CONDA_BIN=/home/anaconda/bin/
+ export PATH=/usr/lib/jvm/java-8-oracle/bin/:/home/anaconda/bin/:/home/jenkins/gems/bin:/usr/local/go/bin:/home/jenkins/go-projects/bin:/home/jenkins/anaconda2/bin:/usr/local/sbin:/usr/local/bin:/usr/sbin:/usr/bin:/sbin:/bin:/usr/games:/usr/local/games
+ PATH=/usr/lib/jvm/java-8-oracle/bin/:/home/anaconda/bin/:/home/jenkins/gems/bin:/usr/local/go/bin:/home/jenkins/go-projects/bin:/home/jenkins/anaconda2/bin:/usr/local/sbin:/usr/local/bin:/usr/sbin:/usr/bin:/sbin:/bin:/usr/games:/usr/local/games
+ set +x
+ /home/jenkins/workspace/ADAM-prb/HADOOP_VERSION/2.7.5/SCALAVER/2.11/SPARK_VERSION/2.4.4/label/ubuntu/scripts/jenkins-test

# make a tempdir for writing maven cruft to
ADAM_MVN_TMP_DIR=$(mktemp -d -t adamTestMvnXXXXXXX)
mktemp -d -t adamTestMvnXXXXXXX
++ mktemp -d -t adamTestMvnXXXXXXX
+ ADAM_MVN_TMP_DIR=/tmp/adamTestMvnE2QS3jv

# add this tempdir to the poms...
find . -name pom.xml \
    -exec sed -i.bak \
    -e "s:sun.io.serialization.extendedDebugInfo=true:sun.io.serialization.extendedDebugInfo=true -Djava.io.tmpdir=${ADAM_MVN_TMP_DIR}:g" \
    {} \;
+ find . -name pom.xml -exec sed -i.bak -e 's:sun.io.serialization.extendedDebugInfo=true:sun.io.serialization.extendedDebugInfo=true -Djava.io.tmpdir=/tmp/adamTestMvnE2QS3jv:g' '{}' ';'
find . -name "*.bak" -exec rm -f {} \;
+ find . -name '*.bak' -exec rm -f '{}' ';'

# variable declarations
export PATH=${JAVA_HOME}/bin/:${PATH}
+ export PATH=/usr/lib/jvm/java-8-oracle/bin/:/usr/lib/jvm/java-8-oracle/bin/:/home/anaconda/bin/:/home/jenkins/gems/bin:/usr/local/go/bin:/home/jenkins/go-projects/bin:/home/jenkins/anaconda2/bin:/usr/local/sbin:/usr/local/bin:/usr/sbin:/usr/bin:/sbin:/bin:/usr/games:/usr/local/games
+ PATH=/usr/lib/jvm/java-8-oracle/bin/:/usr/lib/jvm/java-8-oracle/bin/:/home/anaconda/bin/:/home/jenkins/gems/bin:/usr/local/go/bin:/home/jenkins/go-projects/bin:/home/jenkins/anaconda2/bin:/usr/local/sbin:/usr/local/bin:/usr/sbin:/usr/bin:/sbin:/bin:/usr/games:/usr/local/games
export MAVEN_OPTS="-Xmx1536m -XX:MaxPermSize=1g -Dfile.encoding=utf-8"
+ export 'MAVEN_OPTS=-Xmx1536m -XX:MaxPermSize=1g -Dfile.encoding=utf-8'
+ MAVEN_OPTS='-Xmx1536m -XX:MaxPermSize=1g -Dfile.encoding=utf-8'
DIR=$( cd $( dirname ${BASH_SOURCE[0]} ) && pwd )
 cd $( dirname ${BASH_SOURCE[0]} ) && pwd 
 dirname ${BASH_SOURCE[0]} 
+++ dirname /home/jenkins/workspace/ADAM-prb/HADOOP_VERSION/2.7.5/SCALAVER/2.11/SPARK_VERSION/2.4.4/label/ubuntu/scripts/jenkins-test
++ cd /home/jenkins/workspace/ADAM-prb/HADOOP_VERSION/2.7.5/SCALAVER/2.11/SPARK_VERSION/2.4.4/label/ubuntu/scripts
++ pwd
+ DIR=/home/jenkins/workspace/ADAM-prb/HADOOP_VERSION/2.7.5/SCALAVER/2.11/SPARK_VERSION/2.4.4/label/ubuntu/scripts
PROJECT_ROOT=${DIR}/..
+ PROJECT_ROOT=/home/jenkins/workspace/ADAM-prb/HADOOP_VERSION/2.7.5/SCALAVER/2.11/SPARK_VERSION/2.4.4/label/ubuntu/scripts/..
VERSION=$(grep "<version>" ${PROJECT_ROOT}/pom.xml  | head -2 | tail -1 | sed 's/ *<version>//g' | sed 's/<\/version>//g')
grep "<version>" ${PROJECT_ROOT}/pom.xml  | head -2 | tail -1 | sed 's/ *<version>//g' | sed 's/<\/version>//g'
++ grep '<version>' /home/jenkins/workspace/ADAM-prb/HADOOP_VERSION/2.7.5/SCALAVER/2.11/SPARK_VERSION/2.4.4/label/ubuntu/scripts/../pom.xml
++ head -2
++ tail -1
++ sed 's/ *<version>//g'
++ sed 's/<\/version>//g'
+ VERSION=0.30.0-SNAPSHOT

# is the hadoop version set?
if ! [[ ${HADOOP_VERSION} ]];
then
    echo "HADOOP_VERSION environment variable is not set."
    echo "Please set this variable before running."
    
    exit 1
fi
+ [[ -n 2.7.5 ]]

# is the spark version set?
if ! [[ ${SPARK_VERSION} ]];
then
    echo "SPARK_VERSION environment variable is not set."
    echo "Please set this variable before running."
    
    exit 1
fi
+ [[ -n 2.4.4 ]]

set -e
+ set -e

# build defaults to Scala 2.11
if [ ${SCALAVER} == 2.11 ];
then
    # shouldn't be able to move to scala 2.11 twice
    set +e
    ./scripts/move_to_scala_2.11.sh
    if [[ $? == 0 ]];
    then
        echo "We have already moved to Scala 2.11, so running move_to_scala_2.11.sh a second time should fail, but error code was 0 (success)."
        exit 1
    fi
    set -e
fi
+ '[' 2.11 == 2.11 ']'
+ set +e
+ ./scripts/move_to_scala_2.11.sh
Scala version is already set to 2.11 (Scala artifacts have _2.11 version suffix in artifact name).
Cowardly refusing to move to Scala 2.11 a second time...
+ [[ 1 == 0 ]]
+ set -e

# move to Scala 2.12 if requested
if [ ${SCALAVER} == 2.12 ];
then
    set +e
    ./scripts/move_to_scala_2.12.sh
    set -e
fi
+ '[' 2.11 == 2.12 ']'

# print versions
echo "Testing ADAM version ${VERSION} on Spark ${SPARK_VERSION} and Hadoop ${HADOOP_VERSION}"
+ echo 'Testing ADAM version 0.30.0-SNAPSHOT on Spark 2.4.4 and Hadoop 2.7.5'
Testing ADAM version 0.30.0-SNAPSHOT on Spark 2.4.4 and Hadoop 2.7.5

# first, build the sources, run the unit tests, and generate a coverage report
mvn clean \
    -Dhadoop.version=${HADOOP_VERSION}
+ mvn clean -Dhadoop.version=2.7.5
OpenJDK 64-Bit Server VM warning: ignoring option MaxPermSize=1g; support was removed in 8.0
[INFO] Scanning for projects...
[INFO] ------------------------------------------------------------------------
[INFO] Reactor Build Order:
[INFO] 
[INFO] ADAM_2.11
[INFO] ADAM_2.11: Shader workaround
[INFO] ADAM_2.11: Avro-to-Dataset codegen utils
[INFO] ADAM_2.11: Core
[INFO] ADAM_2.11: APIs for Java, Python
[INFO] ADAM_2.11: CLI
[INFO] ADAM_2.11: Assembly
[INFO]                                                                         
[INFO] ------------------------------------------------------------------------
[INFO] Building ADAM_2.11 0.30.0-SNAPSHOT
[INFO] ------------------------------------------------------------------------
[INFO] 
[INFO] --- maven-clean-plugin:3.1.0:clean (default-clean) @ adam-parent-spark2_2.11 ---
[INFO]                                                                         
[INFO] ------------------------------------------------------------------------
[INFO] Building ADAM_2.11: Shader workaround 0.30.0-SNAPSHOT
[INFO] ------------------------------------------------------------------------
[INFO] 
[INFO] --- maven-clean-plugin:3.1.0:clean (default-clean) @ adam-shade-spark2_2.11 ---
[INFO]                                                                         
[INFO] ------------------------------------------------------------------------
[INFO] Building ADAM_2.11: Avro-to-Dataset codegen utils 0.30.0-SNAPSHOT
[INFO] ------------------------------------------------------------------------
[INFO] 
[INFO] --- maven-clean-plugin:3.1.0:clean (default-clean) @ adam-codegen-spark2_2.11 ---
[INFO]                                                                         
[INFO] ------------------------------------------------------------------------
[INFO] Building ADAM_2.11: Core 0.30.0-SNAPSHOT
[INFO] ------------------------------------------------------------------------
[INFO] 
[INFO] --- maven-clean-plugin:3.1.0:clean (default-clean) @ adam-core-spark2_2.11 ---
[INFO]                                                                         
[INFO] ------------------------------------------------------------------------
[INFO] Building ADAM_2.11: APIs for Java, Python 0.30.0-SNAPSHOT
[INFO] ------------------------------------------------------------------------
[INFO] 
[INFO] --- maven-clean-plugin:3.1.0:clean (default-clean) @ adam-apis-spark2_2.11 ---
[INFO]                                                                         
[INFO] ------------------------------------------------------------------------
[INFO] Building ADAM_2.11: CLI 0.30.0-SNAPSHOT
[INFO] ------------------------------------------------------------------------
[INFO] 
[INFO] --- maven-clean-plugin:3.1.0:clean (default-clean) @ adam-cli-spark2_2.11 ---
[INFO]                                                                         
[INFO] ------------------------------------------------------------------------
[INFO] Building ADAM_2.11: Assembly 0.30.0-SNAPSHOT
[INFO] ------------------------------------------------------------------------
[INFO] 
[INFO] --- maven-clean-plugin:3.1.0:clean (default-clean) @ adam-assembly-spark2_2.11 ---
[INFO] ------------------------------------------------------------------------
[INFO] Reactor Summary:
[INFO] 
[INFO] ADAM_2.11 .......................................... SUCCESS [  0.181 s]
[INFO] ADAM_2.11: Shader workaround ....................... SUCCESS [  0.008 s]
[INFO] ADAM_2.11: Avro-to-Dataset codegen utils ........... SUCCESS [  0.007 s]
[INFO] ADAM_2.11: Core .................................... SUCCESS [  0.010 s]
[INFO] ADAM_2.11: APIs for Java, Python ................... SUCCESS [  0.001 s]
[INFO] ADAM_2.11: CLI ..................................... SUCCESS [  0.021 s]
[INFO] ADAM_2.11: Assembly ................................ SUCCESS [  0.001 s]
[INFO] ------------------------------------------------------------------------
[INFO] BUILD SUCCESS
[INFO] ------------------------------------------------------------------------
[INFO] Total time: 0.442 s
[INFO] Finished at: 2019-09-27T11:11:49-07:00
[INFO] Final Memory: 23M/1472M
[INFO] ------------------------------------------------------------------------
    
# if this is a pull request, we need to set the coveralls pr id
if [[ ! -z $ghprbPullId ]];
then
    COVERALLS_PRB_OPTION="-DpullRequest=${ghprbPullId}"
fi
+ [[ ! -z 2217 ]]
+ COVERALLS_PRB_OPTION=-DpullRequest=2217

# coveralls token should not be visible
set +x +v
+ set +x +v
OpenJDK 64-Bit Server VM warning: ignoring option MaxPermSize=1g; support was removed in 8.0
[INFO] Scanning for projects...
[INFO] ------------------------------------------------------------------------
[INFO] Reactor Build Order:
[INFO] 
[INFO] ADAM_2.11
[INFO] ADAM_2.11: Shader workaround
[INFO] ADAM_2.11: Avro-to-Dataset codegen utils
[INFO] ADAM_2.11: Core
[INFO] ADAM_2.11: APIs for Java, Python
[INFO] ADAM_2.11: CLI
[INFO] ADAM_2.11: Assembly
[INFO]                                                                         
[INFO] ------------------------------------------------------------------------
[INFO] Building ADAM_2.11 0.30.0-SNAPSHOT
[INFO] ------------------------------------------------------------------------
[INFO] 
[INFO] --- maven-enforcer-plugin:1.0:enforce (enforce-versions) @ adam-parent-spark2_2.11 ---
[INFO] 
[INFO] --- maven-enforcer-plugin:1.0:enforce (enforce-maven) @ adam-parent-spark2_2.11 ---
[INFO] 
[INFO] --- scalariform-maven-plugin:0.1.4:format (default-cli) @ adam-parent-spark2_2.11 ---
[INFO] Modified 0 of 241 .scala files
[INFO] 
[INFO] --- scala-maven-plugin:3.2.2:compile (scala-compile-first) @ adam-parent-spark2_2.11 ---
[INFO] No sources to compile
[INFO] 
[INFO] --- scala-maven-plugin:3.2.2:testCompile (scala-test-compile-first) @ adam-parent-spark2_2.11 ---
[INFO] No sources to compile
[INFO] 
[INFO] >>> scoverage-maven-plugin:1.1.1:report (default-cli) > [scoverage]test @ adam-parent-spark2_2.11 >>>
[INFO] 
[INFO] --- maven-enforcer-plugin:1.0:enforce (enforce-versions) @ adam-parent-spark2_2.11 ---
[INFO] 
[INFO] --- maven-enforcer-plugin:1.0:enforce (enforce-maven) @ adam-parent-spark2_2.11 ---
[INFO] 
[INFO] --- scalariform-maven-plugin:0.1.4:format (default-cli) @ adam-parent-spark2_2.11 ---
[INFO] Modified 0 of 241 .scala files
[INFO] 
[INFO] --- scoverage-maven-plugin:1.1.1:pre-compile (default-cli) @ adam-parent-spark2_2.11 ---
[INFO] Skipping SCoverage execution for project with packaging type 'pom'
[INFO] 
[INFO] --- scala-maven-plugin:3.2.2:compile (scala-compile-first) @ adam-parent-spark2_2.11 ---
[INFO] No sources to compile
[INFO] 
[INFO] --- scoverage-maven-plugin:1.1.1:post-compile (default-cli) @ adam-parent-spark2_2.11 ---
[INFO] 
[INFO] --- scala-maven-plugin:3.2.2:testCompile (scala-test-compile-first) @ adam-parent-spark2_2.11 ---
[INFO] No sources to compile
[INFO] 
[INFO] <<< scoverage-maven-plugin:1.1.1:report (default-cli) < [scoverage]test @ adam-parent-spark2_2.11 <<<
[INFO] 
[INFO] --- scoverage-maven-plugin:1.1.1:report (default-cli) @ adam-parent-spark2_2.11 ---
[INFO]                                                                         
[INFO] ------------------------------------------------------------------------
[INFO] Building ADAM_2.11: Shader workaround 0.30.0-SNAPSHOT
[INFO] ------------------------------------------------------------------------
[INFO] 
[INFO] --- maven-enforcer-plugin:1.0:enforce (enforce-versions) @ adam-shade-spark2_2.11 ---
[INFO] 
[INFO] --- maven-enforcer-plugin:1.0:enforce (enforce-maven) @ adam-shade-spark2_2.11 ---
[INFO] 
[INFO] --- scalariform-maven-plugin:0.1.4:format (default-cli) @ adam-shade-spark2_2.11 ---
[INFO] Modified 0 of 0 .scala files
[INFO] 
[INFO] --- maven-resources-plugin:3.1.0:resources (default-resources) @ adam-shade-spark2_2.11 ---
[INFO] Using 'UTF-8' encoding to copy filtered resources.
[INFO] skip non existing resourceDirectory /home/jenkins/workspace/ADAM-prb/HADOOP_VERSION/2.7.5/SCALAVER/2.11/SPARK_VERSION/2.4.4/label/ubuntu/adam-shade/src/main/resources
[INFO] 
[INFO] --- scala-maven-plugin:3.2.2:compile (scala-compile-first) @ adam-shade-spark2_2.11 ---
[INFO] /home/jenkins/workspace/ADAM-prb/HADOOP_VERSION/2.7.5/SCALAVER/2.11/SPARK_VERSION/2.4.4/label/ubuntu/adam-shade/src/main/java:-1: info: compiling
[INFO] Compiling 1 source files to /home/jenkins/workspace/ADAM-prb/HADOOP_VERSION/2.7.5/SCALAVER/2.11/SPARK_VERSION/2.4.4/label/ubuntu/adam-shade/target/2.11.12/classes at 1569607922315
[INFO] prepare-compile in 0 s
[INFO] compile in 1 s
[INFO] 
[INFO] --- maven-compiler-plugin:3.8.0:compile (default-compile) @ adam-shade-spark2_2.11 ---
[INFO] Changes detected - recompiling the module!
[INFO] Compiling 1 source file to /home/jenkins/workspace/ADAM-prb/HADOOP_VERSION/2.7.5/SCALAVER/2.11/SPARK_VERSION/2.4.4/label/ubuntu/adam-shade/target/2.11.12/classes
[INFO] 
[INFO] --- plexus-component-metadata:1.5.5:generate-metadata (default) @ adam-shade-spark2_2.11 ---
[INFO] Discovered 1 component descriptors(s)
[INFO] 
[INFO] --- maven-resources-plugin:3.1.0:testResources (default-testResources) @ adam-shade-spark2_2.11 ---
[INFO] Using 'UTF-8' encoding to copy filtered resources.
[INFO] skip non existing resourceDirectory /home/jenkins/workspace/ADAM-prb/HADOOP_VERSION/2.7.5/SCALAVER/2.11/SPARK_VERSION/2.4.4/label/ubuntu/adam-shade/src/test/resources
[INFO] 
[INFO] --- scala-maven-plugin:3.2.2:testCompile (scala-test-compile-first) @ adam-shade-spark2_2.11 ---
[INFO] No sources to compile
[INFO] 
[INFO] --- maven-compiler-plugin:3.8.0:testCompile (default-testCompile) @ adam-shade-spark2_2.11 ---
[INFO] No sources to compile
[INFO] 
[INFO] --- maven-surefire-plugin:3.0.0-M3:test (default-test) @ adam-shade-spark2_2.11 ---
[INFO] No tests to run.
[INFO] 
[INFO] >>> scoverage-maven-plugin:1.1.1:report (default-cli) > [scoverage]test @ adam-shade-spark2_2.11 >>>
[INFO] 
[INFO] --- maven-enforcer-plugin:1.0:enforce (enforce-versions) @ adam-shade-spark2_2.11 ---
[INFO] 
[INFO] --- maven-enforcer-plugin:1.0:enforce (enforce-maven) @ adam-shade-spark2_2.11 ---
[INFO] 
[INFO] --- scalariform-maven-plugin:0.1.4:format (default-cli) @ adam-shade-spark2_2.11 ---
[INFO] Modified 0 of 0 .scala files
[INFO] 
[INFO] --- scoverage-maven-plugin:1.1.1:pre-compile (default-cli) @ adam-shade-spark2_2.11 ---
[INFO] 
[INFO] --- maven-resources-plugin:3.1.0:resources (default-resources) @ adam-shade-spark2_2.11 ---
[INFO] Using 'UTF-8' encoding to copy filtered resources.
[INFO] skip non existing resourceDirectory /home/jenkins/workspace/ADAM-prb/HADOOP_VERSION/2.7.5/SCALAVER/2.11/SPARK_VERSION/2.4.4/label/ubuntu/adam-shade/src/main/resources
[INFO] 
[INFO] --- scala-maven-plugin:3.2.2:compile (scala-compile-first) @ adam-shade-spark2_2.11 ---
[INFO] /home/jenkins/workspace/ADAM-prb/HADOOP_VERSION/2.7.5/SCALAVER/2.11/SPARK_VERSION/2.4.4/label/ubuntu/adam-shade/src/main/java:-1: info: compiling
[INFO] /home/jenkins/workspace/ADAM-prb/HADOOP_VERSION/2.7.5/SCALAVER/2.11/SPARK_VERSION/2.4.4/label/ubuntu/adam-shade/target/generated-sources/annotations:-1: info: compiling
[INFO] Compiling 1 source files to /home/jenkins/workspace/ADAM-prb/HADOOP_VERSION/2.7.5/SCALAVER/2.11/SPARK_VERSION/2.4.4/label/ubuntu/adam-shade/target/2.11.12/scoverage-classes at 1569607924736
[INFO] [info] Cleaning datadir [/home/jenkins/workspace/ADAM-prb/HADOOP_VERSION/2.7.5/SCALAVER/2.11/SPARK_VERSION/2.4.4/label/ubuntu/adam-shade/target/scoverage-data]
[INFO] [info] Beginning coverage instrumentation
[INFO] [info] Instrumentation completed [0 statements]
[INFO] [info] Wrote instrumentation file [/home/jenkins/workspace/ADAM-prb/HADOOP_VERSION/2.7.5/SCALAVER/2.11/SPARK_VERSION/2.4.4/label/ubuntu/adam-shade/target/scoverage-data/scoverage.coverage.xml]
[INFO] [info] Will write measurement data to [/home/jenkins/workspace/ADAM-prb/HADOOP_VERSION/2.7.5/SCALAVER/2.11/SPARK_VERSION/2.4.4/label/ubuntu/adam-shade/target/scoverage-data]
[INFO] prepare-compile in 0 s
[INFO] compile in 1 s
[INFO] 
[INFO] --- maven-compiler-plugin:3.8.0:compile (default-compile) @ adam-shade-spark2_2.11 ---
[INFO] Changes detected - recompiling the module!
[INFO] Compiling 1 source file to /home/jenkins/workspace/ADAM-prb/HADOOP_VERSION/2.7.5/SCALAVER/2.11/SPARK_VERSION/2.4.4/label/ubuntu/adam-shade/target/2.11.12/scoverage-classes
[INFO] 
[INFO] --- plexus-component-metadata:1.5.5:generate-metadata (default) @ adam-shade-spark2_2.11 ---
[INFO] Discovered 1 component descriptors(s)
[INFO] 
[INFO] --- scoverage-maven-plugin:1.1.1:post-compile (default-cli) @ adam-shade-spark2_2.11 ---
[INFO] 
[INFO] --- maven-resources-plugin:3.1.0:testResources (default-testResources) @ adam-shade-spark2_2.11 ---
[INFO] Using 'UTF-8' encoding to copy filtered resources.
[INFO] skip non existing resourceDirectory /home/jenkins/workspace/ADAM-prb/HADOOP_VERSION/2.7.5/SCALAVER/2.11/SPARK_VERSION/2.4.4/label/ubuntu/adam-shade/src/test/resources
[INFO] 
[INFO] --- scala-maven-plugin:3.2.2:testCompile (scala-test-compile-first) @ adam-shade-spark2_2.11 ---
[INFO] No sources to compile
[INFO] 
[INFO] --- maven-compiler-plugin:3.8.0:testCompile (default-testCompile) @ adam-shade-spark2_2.11 ---
[INFO] No sources to compile
[INFO] 
[INFO] --- maven-surefire-plugin:3.0.0-M3:test (default-test) @ adam-shade-spark2_2.11 ---
[INFO] No tests to run.
[INFO] 
[INFO] <<< scoverage-maven-plugin:1.1.1:report (default-cli) < [scoverage]test @ adam-shade-spark2_2.11 <<<
[INFO] 
[INFO] --- scoverage-maven-plugin:1.1.1:report (default-cli) @ adam-shade-spark2_2.11 ---
[INFO] [scoverage] Generating cobertura XML report...
[INFO] [scoverage] Generating scoverage XML report...
[INFO] [scoverage] Generating scoverage HTML report...
[INFO]                                                                         
[INFO] ------------------------------------------------------------------------
[INFO] Building ADAM_2.11: Avro-to-Dataset codegen utils 0.30.0-SNAPSHOT
[INFO] ------------------------------------------------------------------------
[INFO] 
[INFO] --- maven-enforcer-plugin:1.0:enforce (enforce-versions) @ adam-codegen-spark2_2.11 ---
[INFO] 
[INFO] --- maven-enforcer-plugin:1.0:enforce (enforce-maven) @ adam-codegen-spark2_2.11 ---
[INFO] 
[INFO] --- build-helper-maven-plugin:3.0.0:add-source (add-source) @ adam-codegen-spark2_2.11 ---
[INFO] Source directory: /home/jenkins/workspace/ADAM-prb/HADOOP_VERSION/2.7.5/SCALAVER/2.11/SPARK_VERSION/2.4.4/label/ubuntu/adam-codegen/src/main/scala added.
[INFO] 
[INFO] --- scalariform-maven-plugin:0.1.4:format (default-cli) @ adam-codegen-spark2_2.11 ---
[INFO] Modified 0 of 4 .scala files
[INFO] 
[INFO] --- maven-resources-plugin:3.1.0:resources (default-resources) @ adam-codegen-spark2_2.11 ---
[INFO] Using 'UTF-8' encoding to copy filtered resources.
[INFO] skip non existing resourceDirectory /home/jenkins/workspace/ADAM-prb/HADOOP_VERSION/2.7.5/SCALAVER/2.11/SPARK_VERSION/2.4.4/label/ubuntu/adam-codegen/src/main/resources
[INFO] 
[INFO] --- scala-maven-plugin:3.2.2:compile (scala-compile-first) @ adam-codegen-spark2_2.11 ---
[INFO] /home/jenkins/workspace/ADAM-prb/HADOOP_VERSION/2.7.5/SCALAVER/2.11/SPARK_VERSION/2.4.4/label/ubuntu/adam-codegen/src/main/scala:-1: info: compiling
[INFO] Compiling 4 source files to /home/jenkins/workspace/ADAM-prb/HADOOP_VERSION/2.7.5/SCALAVER/2.11/SPARK_VERSION/2.4.4/label/ubuntu/adam-codegen/target/2.11.12/classes at 1569607926714
[INFO] prepare-compile in 0 s
[INFO] compile in 3 s
[INFO] 
[INFO] --- maven-compiler-plugin:3.8.0:compile (default-compile) @ adam-codegen-spark2_2.11 ---
[INFO] Nothing to compile - all classes are up to date
[INFO] 
[INFO] --- build-helper-maven-plugin:3.0.0:add-test-source (add-test-source) @ adam-codegen-spark2_2.11 ---
[INFO] Test Source directory: /home/jenkins/workspace/ADAM-prb/HADOOP_VERSION/2.7.5/SCALAVER/2.11/SPARK_VERSION/2.4.4/label/ubuntu/adam-codegen/src/test/scala added.
[INFO] 
[INFO] --- maven-resources-plugin:3.1.0:testResources (default-testResources) @ adam-codegen-spark2_2.11 ---
[INFO] Using 'UTF-8' encoding to copy filtered resources.
[INFO] skip non existing resourceDirectory /home/jenkins/workspace/ADAM-prb/HADOOP_VERSION/2.7.5/SCALAVER/2.11/SPARK_VERSION/2.4.4/label/ubuntu/adam-codegen/src/test/resources
[INFO] 
[INFO] --- scala-maven-plugin:3.2.2:testCompile (scala-test-compile-first) @ adam-codegen-spark2_2.11 ---
[INFO] No sources to compile
[INFO] 
[INFO] --- maven-compiler-plugin:3.8.0:testCompile (default-testCompile) @ adam-codegen-spark2_2.11 ---
[INFO] No sources to compile
[INFO] 
[INFO] --- maven-surefire-plugin:3.0.0-M3:test (default-test) @ adam-codegen-spark2_2.11 ---
[INFO] Tests are skipped.
[INFO] 
[INFO] --- scalatest-maven-plugin:2.0.0:test (test) @ adam-codegen-spark2_2.11 ---
Discovery starting.
Discovery completed in 55 milliseconds.
Run starting. Expected test count is: 0
DiscoverySuite:
Run completed in 81 milliseconds.
Total number of tests run: 0
Suites: completed 1, aborted 0
Tests: succeeded 0, failed 0, canceled 0, ignored 0, pending 0
No tests were executed.
[INFO] 
[INFO] >>> scoverage-maven-plugin:1.1.1:report (default-cli) > [scoverage]test @ adam-codegen-spark2_2.11 >>>
[INFO] 
[INFO] --- maven-enforcer-plugin:1.0:enforce (enforce-versions) @ adam-codegen-spark2_2.11 ---
[INFO] 
[INFO] --- maven-enforcer-plugin:1.0:enforce (enforce-maven) @ adam-codegen-spark2_2.11 ---
[INFO] 
[INFO] --- build-helper-maven-plugin:3.0.0:add-source (add-source) @ adam-codegen-spark2_2.11 ---
[INFO] Source directory: /home/jenkins/workspace/ADAM-prb/HADOOP_VERSION/2.7.5/SCALAVER/2.11/SPARK_VERSION/2.4.4/label/ubuntu/adam-codegen/src/main/scala added.
[INFO] 
[INFO] --- scalariform-maven-plugin:0.1.4:format (default-cli) @ adam-codegen-spark2_2.11 ---
[INFO] Modified 0 of 4 .scala files
[INFO] 
[INFO] --- scoverage-maven-plugin:1.1.1:pre-compile (default-cli) @ adam-codegen-spark2_2.11 ---
[INFO] 
[INFO] --- maven-resources-plugin:3.1.0:resources (default-resources) @ adam-codegen-spark2_2.11 ---
[INFO] Using 'UTF-8' encoding to copy filtered resources.
[INFO] skip non existing resourceDirectory /home/jenkins/workspace/ADAM-prb/HADOOP_VERSION/2.7.5/SCALAVER/2.11/SPARK_VERSION/2.4.4/label/ubuntu/adam-codegen/src/main/resources
[INFO] 
[INFO] --- scala-maven-plugin:3.2.2:compile (scala-compile-first) @ adam-codegen-spark2_2.11 ---
[INFO] /home/jenkins/workspace/ADAM-prb/HADOOP_VERSION/2.7.5/SCALAVER/2.11/SPARK_VERSION/2.4.4/label/ubuntu/adam-codegen/src/main/scala:-1: info: compiling
[INFO] Compiling 4 source files to /home/jenkins/workspace/ADAM-prb/HADOOP_VERSION/2.7.5/SCALAVER/2.11/SPARK_VERSION/2.4.4/label/ubuntu/adam-codegen/target/2.11.12/scoverage-classes at 1569607931102
[INFO] [info] Cleaning datadir [/home/jenkins/workspace/ADAM-prb/HADOOP_VERSION/2.7.5/SCALAVER/2.11/SPARK_VERSION/2.4.4/label/ubuntu/adam-codegen/target/scoverage-data]
[INFO] [info] Beginning coverage instrumentation
[INFO] [info] Instrumentation completed [0 statements]
[INFO] [info] Wrote instrumentation file [/home/jenkins/workspace/ADAM-prb/HADOOP_VERSION/2.7.5/SCALAVER/2.11/SPARK_VERSION/2.4.4/label/ubuntu/adam-codegen/target/scoverage-data/scoverage.coverage.xml]
[INFO] [info] Will write measurement data to [/home/jenkins/workspace/ADAM-prb/HADOOP_VERSION/2.7.5/SCALAVER/2.11/SPARK_VERSION/2.4.4/label/ubuntu/adam-codegen/target/scoverage-data]
[INFO] prepare-compile in 0 s
[INFO] compile in 3 s
[INFO] 
[INFO] --- maven-compiler-plugin:3.8.0:compile (default-compile) @ adam-codegen-spark2_2.11 ---
[INFO] Nothing to compile - all classes are up to date
[INFO] 
[INFO] --- scoverage-maven-plugin:1.1.1:post-compile (default-cli) @ adam-codegen-spark2_2.11 ---
[INFO] 
[INFO] --- build-helper-maven-plugin:3.0.0:add-test-source (add-test-source) @ adam-codegen-spark2_2.11 ---
[INFO] Test Source directory: /home/jenkins/workspace/ADAM-prb/HADOOP_VERSION/2.7.5/SCALAVER/2.11/SPARK_VERSION/2.4.4/label/ubuntu/adam-codegen/src/test/scala added.
[INFO] 
[INFO] --- maven-resources-plugin:3.1.0:testResources (default-testResources) @ adam-codegen-spark2_2.11 ---
[INFO] Using 'UTF-8' encoding to copy filtered resources.
[INFO] skip non existing resourceDirectory /home/jenkins/workspace/ADAM-prb/HADOOP_VERSION/2.7.5/SCALAVER/2.11/SPARK_VERSION/2.4.4/label/ubuntu/adam-codegen/src/test/resources
[INFO] 
[INFO] --- scala-maven-plugin:3.2.2:testCompile (scala-test-compile-first) @ adam-codegen-spark2_2.11 ---
[INFO] No sources to compile
[INFO] 
[INFO] --- maven-compiler-plugin:3.8.0:testCompile (default-testCompile) @ adam-codegen-spark2_2.11 ---
[INFO] No sources to compile
[INFO] 
[INFO] --- maven-surefire-plugin:3.0.0-M3:test (default-test) @ adam-codegen-spark2_2.11 ---
[INFO] Tests are skipped.
[INFO] 
[INFO] --- scalatest-maven-plugin:2.0.0:test (test) @ adam-codegen-spark2_2.11 ---
Discovery starting.
Discovery completed in 55 milliseconds.
Run starting. Expected test count is: 0
DiscoverySuite:
Run completed in 81 milliseconds.
Total number of tests run: 0
Suites: completed 1, aborted 0
Tests: succeeded 0, failed 0, canceled 0, ignored 0, pending 0
No tests were executed.
[INFO] 
[INFO] <<< scoverage-maven-plugin:1.1.1:report (default-cli) < [scoverage]test @ adam-codegen-spark2_2.11 <<<
[INFO] 
[INFO] --- scoverage-maven-plugin:1.1.1:report (default-cli) @ adam-codegen-spark2_2.11 ---
[INFO] [scoverage] Generating cobertura XML report...
[INFO] [scoverage] Generating scoverage XML report...
[INFO] [scoverage] Generating scoverage HTML report...
[INFO]                                                                         
[INFO] ------------------------------------------------------------------------
[INFO] Building ADAM_2.11: Core 0.30.0-SNAPSHOT
[INFO] ------------------------------------------------------------------------
[INFO] 
[INFO] --- maven-enforcer-plugin:1.0:enforce (enforce-versions) @ adam-core-spark2_2.11 ---
[INFO] 
[INFO] --- maven-enforcer-plugin:1.0:enforce (enforce-maven) @ adam-core-spark2_2.11 ---
[INFO] 
[INFO] --- build-helper-maven-plugin:3.0.0:add-source (add-source) @ adam-core-spark2_2.11 ---
[INFO] Source directory: /home/jenkins/workspace/ADAM-prb/HADOOP_VERSION/2.7.5/SCALAVER/2.11/SPARK_VERSION/2.4.4/label/ubuntu/adam-core/src/main/scala added.
[INFO] Source directory: /home/jenkins/workspace/ADAM-prb/HADOOP_VERSION/2.7.5/SCALAVER/2.11/SPARK_VERSION/2.4.4/label/ubuntu/adam-core/target/generated-sources/src/main/scala added.
[INFO] 
[INFO] --- exec-maven-plugin:1.5.0:java (generate-scala-products) @ adam-core-spark2_2.11 ---
SLF4J: Failed to load class "org.slf4j.impl.StaticLoggerBinder".
SLF4J: Defaulting to no-operation (NOP) logger implementation
SLF4J: See http://www.slf4j.org/codes.html#StaticLoggerBinder for further details.
[INFO] 
[INFO] --- exec-maven-plugin:1.5.0:java (generate-scala-projection-fields) @ adam-core-spark2_2.11 ---
SLF4J: Failed to load class "org.slf4j.impl.StaticLoggerBinder".
SLF4J: Defaulting to no-operation (NOP) logger implementation
SLF4J: See http://www.slf4j.org/codes.html#StaticLoggerBinder for further details.
[INFO] 
[INFO] --- scalariform-maven-plugin:0.1.4:format (default-cli) @ adam-core-spark2_2.11 ---
[INFO] Modified 2 of 203 .scala files
[INFO] 
[INFO] --- maven-resources-plugin:3.1.0:resources (default-resources) @ adam-core-spark2_2.11 ---
[INFO] Using 'UTF-8' encoding to copy filtered resources.
[INFO] skip non existing resourceDirectory /home/jenkins/workspace/ADAM-prb/HADOOP_VERSION/2.7.5/SCALAVER/2.11/SPARK_VERSION/2.4.4/label/ubuntu/adam-core/src/main/resources
[INFO] 
[INFO] --- scala-maven-plugin:3.2.2:compile (scala-compile-first) @ adam-core-spark2_2.11 ---
[INFO] /home/jenkins/workspace/ADAM-prb/HADOOP_VERSION/2.7.5/SCALAVER/2.11/SPARK_VERSION/2.4.4/label/ubuntu/adam-core/src/main/java:-1: info: compiling
[INFO] /home/jenkins/workspace/ADAM-prb/HADOOP_VERSION/2.7.5/SCALAVER/2.11/SPARK_VERSION/2.4.4/label/ubuntu/adam-core/src/main/scala:-1: info: compiling
[INFO] /home/jenkins/workspace/ADAM-prb/HADOOP_VERSION/2.7.5/SCALAVER/2.11/SPARK_VERSION/2.4.4/label/ubuntu/adam-core/target/generated-sources/src/main/scala:-1: info: compiling
[INFO] Compiling 139 source files to /home/jenkins/workspace/ADAM-prb/HADOOP_VERSION/2.7.5/SCALAVER/2.11/SPARK_VERSION/2.4.4/label/ubuntu/adam-core/target/2.11.12/classes at 1569607941956
[WARNING] /home/jenkins/workspace/ADAM-prb/HADOOP_VERSION/2.7.5/SCALAVER/2.11/SPARK_VERSION/2.4.4/label/ubuntu/adam-core/src/main/scala/org/bdgenomics/adam/rdd/GenomicDataset.scala:3099: warning: no valid targets for annotation on value uTag - it is discarded unused. You may specify targets with meta-annotations, e.g. @(transient @getter)
[WARNING]   @transient val uTag: TypeTag[U]
[WARNING]    ^
[WARNING] warning: there were 89 deprecation warnings; re-run with -deprecation for details
[WARNING] warning: there were 5 feature warnings; re-run with -feature for details
[WARNING] three warnings found
[INFO] prepare-compile in 0 s
[INFO] compile in 27 s
[INFO] 
[INFO] --- maven-compiler-plugin:3.8.0:compile (default-compile) @ adam-core-spark2_2.11 ---
[INFO] Changes detected - recompiling the module!
[INFO] Compiling 6 source files to /home/jenkins/workspace/ADAM-prb/HADOOP_VERSION/2.7.5/SCALAVER/2.11/SPARK_VERSION/2.4.4/label/ubuntu/adam-core/target/2.11.12/classes
[INFO] 
[INFO] --- build-helper-maven-plugin:3.0.0:add-test-source (add-test-source) @ adam-core-spark2_2.11 ---
[INFO] Test Source directory: /home/jenkins/workspace/ADAM-prb/HADOOP_VERSION/2.7.5/SCALAVER/2.11/SPARK_VERSION/2.4.4/label/ubuntu/adam-core/src/test/scala added.
[INFO] 
[INFO] --- maven-resources-plugin:3.1.0:testResources (default-testResources) @ adam-core-spark2_2.11 ---
[INFO] Using 'UTF-8' encoding to copy filtered resources.
[INFO] Copying 152 resources
[INFO] 
[INFO] --- scala-maven-plugin:3.2.2:testCompile (scala-test-compile-first) @ adam-core-spark2_2.11 ---
[INFO] /home/jenkins/workspace/ADAM-prb/HADOOP_VERSION/2.7.5/SCALAVER/2.11/SPARK_VERSION/2.4.4/label/ubuntu/adam-core/src/test/scala:-1: info: compiling
[INFO] Compiling 70 source files to /home/jenkins/workspace/ADAM-prb/HADOOP_VERSION/2.7.5/SCALAVER/2.11/SPARK_VERSION/2.4.4/label/ubuntu/adam-core/target/2.11.12/test-classes at 1569607971789
[ERROR] /home/jenkins/workspace/ADAM-prb/HADOOP_VERSION/2.7.5/SCALAVER/2.11/SPARK_VERSION/2.4.4/label/ubuntu/adam-core/src/test/scala/org/bdgenomics/adam/converters/AlignmentConverterSuite.scala:31: error: object Alignment is not a member of package org.bdgenomics.formats.avro
[ERROR] import org.bdgenomics.formats.avro.{
[ERROR]        ^
[ERROR] /home/jenkins/workspace/ADAM-prb/HADOOP_VERSION/2.7.5/SCALAVER/2.11/SPARK_VERSION/2.4.4/label/ubuntu/adam-core/src/test/scala/org/bdgenomics/adam/converters/AlignmentConverterSuite.scala:41: error: not found: type AlignmentConverter
[ERROR]   val adamRecordConverter = new AlignmentConverter
[ERROR]                                 ^
[ERROR] /home/jenkins/workspace/ADAM-prb/HADOOP_VERSION/2.7.5/SCALAVER/2.11/SPARK_VERSION/2.4.4/label/ubuntu/adam-core/src/test/scala/org/bdgenomics/adam/converters/AlignmentConverterSuite.scala:43: error: not found: type Alignment
[ERROR]   def makeRead(start: Long, cigar: String, mdtag: String, length: Int, id: Int = 0, nullQuality: Boolean = false): Alignment = {
[ERROR]                                                                                                                    ^
[ERROR] /home/jenkins/workspace/ADAM-prb/HADOOP_VERSION/2.7.5/SCALAVER/2.11/SPARK_VERSION/2.4.4/label/ubuntu/adam-core/src/test/scala/org/bdgenomics/adam/converters/AlignmentConverterSuite.scala:45: error: not found: value Alignment
[ERROR]     val builder = Alignment.newBuilder()
[ERROR]                   ^
[ERROR] /home/jenkins/workspace/ADAM-prb/HADOOP_VERSION/2.7.5/SCALAVER/2.11/SPARK_VERSION/2.4.4/label/ubuntu/adam-core/src/test/scala/org/bdgenomics/adam/converters/AlignmentConverterSuite.scala:149: error: not found: value Alignment
[ERROR]     val adamRead = Alignment.newBuilder()
[ERROR]                    ^
[ERROR] /home/jenkins/workspace/ADAM-prb/HADOOP_VERSION/2.7.5/SCALAVER/2.11/SPARK_VERSION/2.4.4/label/ubuntu/adam-core/src/test/scala/org/bdgenomics/adam/converters/AlignmentConverterSuite.scala:165: error: not found: type Alignment
[ERROR]   def getSAMRecordFromReadName(readName: String): (Alignment, Alignment) = {
[ERROR]                                                    ^
[ERROR] /home/jenkins/workspace/ADAM-prb/HADOOP_VERSION/2.7.5/SCALAVER/2.11/SPARK_VERSION/2.4.4/label/ubuntu/adam-core/src/test/scala/org/bdgenomics/adam/converters/AlignmentConverterSuite.scala:165: error: not found: type Alignment
[ERROR]   def getSAMRecordFromReadName(readName: String): (Alignment, Alignment) = {
[ERROR]                                                               ^
[ERROR] /home/jenkins/workspace/ADAM-prb/HADOOP_VERSION/2.7.5/SCALAVER/2.11/SPARK_VERSION/2.4.4/label/ubuntu/adam-core/src/test/scala/org/bdgenomics/adam/converters/AlignmentConverterSuite.scala:187: error: value getReadInFragment is not a member of Any
[ERROR]     assert(firstRecord.getReadInFragment === 1)
[ERROR]                        ^
[ERROR] /home/jenkins/workspace/ADAM-prb/HADOOP_VERSION/2.7.5/SCALAVER/2.11/SPARK_VERSION/2.4.4/label/ubuntu/adam-core/src/test/scala/org/bdgenomics/adam/converters/AlignmentConverterSuite.scala:188: error: value getReadInFragment is not a member of Any
[ERROR]     assert(secondRecord.getReadInFragment === 0)
[ERROR]                         ^
[ERROR] /home/jenkins/workspace/ADAM-prb/HADOOP_VERSION/2.7.5/SCALAVER/2.11/SPARK_VERSION/2.4.4/label/ubuntu/adam-core/src/test/scala/org/bdgenomics/adam/converters/AlignmentConverterSuite.scala:218: error: value getReadInFragment is not a member of Any
[ERROR]     assert(firstRecord.getReadInFragment === 1)
[ERROR]                        ^
[ERROR] /home/jenkins/workspace/ADAM-prb/HADOOP_VERSION/2.7.5/SCALAVER/2.11/SPARK_VERSION/2.4.4/label/ubuntu/adam-core/src/test/scala/org/bdgenomics/adam/converters/AlignmentConverterSuite.scala:219: error: value getReadInFragment is not a member of Any
[ERROR]     assert(secondRecord.getReadInFragment === 0)
[ERROR]                         ^
[ERROR] /home/jenkins/workspace/ADAM-prb/HADOOP_VERSION/2.7.5/SCALAVER/2.11/SPARK_VERSION/2.4.4/label/ubuntu/adam-core/src/test/scala/org/bdgenomics/adam/converters/AlignmentConverterSuite.scala:240: error: value getReadInFragment is not a member of Any
[ERROR]     assert(firstRecord.getReadInFragment === 0)
[ERROR]                        ^
[ERROR] /home/jenkins/workspace/ADAM-prb/HADOOP_VERSION/2.7.5/SCALAVER/2.11/SPARK_VERSION/2.4.4/label/ubuntu/adam-core/src/test/scala/org/bdgenomics/adam/converters/AlignmentConverterSuite.scala:241: error: value getReadInFragment is not a member of Any
[ERROR]     assert(secondRecord.getReadInFragment === 1)
[ERROR]                         ^
[ERROR] /home/jenkins/workspace/ADAM-prb/HADOOP_VERSION/2.7.5/SCALAVER/2.11/SPARK_VERSION/2.4.4/label/ubuntu/adam-core/src/test/scala/org/bdgenomics/adam/converters/AlignmentConverterSuite.scala:247: error: value getReadMapped is not a member of Any
[ERROR]     assert(!firstRecord.getReadMapped)
[ERROR]                         ^
[ERROR] /home/jenkins/workspace/ADAM-prb/HADOOP_VERSION/2.7.5/SCALAVER/2.11/SPARK_VERSION/2.4.4/label/ubuntu/adam-core/src/test/scala/org/bdgenomics/adam/converters/AlignmentConverterSuite.scala:248: error: value getReadNegativeStrand is not a member of Any
[ERROR]     assert(firstRecord.getReadNegativeStrand)
[ERROR]                        ^
[ERROR] /home/jenkins/workspace/ADAM-prb/HADOOP_VERSION/2.7.5/SCALAVER/2.11/SPARK_VERSION/2.4.4/label/ubuntu/adam-core/src/test/scala/org/bdgenomics/adam/converters/AlignmentConverterSuite.scala:257: error: not found: value Alignment
[ERROR]       Alignment.newBuilder()
[ERROR]       ^
[ERROR] /home/jenkins/workspace/ADAM-prb/HADOOP_VERSION/2.7.5/SCALAVER/2.11/SPARK_VERSION/2.4.4/label/ubuntu/adam-core/src/test/scala/org/bdgenomics/adam/converters/AlignmentConverterSuite.scala:264: error: not found: value Alignment
[ERROR]       Alignment.newBuilder()
[ERROR]       ^
[ERROR] /home/jenkins/workspace/ADAM-prb/HADOOP_VERSION/2.7.5/SCALAVER/2.11/SPARK_VERSION/2.4.4/label/ubuntu/adam-core/src/test/scala/org/bdgenomics/adam/converters/AlignmentConverterSuite.scala:298: error: not found: value Alignment
[ERROR]     val alignments = List(Alignment.newBuilder()
[ERROR]                           ^
[ERROR] /home/jenkins/workspace/ADAM-prb/HADOOP_VERSION/2.7.5/SCALAVER/2.11/SPARK_VERSION/2.4.4/label/ubuntu/adam-core/src/test/scala/org/bdgenomics/adam/converters/AlignmentConverterSuite.scala:331: error: not found: value Alignment
[ERROR]     val record = Alignment.newBuilder()
[ERROR]                  ^
[ERROR] /home/jenkins/workspace/ADAM-prb/HADOOP_VERSION/2.7.5/SCALAVER/2.11/SPARK_VERSION/2.4.4/label/ubuntu/adam-core/src/test/scala/org/bdgenomics/adam/rdd/fragment/FragmentDatasetSuite.scala:31: error: object AlignmentRecordDatasetSuite is not a member of package org.bdgenomics.adam.rdd.read
[ERROR] import org.bdgenomics.adam.rdd.read.{
[ERROR]        ^
[ERROR] /home/jenkins/workspace/ADAM-prb/HADOOP_VERSION/2.7.5/SCALAVER/2.11/SPARK_VERSION/2.4.4/label/ubuntu/adam-core/src/test/scala/org/bdgenomics/adam/rdd/fragment/FragmentDatasetSuite.scala:63: error: not found: value AlignmentRecordDatasetSuite
[ERROR]     VariantContext(AlignmentRecordDatasetSuite.varFn(f))
[ERROR]                    ^
[ERROR] /home/jenkins/workspace/ADAM-prb/HADOOP_VERSION/2.7.5/SCALAVER/2.11/SPARK_VERSION/2.4.4/label/ubuntu/adam-core/src/test/scala/org/bdgenomics/adam/rdd/fragment/FragmentDatasetSuite.scala:395: error: not found: value AlignmentRecordDatasetSuite
[ERROR]         rdd.map(AlignmentRecordDatasetSuite.sliceFn)
[ERROR]                 ^
[ERROR] /home/jenkins/workspace/ADAM-prb/HADOOP_VERSION/2.7.5/SCALAVER/2.11/SPARK_VERSION/2.4.4/label/ubuntu/adam-core/src/test/scala/org/bdgenomics/adam/rdd/fragment/FragmentDatasetSuite.scala:407: error: not found: value AlignmentRecordDatasetSuite
[ERROR]             AlignmentRecordDatasetSuite.sliceFn(r.toAvro))
[ERROR]             ^
[ERROR] /home/jenkins/workspace/ADAM-prb/HADOOP_VERSION/2.7.5/SCALAVER/2.11/SPARK_VERSION/2.4.4/label/ubuntu/adam-core/src/test/scala/org/bdgenomics/adam/rdd/fragment/FragmentDatasetSuite.scala:426: error: not found: value AlignmentRecordDatasetSuite
[ERROR]         rdd.map(AlignmentRecordDatasetSuite.covFn)
[ERROR]                 ^
[ERROR] /home/jenkins/workspace/ADAM-prb/HADOOP_VERSION/2.7.5/SCALAVER/2.11/SPARK_VERSION/2.4.4/label/ubuntu/adam-core/src/test/scala/org/bdgenomics/adam/rdd/fragment/FragmentDatasetSuite.scala:436: error: not found: value AlignmentRecordDatasetSuite
[ERROR]         ds.map(r => AlignmentRecordDatasetSuite.covFn(r.toAvro))
[ERROR]                     ^
[ERROR] /home/jenkins/workspace/ADAM-prb/HADOOP_VERSION/2.7.5/SCALAVER/2.11/SPARK_VERSION/2.4.4/label/ubuntu/adam-core/src/test/scala/org/bdgenomics/adam/rdd/fragment/FragmentDatasetSuite.scala:454: error: not found: value AlignmentRecordDatasetSuite
[ERROR]         rdd.map(AlignmentRecordDatasetSuite.featFn)
[ERROR]                 ^
[ERROR] /home/jenkins/workspace/ADAM-prb/HADOOP_VERSION/2.7.5/SCALAVER/2.11/SPARK_VERSION/2.4.4/label/ubuntu/adam-core/src/test/scala/org/bdgenomics/adam/rdd/fragment/FragmentDatasetSuite.scala:466: error: not found: value AlignmentRecordDatasetSuite
[ERROR]             AlignmentRecordDatasetSuite.featFn(r.toAvro))
[ERROR]             ^
[ERROR] /home/jenkins/workspace/ADAM-prb/HADOOP_VERSION/2.7.5/SCALAVER/2.11/SPARK_VERSION/2.4.4/label/ubuntu/adam-core/src/test/scala/org/bdgenomics/adam/rdd/fragment/FragmentDatasetSuite.scala:516: error: not found: value AlignmentRecordDatasetSuite
[ERROR]         rdd.map(AlignmentRecordDatasetSuite.genFn)
[ERROR]                 ^
[ERROR] /home/jenkins/workspace/ADAM-prb/HADOOP_VERSION/2.7.5/SCALAVER/2.11/SPARK_VERSION/2.4.4/label/ubuntu/adam-core/src/test/scala/org/bdgenomics/adam/rdd/fragment/FragmentDatasetSuite.scala:528: error: not found: value AlignmentRecordDatasetSuite
[ERROR]             AlignmentRecordDatasetSuite.genFn(r.toAvro))
[ERROR]             ^
[ERROR] /home/jenkins/workspace/ADAM-prb/HADOOP_VERSION/2.7.5/SCALAVER/2.11/SPARK_VERSION/2.4.4/label/ubuntu/adam-core/src/test/scala/org/bdgenomics/adam/rdd/fragment/FragmentDatasetSuite.scala:547: error: not found: value AlignmentRecordDatasetSuite
[ERROR]         rdd.map(AlignmentRecordDatasetSuite.varFn)
[ERROR]                 ^
[ERROR] /home/jenkins/workspace/ADAM-prb/HADOOP_VERSION/2.7.5/SCALAVER/2.11/SPARK_VERSION/2.4.4/label/ubuntu/adam-core/src/test/scala/org/bdgenomics/adam/rdd/fragment/FragmentDatasetSuite.scala:559: error: not found: value AlignmentRecordDatasetSuite
[ERROR]             AlignmentRecordDatasetSuite.varFn(r.toAvro))
[ERROR]             ^
[ERROR] /home/jenkins/workspace/ADAM-prb/HADOOP_VERSION/2.7.5/SCALAVER/2.11/SPARK_VERSION/2.4.4/label/ubuntu/adam-core/src/test/scala/org/bdgenomics/adam/rdd/read/AlignmentDatasetSuite.scala:53: error: object Alignment is not a member of package org.bdgenomics.adam.sql
[ERROR] import org.bdgenomics.adam.sql.{
[ERROR]        ^
[ERROR] /home/jenkins/workspace/ADAM-prb/HADOOP_VERSION/2.7.5/SCALAVER/2.11/SPARK_VERSION/2.4.4/label/ubuntu/adam-core/src/test/scala/org/bdgenomics/adam/rdd/read/AlignmentDatasetSuite.scala:68: error: not found: type Alignment
[ERROR] private object SequenceIndexWithReadOrdering extends Ordering[((Int, Long), (Alignment, Int))] {
[ERROR]                                                                              ^
[ERROR] /home/jenkins/workspace/ADAM-prb/HADOOP_VERSION/2.7.5/SCALAVER/2.11/SPARK_VERSION/2.4.4/label/ubuntu/adam-core/src/test/scala/org/bdgenomics/adam/rdd/read/AlignmentDatasetSuite.scala:69: error: not found: type Alignment
[ERROR]   def compare(a: ((Int, Long), (Alignment, Int)),
[ERROR]                                 ^
[ERROR] /home/jenkins/workspace/ADAM-prb/HADOOP_VERSION/2.7.5/SCALAVER/2.11/SPARK_VERSION/2.4.4/label/ubuntu/adam-core/src/test/scala/org/bdgenomics/adam/rdd/read/AlignmentDatasetSuite.scala:70: error: not found: type Alignment
[ERROR]               b: ((Int, Long), (Alignment, Int))): Int = {
[ERROR]                                 ^
[ERROR] /home/jenkins/workspace/ADAM-prb/HADOOP_VERSION/2.7.5/SCALAVER/2.11/SPARK_VERSION/2.4.4/label/ubuntu/adam-core/src/test/scala/org/bdgenomics/adam/rdd/read/AlignmentDatasetSuite.scala:79: error: not found: type AlignmentDataset
[ERROR] class SameTypeFunction2 extends Function2[AlignmentDataset, RDD[Alignment], AlignmentDataset] {
[ERROR]                                           ^
[ERROR] /home/jenkins/workspace/ADAM-prb/HADOOP_VERSION/2.7.5/SCALAVER/2.11/SPARK_VERSION/2.4.4/label/ubuntu/adam-core/src/test/scala/org/bdgenomics/adam/rdd/read/AlignmentDatasetSuite.scala:79: error: not found: type Alignment
[ERROR] class SameTypeFunction2 extends Function2[AlignmentDataset, RDD[Alignment], AlignmentDataset] {
[ERROR]                                                                 ^
[ERROR] /home/jenkins/workspace/ADAM-prb/HADOOP_VERSION/2.7.5/SCALAVER/2.11/SPARK_VERSION/2.4.4/label/ubuntu/adam-core/src/test/scala/org/bdgenomics/adam/rdd/read/AlignmentDatasetSuite.scala:79: error: not found: type AlignmentDataset
[ERROR] class SameTypeFunction2 extends Function2[AlignmentDataset, RDD[Alignment], AlignmentDataset] {
[ERROR]                                                                             ^
[ERROR] /home/jenkins/workspace/ADAM-prb/HADOOP_VERSION/2.7.5/SCALAVER/2.11/SPARK_VERSION/2.4.4/label/ubuntu/adam-core/src/test/scala/org/bdgenomics/adam/rdd/read/AlignmentDatasetSuite.scala:81: error: not found: type AlignmentDataset
[ERROR]   def call(v1: AlignmentDataset, v2: RDD[Alignment]): AlignmentDataset = {
[ERROR]                                                       ^
[ERROR] /home/jenkins/workspace/ADAM-prb/HADOOP_VERSION/2.7.5/SCALAVER/2.11/SPARK_VERSION/2.4.4/label/ubuntu/adam-core/src/test/scala/org/bdgenomics/adam/rdd/read/AlignmentDatasetSuite.scala:81: error: not found: type AlignmentDataset
[ERROR]   def call(v1: AlignmentDataset, v2: RDD[Alignment]): AlignmentDataset = {
[ERROR]                ^
[ERROR] /home/jenkins/workspace/ADAM-prb/HADOOP_VERSION/2.7.5/SCALAVER/2.11/SPARK_VERSION/2.4.4/label/ubuntu/adam-core/src/test/scala/org/bdgenomics/adam/rdd/read/AlignmentDatasetSuite.scala:81: error: not found: type Alignment
[ERROR]   def call(v1: AlignmentDataset, v2: RDD[Alignment]): AlignmentDataset = {
[ERROR]                                          ^
[ERROR] /home/jenkins/workspace/ADAM-prb/HADOOP_VERSION/2.7.5/SCALAVER/2.11/SPARK_VERSION/2.4.4/label/ubuntu/adam-core/src/test/scala/org/bdgenomics/adam/rdd/read/AlignmentDatasetSuite.scala:82: error: value AlignmentsToAlignmentsConversionFn is not a member of object org.bdgenomics.adam.rdd.ADAMContext
[ERROR]     ADAMContext.AlignmentsToAlignmentsConversionFn(v1, v2)
[ERROR]                 ^
[ERROR] /home/jenkins/workspace/ADAM-prb/HADOOP_VERSION/2.7.5/SCALAVER/2.11/SPARK_VERSION/2.4.4/label/ubuntu/adam-core/src/test/scala/org/bdgenomics/adam/rdd/read/AlignmentDatasetSuite.scala:88: error: not found: type Alignment
[ERROR]   private def fragToRead(f: Fragment): Alignment = {
[ERROR]                                        ^
[ERROR] /home/jenkins/workspace/ADAM-prb/HADOOP_VERSION/2.7.5/SCALAVER/2.11/SPARK_VERSION/2.4.4/label/ubuntu/adam-core/src/test/scala/org/bdgenomics/adam/rdd/read/AlignmentDatasetSuite.scala:92: error: not found: type Alignment
[ERROR]   def sliceFn(r: Alignment): Slice = {
[ERROR]                  ^
[ERROR] /home/jenkins/workspace/ADAM-prb/HADOOP_VERSION/2.7.5/SCALAVER/2.11/SPARK_VERSION/2.4.4/label/ubuntu/adam-core/src/test/scala/org/bdgenomics/adam/rdd/read/AlignmentDatasetSuite.scala:103: error: not found: type Alignment
[ERROR]   def covFn(r: Alignment): Coverage = {
[ERROR]                ^
[ERROR] /home/jenkins/workspace/ADAM-prb/HADOOP_VERSION/2.7.5/SCALAVER/2.11/SPARK_VERSION/2.4.4/label/ubuntu/adam-core/src/test/scala/org/bdgenomics/adam/rdd/read/AlignmentDatasetSuite.scala:114: error: not found: type Alignment
[ERROR]   def featFn(r: Alignment): Feature = {
[ERROR]                 ^
[ERROR] /home/jenkins/workspace/ADAM-prb/HADOOP_VERSION/2.7.5/SCALAVER/2.11/SPARK_VERSION/2.4.4/label/ubuntu/adam-core/src/test/scala/org/bdgenomics/adam/rdd/read/AlignmentDatasetSuite.scala:126: error: not found: type Alignment
[ERROR]   def fragFn(r: Alignment): Fragment = {
[ERROR]                 ^
[ERROR] /home/jenkins/workspace/ADAM-prb/HADOOP_VERSION/2.7.5/SCALAVER/2.11/SPARK_VERSION/2.4.4/label/ubuntu/adam-core/src/test/scala/org/bdgenomics/adam/rdd/read/AlignmentDatasetSuite.scala:132: error: not found: type Alignment
[ERROR]   def genFn(r: Alignment): Genotype = {
[ERROR]                ^
[ERROR] /home/jenkins/workspace/ADAM-prb/HADOOP_VERSION/2.7.5/SCALAVER/2.11/SPARK_VERSION/2.4.4/label/ubuntu/adam-core/src/test/scala/org/bdgenomics/adam/rdd/read/AlignmentDatasetSuite.scala:144: error: not found: type Alignment
[ERROR]   def varFn(r: Alignment): Variant = {
[ERROR]                ^
[ERROR] /home/jenkins/workspace/ADAM-prb/HADOOP_VERSION/2.7.5/SCALAVER/2.11/SPARK_VERSION/2.4.4/label/ubuntu/adam-core/src/test/scala/org/bdgenomics/adam/rdd/read/AlignmentDatasetSuite.scala:164: error: not found: value Alignment
[ERROR]       val builder = Alignment.newBuilder().setReadMapped(mapped)
[ERROR]                     ^
[ERROR] /home/jenkins/workspace/ADAM-prb/HADOOP_VERSION/2.7.5/SCALAVER/2.11/SPARK_VERSION/2.4.4/label/ubuntu/adam-core/src/test/scala/org/bdgenomics/adam/rdd/read/AlignmentDatasetSuite.scala:176: error: value getReferenceName is not a member of Nothing
[ERROR]     val contigNames = rdd.flatMap(r => Option(r.getReferenceName)).distinct.collect
[ERROR]                                                 ^
[ERROR] /home/jenkins/workspace/ADAM-prb/HADOOP_VERSION/2.7.5/SCALAVER/2.11/SPARK_VERSION/2.4.4/label/ubuntu/adam-core/src/test/scala/org/bdgenomics/adam/rdd/read/AlignmentDatasetSuite.scala:177: error: value map is not a member of Array[Nothing]
[ERROR]     val sd = new SequenceDictionary(contigNames.map(v => SequenceRecord(v, 1000000L)).toVector)
[ERROR]                                                 ^
[ERROR] /home/jenkins/workspace/ADAM-prb/HADOOP_VERSION/2.7.5/SCALAVER/2.11/SPARK_VERSION/2.4.4/label/ubuntu/adam-core/src/test/scala/org/bdgenomics/adam/rdd/read/AlignmentDatasetSuite.scala:179: error: not found: value AlignmentDataset
[ERROR]     val sortedReads = AlignmentDataset(rdd, sd, ReadGroupDictionary.empty, Seq.empty)
[ERROR]                       ^
[ERROR] /home/jenkins/workspace/ADAM-prb/HADOOP_VERSION/2.7.5/SCALAVER/2.11/SPARK_VERSION/2.4.4/label/ubuntu/adam-core/src/test/scala/org/bdgenomics/adam/rdd/read/AlignmentDatasetSuite.scala:186: error: value forall is not a member of Any
[ERROR]     assert(unmapped.forall(p => p._2 > mapped.takeRight(1)(0)._2))
[ERROR]                     ^
[ERROR] /home/jenkins/workspace/ADAM-prb/HADOOP_VERSION/2.7.5/SCALAVER/2.11/SPARK_VERSION/2.4.4/label/ubuntu/adam-core/src/test/scala/org/bdgenomics/adam/rdd/read/AlignmentDatasetSuite.scala:188: error: value sortWith is not a member of Any
[ERROR]     val expectedSortedReads = mapped.sortWith(
[ERROR]                                      ^
[ERROR] /home/jenkins/workspace/ADAM-prb/HADOOP_VERSION/2.7.5/SCALAVER/2.11/SPARK_VERSION/2.4.4/label/ubuntu/adam-core/src/test/scala/org/bdgenomics/adam/rdd/read/AlignmentDatasetSuite.scala:205: error: not found: type AlignmentDataset
[ERROR]     val reads: AlignmentDataset = sc.loadAlignments(inputPath)
[ERROR]                ^
[ERROR] /home/jenkins/workspace/ADAM-prb/HADOOP_VERSION/2.7.5/SCALAVER/2.11/SPARK_VERSION/2.4.4/label/ubuntu/adam-core/src/test/scala/org/bdgenomics/adam/rdd/read/AlignmentDatasetSuite.scala:206: error: not found: type Alignment
[ERROR]       .transform((rdd: RDD[Alignment]) => {
[ERROR]                            ^
[ERROR] /home/jenkins/workspace/ADAM-prb/HADOOP_VERSION/2.7.5/SCALAVER/2.11/SPARK_VERSION/2.4.4/label/ubuntu/adam-core/src/test/scala/org/bdgenomics/adam/rdd/read/AlignmentDatasetSuite.scala:216: error: not found: type AlignmentDataset
[ERROR]     val reads: AlignmentDataset = sc.loadAlignments(inputPath)
[ERROR]                ^
[ERROR] /home/jenkins/workspace/ADAM-prb/HADOOP_VERSION/2.7.5/SCALAVER/2.11/SPARK_VERSION/2.4.4/label/ubuntu/adam-core/src/test/scala/org/bdgenomics/adam/rdd/read/AlignmentDatasetSuite.scala:239: error: not found: type AlignmentDataset
[ERROR]     val reads: AlignmentDataset = sc.loadAlignments(inputPath)
[ERROR]                ^
[ERROR] /home/jenkins/workspace/ADAM-prb/HADOOP_VERSION/2.7.5/SCALAVER/2.11/SPARK_VERSION/2.4.4/label/ubuntu/adam-core/src/test/scala/org/bdgenomics/adam/rdd/read/AlignmentDatasetSuite.scala:252: error: not found: type AlignmentDataset
[ERROR]     val reads: AlignmentDataset = sc.loadAlignments(inputPath)
[ERROR]                ^
[ERROR] /home/jenkins/workspace/ADAM-prb/HADOOP_VERSION/2.7.5/SCALAVER/2.11/SPARK_VERSION/2.4.4/label/ubuntu/adam-core/src/test/scala/org/bdgenomics/adam/rdd/read/AlignmentDatasetSuite.scala:270: error: not found: value Alignment
[ERROR]       val builder = Alignment.newBuilder().setReadMapped(mapped)
[ERROR]                     ^
[ERROR] /home/jenkins/workspace/ADAM-prb/HADOOP_VERSION/2.7.5/SCALAVER/2.11/SPARK_VERSION/2.4.4/label/ubuntu/adam-core/src/test/scala/org/bdgenomics/adam/rdd/read/AlignmentDatasetSuite.scala:279: error: value getReadMapped is not a member of Nothing
[ERROR]     val contigNames = reads.filter(_.getReadMapped).map(_.getReferenceName).toSet
[ERROR]                                      ^
[ERROR] /home/jenkins/workspace/ADAM-prb/HADOOP_VERSION/2.7.5/SCALAVER/2.11/SPARK_VERSION/2.4.4/label/ubuntu/adam-core/src/test/scala/org/bdgenomics/adam/rdd/read/AlignmentDatasetSuite.scala:288: error: not found: value AlignmentDataset
[ERROR]     val sortedReads = AlignmentDataset(rdd, sd, ReadGroupDictionary.empty, Seq.empty)
[ERROR]                       ^
[ERROR] /home/jenkins/workspace/ADAM-prb/HADOOP_VERSION/2.7.5/SCALAVER/2.11/SPARK_VERSION/2.4.4/label/ubuntu/adam-core/src/test/scala/org/bdgenomics/adam/rdd/read/AlignmentDatasetSuite.scala:296: error: value forall is not a member of Any
[ERROR]     assert(unmapped.forall(p => p._2 > mapped.takeRight(1)(0)._2))
[ERROR]                     ^
[ERROR] /home/jenkins/workspace/ADAM-prb/HADOOP_VERSION/2.7.5/SCALAVER/2.11/SPARK_VERSION/2.4.4/label/ubuntu/adam-core/src/test/scala/org/bdgenomics/adam/rdd/read/AlignmentDatasetSuite.scala:298: error: not found: type Alignment
[ERROR]     def toIndex(r: Alignment): Int = {
[ERROR]                    ^
[ERROR] /home/jenkins/workspace/ADAM-prb/HADOOP_VERSION/2.7.5/SCALAVER/2.11/SPARK_VERSION/2.4.4/label/ubuntu/adam-core/src/test/scala/org/bdgenomics/adam/rdd/read/AlignmentDatasetSuite.scala:304: error: value map is not a member of Any
[ERROR]     val expectedSortedReads = mapped.map(kv => {
[ERROR]                                      ^
[ERROR] /home/jenkins/workspace/ADAM-prb/HADOOP_VERSION/2.7.5/SCALAVER/2.11/SPARK_VERSION/2.4.4/label/ubuntu/adam-core/src/test/scala/org/bdgenomics/adam/rdd/read/AlignmentDatasetSuite.scala:306: error: value getStart is not a member of Any
[ERROR]       val start: Long = r.getStart
[ERROR]                           ^
[ERROR] /home/jenkins/workspace/ADAM-prb/HADOOP_VERSION/2.7.5/SCALAVER/2.11/SPARK_VERSION/2.4.4/label/ubuntu/adam-core/src/test/scala/org/bdgenomics/adam/rdd/read/AlignmentDatasetSuite.scala:658: error: not found: type AlignmentDataset
[ERROR]     val reads: AlignmentDataset = sc.loadAlignments(inputPath)
[ERROR]                ^
[ERROR] /home/jenkins/workspace/ADAM-prb/HADOOP_VERSION/2.7.5/SCALAVER/2.11/SPARK_VERSION/2.4.4/label/ubuntu/adam-core/src/test/scala/org/bdgenomics/adam/rdd/read/AlignmentDatasetSuite.scala:670: error: not found: type AlignmentDataset
[ERROR]     def testMetadata(arRdd: AlignmentDataset) {
[ERROR]                             ^
[ERROR] /home/jenkins/workspace/ADAM-prb/HADOOP_VERSION/2.7.5/SCALAVER/2.11/SPARK_VERSION/2.4.4/label/ubuntu/adam-core/src/test/scala/org/bdgenomics/adam/rdd/read/AlignmentDatasetSuite.scala:687: error: not found: type AlignmentProduct
[ERROR]         .as[AlignmentProduct]
[ERROR]             ^
[ERROR] /home/jenkins/workspace/ADAM-prb/HADOOP_VERSION/2.7.5/SCALAVER/2.11/SPARK_VERSION/2.4.4/label/ubuntu/adam-core/src/test/scala/org/bdgenomics/adam/rdd/read/AlignmentDatasetSuite.scala:706: error: not found: type AlignmentDataset
[ERROR]     def testMetadata(arRdd: AlignmentDataset) {
[ERROR]                             ^
[ERROR] /home/jenkins/workspace/ADAM-prb/HADOOP_VERSION/2.7.5/SCALAVER/2.11/SPARK_VERSION/2.4.4/label/ubuntu/adam-core/src/test/scala/org/bdgenomics/adam/rdd/read/AlignmentDatasetSuite.scala:737: error: not found: type AlignmentProduct
[ERROR]       df.as[AlignmentProduct]
[ERROR]             ^
[ERROR] /home/jenkins/workspace/ADAM-prb/HADOOP_VERSION/2.7.5/SCALAVER/2.11/SPARK_VERSION/2.4.4/label/ubuntu/adam-core/src/test/scala/org/bdgenomics/adam/rdd/read/AlignmentDatasetSuite.scala:746: error: not found: type AlignmentDataset
[ERROR]     val reads: AlignmentDataset = sc.loadAlignments(inputPath)
[ERROR]                ^
[ERROR] /home/jenkins/workspace/ADAM-prb/HADOOP_VERSION/2.7.5/SCALAVER/2.11/SPARK_VERSION/2.4.4/label/ubuntu/adam-core/src/test/scala/org/bdgenomics/adam/rdd/read/AlignmentDatasetSuite.scala:754: error: not found: type AlignmentDataset
[ERROR]     val reads: AlignmentDataset = sc.loadAlignments(inputPath)
[ERROR]                ^
[ERROR] /home/jenkins/workspace/ADAM-prb/HADOOP_VERSION/2.7.5/SCALAVER/2.11/SPARK_VERSION/2.4.4/label/ubuntu/adam-core/src/test/scala/org/bdgenomics/adam/rdd/read/AlignmentDatasetSuite.scala:762: error: not found: type AlignmentDataset
[ERROR]     val reads: AlignmentDataset = sc.loadAlignments(inputPath)
[ERROR]                ^
[ERROR] /home/jenkins/workspace/ADAM-prb/HADOOP_VERSION/2.7.5/SCALAVER/2.11/SPARK_VERSION/2.4.4/label/ubuntu/adam-core/src/test/scala/org/bdgenomics/adam/rdd/read/AlignmentDatasetSuite.scala:770: error: not found: type AlignmentDataset
[ERROR]     val reads: AlignmentDataset = sc.loadAlignments(inputPath)
[ERROR]                ^
[ERROR] /home/jenkins/workspace/ADAM-prb/HADOOP_VERSION/2.7.5/SCALAVER/2.11/SPARK_VERSION/2.4.4/label/ubuntu/adam-core/src/test/scala/org/bdgenomics/adam/rdd/read/AlignmentDatasetSuite.scala:778: error: not found: type AlignmentDataset
[ERROR]     val reads: AlignmentDataset = sc.loadAlignments(inputPath)
[ERROR]                ^
[ERROR] /home/jenkins/workspace/ADAM-prb/HADOOP_VERSION/2.7.5/SCALAVER/2.11/SPARK_VERSION/2.4.4/label/ubuntu/adam-core/src/test/scala/org/bdgenomics/adam/rdd/read/AlignmentDatasetSuite.scala:786: error: not found: type AlignmentDataset
[ERROR]     val reads: AlignmentDataset = sc.loadAlignments(inputPath)
[ERROR]                ^
[ERROR] /home/jenkins/workspace/ADAM-prb/HADOOP_VERSION/2.7.5/SCALAVER/2.11/SPARK_VERSION/2.4.4/label/ubuntu/adam-core/src/test/scala/org/bdgenomics/adam/rdd/read/AlignmentDatasetSuite.scala:794: error: not found: type AlignmentDataset
[ERROR]     val reads: AlignmentDataset = sc.loadAlignments(inputPath)
[ERROR]                ^
[ERROR] /home/jenkins/workspace/ADAM-prb/HADOOP_VERSION/2.7.5/SCALAVER/2.11/SPARK_VERSION/2.4.4/label/ubuntu/adam-core/src/test/scala/org/bdgenomics/adam/rdd/read/AlignmentDatasetSuite.scala:802: error: not found: type AlignmentDataset
[ERROR]     val reads: AlignmentDataset = sc.loadAlignments(inputPath)
[ERROR]                ^
[ERROR] /home/jenkins/workspace/ADAM-prb/HADOOP_VERSION/2.7.5/SCALAVER/2.11/SPARK_VERSION/2.4.4/label/ubuntu/adam-core/src/test/scala/org/bdgenomics/adam/rdd/read/AlignmentDatasetSuite.scala:812: error: not found: type AlignmentDataset
[ERROR]     val reads: AlignmentDataset = sc.loadAlignments(inputPath)
[ERROR]                ^
[ERROR] /home/jenkins/workspace/ADAM-prb/HADOOP_VERSION/2.7.5/SCALAVER/2.11/SPARK_VERSION/2.4.4/label/ubuntu/adam-core/src/test/scala/org/bdgenomics/adam/rdd/read/AlignmentDatasetSuite.scala:823: error: not found: type AlignmentDataset
[ERROR]     val reads: AlignmentDataset = sc.loadAlignments(inputPath)
[ERROR]                ^
[ERROR] /home/jenkins/workspace/ADAM-prb/HADOOP_VERSION/2.7.5/SCALAVER/2.11/SPARK_VERSION/2.4.4/label/ubuntu/adam-core/src/test/scala/org/bdgenomics/adam/rdd/read/AlignmentDatasetSuite.scala:831: error: not found: type AlignmentDataset
[ERROR]     val reads: AlignmentDataset = sc.loadAlignments(inputPath)
[ERROR]                ^
[ERROR] /home/jenkins/workspace/ADAM-prb/HADOOP_VERSION/2.7.5/SCALAVER/2.11/SPARK_VERSION/2.4.4/label/ubuntu/adam-core/src/test/scala/org/bdgenomics/adam/rdd/read/AlignmentDatasetSuite.scala:841: error: not found: type AlignmentDataset
[ERROR]     val reads: AlignmentDataset = sc.loadAlignments(inputPath)
[ERROR]                ^
[ERROR] /home/jenkins/workspace/ADAM-prb/HADOOP_VERSION/2.7.5/SCALAVER/2.11/SPARK_VERSION/2.4.4/label/ubuntu/adam-core/src/test/scala/org/bdgenomics/adam/rdd/read/AlignmentDatasetSuite.scala:852: error: not found: type AlignmentDataset
[ERROR]     val reads: AlignmentDataset = sc.loadAlignments(inputPath)
[ERROR]                ^
[ERROR] /home/jenkins/workspace/ADAM-prb/HADOOP_VERSION/2.7.5/SCALAVER/2.11/SPARK_VERSION/2.4.4/label/ubuntu/adam-core/src/test/scala/org/bdgenomics/adam/rdd/read/AlignmentDatasetSuite.scala:860: error: not found: type AlignmentDataset
[ERROR]     val reads: AlignmentDataset = sc.loadAlignments(inputPath)
[ERROR]                ^
[ERROR] /home/jenkins/workspace/ADAM-prb/HADOOP_VERSION/2.7.5/SCALAVER/2.11/SPARK_VERSION/2.4.4/label/ubuntu/adam-core/src/test/scala/org/bdgenomics/adam/rdd/read/AlignmentDatasetSuite.scala:869: error: not found: type AlignmentDataset
[ERROR]     val reads: AlignmentDataset = sc.loadAlignments(inputPath)
[ERROR]                ^
[ERROR] /home/jenkins/workspace/ADAM-prb/HADOOP_VERSION/2.7.5/SCALAVER/2.11/SPARK_VERSION/2.4.4/label/ubuntu/adam-core/src/test/scala/org/bdgenomics/adam/rdd/read/AlignmentDatasetSuite.scala:877: error: not found: type AlignmentDataset
[ERROR]     val reads: AlignmentDataset = sc.loadAlignments(inputPath)
[ERROR]                ^
[ERROR] /home/jenkins/workspace/ADAM-prb/HADOOP_VERSION/2.7.5/SCALAVER/2.11/SPARK_VERSION/2.4.4/label/ubuntu/adam-core/src/test/scala/org/bdgenomics/adam/rdd/read/AlignmentDatasetSuite.scala:885: error: not found: type AlignmentDataset
[ERROR]     val reads: AlignmentDataset = sc.loadAlignments(inputPath)
[ERROR]                ^
[ERROR] /home/jenkins/workspace/ADAM-prb/HADOOP_VERSION/2.7.5/SCALAVER/2.11/SPARK_VERSION/2.4.4/label/ubuntu/adam-core/src/test/scala/org/bdgenomics/adam/rdd/read/AlignmentDatasetSuite.scala:893: error: not found: type AlignmentDataset
[ERROR]     val reads: AlignmentDataset = sc.loadAlignments(inputPath)
[ERROR]                ^
[ERROR] /home/jenkins/workspace/ADAM-prb/HADOOP_VERSION/2.7.5/SCALAVER/2.11/SPARK_VERSION/2.4.4/label/ubuntu/adam-core/src/test/scala/org/bdgenomics/adam/rdd/read/AlignmentDatasetSuite.scala:903: error: not found: type AlignmentDataset
[ERROR]     val reads: AlignmentDataset = sc.loadAlignments(inputPath)
[ERROR]                ^
[ERROR] /home/jenkins/workspace/ADAM-prb/HADOOP_VERSION/2.7.5/SCALAVER/2.11/SPARK_VERSION/2.4.4/label/ubuntu/adam-core/src/test/scala/org/bdgenomics/adam/rdd/read/AlignmentDatasetSuite.scala:913: error: not found: type AlignmentDataset
[ERROR]     val reads: AlignmentDataset = sc.loadAlignments(inputPath)
[ERROR]                ^
[ERROR] /home/jenkins/workspace/ADAM-prb/HADOOP_VERSION/2.7.5/SCALAVER/2.11/SPARK_VERSION/2.4.4/label/ubuntu/adam-core/src/test/scala/org/bdgenomics/adam/rdd/read/AlignmentDatasetSuite.scala:931: error: not found: type AlignmentDataset
[ERROR]     val pipedRdd: AlignmentDataset = ardd.pipe[Alignment, AlignmentProduct, AlignmentDataset, SAMInFormatter](Seq("tee", "/dev/null"))
[ERROR]                   ^
[ERROR] /home/jenkins/workspace/ADAM-prb/HADOOP_VERSION/2.7.5/SCALAVER/2.11/SPARK_VERSION/2.4.4/label/ubuntu/adam-core/src/test/scala/org/bdgenomics/adam/rdd/read/AlignmentDatasetSuite.scala:931: error: not found: type Alignment
[ERROR]     val pipedRdd: AlignmentDataset = ardd.pipe[Alignment, AlignmentProduct, AlignmentDataset, SAMInFormatter](Seq("tee", "/dev/null"))
[ERROR]                                                ^
[ERROR] /home/jenkins/workspace/ADAM-prb/HADOOP_VERSION/2.7.5/SCALAVER/2.11/SPARK_VERSION/2.4.4/label/ubuntu/adam-core/src/test/scala/org/bdgenomics/adam/rdd/read/AlignmentDatasetSuite.scala:931: error: not found: type AlignmentProduct
[ERROR]     val pipedRdd: AlignmentDataset = ardd.pipe[Alignment, AlignmentProduct, AlignmentDataset, SAMInFormatter](Seq("tee", "/dev/null"))
[ERROR]                                                           ^
[ERROR] /home/jenkins/workspace/ADAM-prb/HADOOP_VERSION/2.7.5/SCALAVER/2.11/SPARK_VERSION/2.4.4/label/ubuntu/adam-core/src/test/scala/org/bdgenomics/adam/rdd/read/AlignmentDatasetSuite.scala:931: error: not found: type AlignmentDataset
[ERROR]     val pipedRdd: AlignmentDataset = ardd.pipe[Alignment, AlignmentProduct, AlignmentDataset, SAMInFormatter](Seq("tee", "/dev/null"))
[ERROR]                                                                             ^
[ERROR] /home/jenkins/workspace/ADAM-prb/HADOOP_VERSION/2.7.5/SCALAVER/2.11/SPARK_VERSION/2.4.4/label/ubuntu/adam-core/src/test/scala/org/bdgenomics/adam/rdd/read/AlignmentDatasetSuite.scala:944: error: not found: type AlignmentDataset
[ERROR]     val pipedRdd: AlignmentDataset = ardd.pipe[Alignment, AlignmentProduct, AlignmentDataset, SAMInFormatter](Seq("sleep", "10"), optTimeout = Some(5))
[ERROR]                   ^
[ERROR] /home/jenkins/workspace/ADAM-prb/HADOOP_VERSION/2.7.5/SCALAVER/2.11/SPARK_VERSION/2.4.4/label/ubuntu/adam-core/src/test/scala/org/bdgenomics/adam/rdd/read/AlignmentDatasetSuite.scala:944: error: not found: type Alignment
[ERROR]     val pipedRdd: AlignmentDataset = ardd.pipe[Alignment, AlignmentProduct, AlignmentDataset, SAMInFormatter](Seq("sleep", "10"), optTimeout = Some(5))
[ERROR]                                                ^
[ERROR] /home/jenkins/workspace/ADAM-prb/HADOOP_VERSION/2.7.5/SCALAVER/2.11/SPARK_VERSION/2.4.4/label/ubuntu/adam-core/src/test/scala/org/bdgenomics/adam/rdd/read/AlignmentDatasetSuite.scala:944: error: not found: type AlignmentProduct
[ERROR]     val pipedRdd: AlignmentDataset = ardd.pipe[Alignment, AlignmentProduct, AlignmentDataset, SAMInFormatter](Seq("sleep", "10"), optTimeout = Some(5))
[ERROR]                                                           ^
[ERROR] /home/jenkins/workspace/ADAM-prb/HADOOP_VERSION/2.7.5/SCALAVER/2.11/SPARK_VERSION/2.4.4/label/ubuntu/adam-core/src/test/scala/org/bdgenomics/adam/rdd/read/AlignmentDatasetSuite.scala:944: error: not found: type AlignmentDataset
[ERROR]     val pipedRdd: AlignmentDataset = ardd.pipe[Alignment, AlignmentProduct, AlignmentDataset, SAMInFormatter](Seq("sleep", "10"), optTimeout = Some(5))
[ERROR]                                                                             ^
[ERROR] 186 errors found
[INFO] ------------------------------------------------------------------------
[INFO] Reactor Summary:
[INFO] 
[INFO] ADAM_2.11 .......................................... SUCCESS [ 10.276 s]
[INFO] ADAM_2.11: Shader workaround ....................... SUCCESS [  5.073 s]
[INFO] ADAM_2.11: Avro-to-Dataset codegen utils ........... SUCCESS [  9.037 s]
[INFO] ADAM_2.11: Core .................................... FAILURE [ 52.371 s]
[INFO] ADAM_2.11: APIs for Java, Python ................... SKIPPED
[INFO] ADAM_2.11: CLI ..................................... SKIPPED
[INFO] ADAM_2.11: Assembly ................................ SKIPPED
[INFO] ------------------------------------------------------------------------
[INFO] BUILD FAILURE
[INFO] ------------------------------------------------------------------------
[INFO] Total time: 01:17 min
[INFO] Finished at: 2019-09-27T11:13:07-07:00
[INFO] Final Memory: 61M/1495M
[INFO] ------------------------------------------------------------------------
[ERROR] Failed to execute goal net.alchim31.maven:scala-maven-plugin:3.2.2:testCompile (scala-test-compile-first) on project adam-core-spark2_2.11: wrap: org.apache.commons.exec.ExecuteException: Process exited with an error: 1 (Exit value: 1) -> [Help 1]
[ERROR] 
[ERROR] To see the full stack trace of the errors, re-run Maven with the -e switch.
[ERROR] Re-run Maven using the -X switch to enable full debug logging.
[ERROR] 
[ERROR] For more information about the errors and possible solutions, please read the following articles:
[ERROR] [Help 1] http://cwiki.apache.org/confluence/display/MAVEN/MojoExecutionException
[ERROR] 
[ERROR] After correcting the problems, you can resume the build with the command
[ERROR]   mvn <goals> -rf :adam-core-spark2_2.11
Build step 'Execute shell' marked build as failure
Recording test results
Publishing Scoverage XML and HTML report...
null
Setting commit status on GitHub for https://github.com/bigdatagenomics/adam/commit/df2094885748352418a15759a741ea9938cc9a17
Finished: FAILURE