FailedConsole Output

Skipping 406 KB.. Full Log
nstalling /usr/src/alluxio/integration/fuse/target/alluxio-integration-fuse-2.2.0-SNAPSHOT.jar to /home/jenkins/.m2/repository/org/alluxio/alluxio-integration-fuse/2.2.0-SNAPSHOT/alluxio-integration-fuse-2.2.0-SNAPSHOT.jar
[INFO] Installing /usr/src/alluxio/integration/fuse/pom.xml to /home/jenkins/.m2/repository/org/alluxio/alluxio-integration-fuse/2.2.0-SNAPSHOT/alluxio-integration-fuse-2.2.0-SNAPSHOT.pom
[INFO] Installing /usr/src/alluxio/integration/fuse/target/alluxio-integration-fuse-2.2.0-SNAPSHOT-sources.jar to /home/jenkins/.m2/repository/org/alluxio/alluxio-integration-fuse/2.2.0-SNAPSHOT/alluxio-integration-fuse-2.2.0-SNAPSHOT-sources.jar
Running alluxio.worker.block.UfsInputStreamManagerTest
Running alluxio.worker.block.UnderFileSystemBlockReaderTest
Tests run: 27, Failures: 0, Errors: 0, Skipped: 0, Time elapsed: 4.154 sec - in alluxio.worker.block.BlockWorkerTest
Tests run: 9, Failures: 0, Errors: 0, Skipped: 0, Time elapsed: 1.276 sec - in alluxio.worker.block.UnderFileSystemBlockReaderTest
Tests run: 5, Failures: 0, Errors: 0, Skipped: 0, Time elapsed: 1.707 sec - in alluxio.worker.block.UfsInputStreamManagerTest
Running alluxio.worker.block.UnderFileSystemBlockStoreTest
Running alluxio.worker.block.allocator.AllocatorFactoryTest
Running alluxio.worker.block.allocator.AllocatorContractTest
Tests run: 4, Failures: 0, Errors: 0, Skipped: 0, Time elapsed: 0.609 sec - in alluxio.worker.block.allocator.AllocatorFactoryTest
Tests run: 2, Failures: 0, Errors: 0, Skipped: 0, Time elapsed: 0.67 sec - in alluxio.worker.block.UnderFileSystemBlockStoreTest
[INFO] Done SpotBugs Analysis....
[INFO] 
[INFO] <<< spotbugs-maven-plugin:3.1.12.2:check (default) < :spotbugs @ alluxio-core-server-master <<<
[INFO] 
[INFO] 
[INFO] --- spotbugs-maven-plugin:3.1.12.2:check (default) @ alluxio-core-server-master ---
[INFO] BugInstance size is 0
[INFO] Error size is 0
[INFO] No errors/warnings found
[INFO] 
[INFO] --- swagger-maven-plugin:3.1.1:generate (default) @ alluxio-core-server-master ---
[INFO] Reflections took 69 ms to scan 183 urls, producing 5 keys and 5 values 
[INFO] Looking for path/query/header/form/cookie params in class java.lang.Boolean
[INFO] trying extension com.github.kongchen.swagger.docgen.jaxrs.BeanParamInjectParamExtention@40574599
[INFO] Writing doc to /usr/src/alluxio/generated/master/index.html...
[INFO] Done!
Tests run: 2, Failures: 0, Errors: 0, Skipped: 0, Time elapsed: 1.18 sec - in alluxio.worker.block.allocator.AllocatorContractTest
[INFO] 
[INFO] --- maven-resources-plugin:2.7:testResources (default-testResources) @ alluxio-core-server-master ---
[INFO] Using 'UTF-8' encoding to copy filtered resources.
[INFO] Copying 2 resources
[INFO] 
[INFO] --- maven-compiler-plugin:3.2:testCompile (default-testCompile) @ alluxio-core-server-master ---
[INFO] Changes detected - recompiling the module!
[INFO] Compiling 68 source files to /usr/src/alluxio/core/server/master/target/test-classes
Running alluxio.worker.block.allocator.GreedyAllocatorTest
Running alluxio.worker.block.allocator.MaxFreeAllocatorTest
Tests run: 1, Failures: 0, Errors: 0, Skipped: 0, Time elapsed: 0.473 sec - in alluxio.worker.block.allocator.GreedyAllocatorTest
Tests run: 1, Failures: 0, Errors: 0, Skipped: 0, Time elapsed: 0.493 sec - in alluxio.worker.block.allocator.MaxFreeAllocatorTest
Running alluxio.worker.block.allocator.RoundRobinAllocatorTest
Tests run: 33, Failures: 0, Errors: 0, Skipped: 0, Time elapsed: 5.835 sec - in alluxio.worker.block.TieredBlockStoreTest
[INFO] /usr/src/alluxio/core/server/master/src/test/java/alluxio/master/meta/AlluxioMasterRestServiceHandlerTest.java: /usr/src/alluxio/core/server/master/src/test/java/alluxio/master/meta/AlluxioMasterRestServiceHandlerTest.java uses or overrides a deprecated API.
[INFO] /usr/src/alluxio/core/server/master/src/test/java/alluxio/master/meta/AlluxioMasterRestServiceHandlerTest.java: Recompile with -Xlint:deprecation for details.
[INFO] /usr/src/alluxio/core/server/master/src/test/java/alluxio/master/meta/AlluxioMasterRestServiceHandlerTest.java: Some input files use unchecked or unsafe operations.
[INFO] /usr/src/alluxio/core/server/master/src/test/java/alluxio/master/meta/AlluxioMasterRestServiceHandlerTest.java: Recompile with -Xlint:unchecked for details.
[INFO] 
[INFO] --- maven-surefire-plugin:2.19.1:test (default-test) @ alluxio-core-server-master ---
-------------------------------------------------------
 T E S T S
-------------------------------------------------------
Tests run: 1, Failures: 0, Errors: 0, Skipped: 0, Time elapsed: 0.538 sec - in alluxio.worker.block.allocator.RoundRobinAllocatorTest
Running alluxio.worker.block.evictor.EvictorContractTest
[WARNING] netty-codec-http-4.1.30.Final.jar, netty-all-4.1.30.Final.jar define 338 overlapping classes: 
[WARNING]   - io.netty.handler.codec.http.HttpObjectDecoder$State
[WARNING]   - io.netty.handler.codec.http.websocketx.ContinuationWebSocketFrame
[WARNING]   - io.netty.handler.codec.http.multipart.InterfaceHttpData$HttpDataType
[WARNING]   - io.netty.handler.codec.http.websocketx.extensions.WebSocketClientExtensionHandler
[WARNING]   - io.netty.handler.codec.http.HttpClientCodec$Decoder
[WARNING]   - io.netty.handler.codec.http.ClientCookieEncoder
[WARNING]   - io.netty.handler.codec.http.HttpObjectDecoder$1
[WARNING]   - io.netty.handler.codec.http.HttpHeaderDateFormat$1
[WARNING]   - io.netty.handler.codec.http.HttpHeaders
[WARNING]   - io.netty.handler.codec.http.multipart.HttpPostBodyUtil
[WARNING]   - 328 more...
[WARNING] hadoop-yarn-common-2.6.0.jar, hadoop-yarn-api-2.6.0.jar define 3 overlapping classes: 
[WARNING]   - org.apache.hadoop.yarn.util.package-info
[WARNING]   - org.apache.hadoop.yarn.factories.package-info
[WARNING]   - org.apache.hadoop.yarn.factory.providers.package-info
[WARNING] netty-handler-proxy-4.1.30.Final.jar, netty-all-4.1.30.Final.jar define 9 overlapping classes: 
[WARNING]   - io.netty.handler.proxy.ProxyConnectException
[WARNING]   - io.netty.handler.proxy.ProxyHandler$LazyChannelPromise
[WARNING]   - io.netty.handler.proxy.Socks4ProxyHandler
[WARNING]   - io.netty.handler.proxy.ProxyHandler
[WARNING]   - io.netty.handler.proxy.ProxyHandler$1
[WARNING]   - io.netty.handler.proxy.ProxyHandler$2
[WARNING]   - io.netty.handler.proxy.HttpProxyHandler
[WARNING]   - io.netty.handler.proxy.ProxyConnectionEvent
[WARNING]   - io.netty.handler.proxy.Socks5ProxyHandler
[WARNING] netty-transport-4.1.30.Final.jar, netty-all-4.1.30.Final.jar define 350 overlapping classes: 
[WARNING]   - io.netty.channel.socket.nio.NioSocketChannel$3
[WARNING]   - io.netty.channel.AbstractCoalescingBufferQueue
[WARNING]   - io.netty.channel.AbstractChannel$AbstractUnsafe$8
[WARNING]   - io.netty.channel.SimpleUserEventChannelHandler
[WARNING]   - io.netty.channel.DefaultChannelPipeline$2
[WARNING]   - io.netty.channel.oio.AbstractOioChannel
[WARNING]   - io.netty.bootstrap.Bootstrap$1
[WARNING]   - io.netty.channel.group.ChannelMatchers$ClassMatcher
[WARNING]   - io.netty.channel.nio.AbstractNioMessageChannel$NioMessageUnsafe
[WARNING]   - io.netty.channel.RecvByteBufAllocator$Handle
[WARNING]   - 340 more...
[WARNING] netty-all-4.1.30.Final.jar, netty-common-4.1.30.Final.jar define 444 overlapping classes: 
[WARNING]   - io.netty.util.ResourceLeakException
[WARNING]   - io.netty.util.collection.CharObjectHashMap$KeySet
[WARNING]   - io.netty.util.Signal$SignalConstant
[WARNING]   - io.netty.util.concurrent.ImmediateExecutor
[WARNING]   - io.netty.util.AsciiString$CharEqualityComparator
[WARNING]   - io.netty.util.AsciiString$AsciiCaseInsensitiveCharEqualityComparator
[WARNING]   - io.netty.util.collection.LongObjectMap
[WARNING]   - io.netty.util.internal.shaded.org.jctools.queues.CircularArrayOffsetCalculator
[WARNING]   - io.netty.util.AsciiString$1
[WARNING]   - io.netty.util.internal.logging.AbstractInternalLogger
[WARNING]   - 434 more...
[WARNING] commons-beanutils-1.7.0.jar, commons-beanutils-core-1.8.0.jar, commons-collections-3.2.1.jar define 10 overlapping classes: 
[WARNING]   - org.apache.commons.collections.FastHashMap$EntrySet
[WARNING]   - org.apache.commons.collections.FastHashMap$KeySet
[WARNING]   - org.apache.commons.collections.FastHashMap$CollectionView$CollectionViewIterator
[WARNING]   - org.apache.commons.collections.ArrayStack
[WARNING]   - org.apache.commons.collections.FastHashMap$Values
[WARNING]   - org.apache.commons.collections.FastHashMap$CollectionView
[WARNING]   - org.apache.commons.collections.FastHashMap$1
[WARNING]   - org.apache.commons.collections.Buffer
[WARNING]   - org.apache.commons.collections.FastHashMap
[WARNING]   - org.apache.commons.collections.BufferUnderflowException
[WARNING] hadoop-yarn-common-2.6.0.jar, hadoop-yarn-client-2.6.0.jar define 2 overlapping classes: 
[WARNING]   - org.apache.hadoop.yarn.client.api.package-info
[WARNING]   - org.apache.hadoop.yarn.client.api.impl.package-info
[WARNING] netty-codec-http2-4.1.30.Final.jar, netty-all-4.1.30.Final.jar define 249 overlapping classes: 
[WARNING]   - io.netty.handler.codec.http2.DefaultHttp2LocalFlowController$FlowState
[WARNING]   - io.netty.handler.codec.http2.HpackUtil$IndexType
[WARNING]   - io.netty.handler.codec.http2.HpackEncoder$1
[WARNING]   - io.netty.handler.codec.http2.Http2FrameCodec$Http2RemoteFlowControllerListener
[WARNING]   - io.netty.handler.codec.http2.DefaultHttp2ConnectionEncoder$2
[WARNING]   - io.netty.handler.codec.http2.Http2FrameCodec
[WARNING]   - io.netty.handler.codec.http2.Http2ConnectionHandler$4
[WARNING]   - io.netty.handler.codec.http2.Http2MultiplexCodec$DefaultHttp2StreamChannel$Http2ChannelUnsafe$1
[WARNING]   - io.netty.handler.codec.http2.Http2ClientUpgradeCodec
[WARNING]   - io.netty.handler.codec.http2.DefaultHttp2RemoteFlowController$1
[WARNING]   - 239 more...
[WARNING] jline-2.14.6.jar, leveldbjni-all-1.8.jar define 4 overlapping classes: 
[WARNING]   - org.fusesource.hawtjni.runtime.Library
[WARNING]   - org.fusesource.hawtjni.runtime.PointerMath
[WARNING]   - org.fusesource.hawtjni.runtime.Callback
[WARNING]   - org.fusesource.hawtjni.runtime.JNIEnv
[WARNING] netty-buffer-4.1.30.Final.jar, netty-all-4.1.30.Final.jar define 114 overlapping classes: 
[WARNING]   - io.netty.buffer.AdvancedLeakAwareCompositeByteBuf
[WARNING]   - io.netty.buffer.UnsafeByteBufUtil
[WARNING]   - io.netty.buffer.AbstractReferenceCountedByteBuf
[WARNING]   - io.netty.buffer.FixedCompositeByteBuf$Component
[WARNING]   - io.netty.buffer.ByteBufUtil$HexUtil
[WARNING]   - io.netty.buffer.PoolArenaMetric
[WARNING]   - io.netty.buffer.PoolThreadCache$SubPageMemoryRegionCache
[WARNING]   - io.netty.buffer.ByteBufUtil$ThreadLocalDirectByteBuf$1
[WARNING]   - io.netty.buffer.PoolChunkMetric
[WARNING]   - io.netty.buffer.UnpooledDuplicatedByteBuf
[WARNING]   - 104 more...
[WARNING] netty-codec-4.1.30.Final.jar, netty-all-4.1.30.Final.jar define 197 overlapping classes: 
[WARNING]   - io.netty.handler.codec.compression.ZlibUtil
[WARNING]   - io.netty.handler.codec.CharSequenceValueConverter
[WARNING]   - io.netty.handler.codec.compression.Bzip2Encoder$3
[WARNING]   - io.netty.handler.codec.DefaultHeaders$1
[WARNING]   - io.netty.handler.codec.compression.Bzip2BlockDecompressor
[WARNING]   - io.netty.handler.codec.compression.Lz4FrameDecoder$1
[WARNING]   - io.netty.handler.codec.compression.SnappyFrameDecoder
[WARNING]   - io.netty.handler.codec.compression.DecompressionException
[WARNING]   - io.netty.handler.codec.compression.Bzip2DivSufSort$TRBudget
[WARNING]   - io.netty.handler.codec.compression.Bzip2Decoder$State
[WARNING]   - 187 more...
[WARNING] netty-resolver-4.1.30.Final.jar, netty-all-4.1.30.Final.jar define 26 overlapping classes: 
[WARNING]   - io.netty.resolver.RoundRobinInetAddressResolver
[WARNING]   - io.netty.resolver.CompositeNameResolver$2
[WARNING]   - io.netty.resolver.DefaultHostsFileEntriesResolver
[WARNING]   - io.netty.resolver.InetSocketAddressResolver$1
[WARNING]   - io.netty.resolver.DefaultNameResolver
[WARNING]   - io.netty.resolver.HostsFileEntriesResolver
[WARNING]   - io.netty.resolver.AddressResolverGroup
[WARNING]   - io.netty.resolver.InetSocketAddressResolver
[WARNING]   - io.netty.resolver.NoopAddressResolver
[WARNING]   - io.netty.resolver.SimpleNameResolver
[WARNING]   - 16 more...
[WARNING] commons-beanutils-1.7.0.jar, commons-beanutils-core-1.8.0.jar define 82 overlapping classes: 
[WARNING]   - org.apache.commons.beanutils.ConvertUtilsBean
[WARNING]   - org.apache.commons.beanutils.converters.SqlTimeConverter
[WARNING]   - org.apache.commons.beanutils.Converter
[WARNING]   - org.apache.commons.beanutils.converters.FloatArrayConverter
[WARNING]   - org.apache.commons.beanutils.NestedNullException
[WARNING]   - org.apache.commons.beanutils.ConvertingWrapDynaBean
[WARNING]   - org.apache.commons.beanutils.converters.LongArrayConverter
[WARNING]   - org.apache.commons.beanutils.converters.SqlDateConverter
[WARNING]   - org.apache.commons.beanutils.converters.BooleanArrayConverter
[WARNING]   - org.apache.commons.beanutils.converters.StringConverter
[WARNING]   - 72 more...
[WARNING] netty-codec-socks-4.1.30.Final.jar, netty-all-4.1.30.Final.jar define 107 overlapping classes: 
[WARNING]   - io.netty.handler.codec.socks.SocksInitRequestDecoder
[WARNING]   - io.netty.handler.codec.socks.UnknownSocksResponse
[WARNING]   - io.netty.handler.codec.socksx.v5.DefaultSocks5PasswordAuthRequest
[WARNING]   - io.netty.handler.codec.socks.SocksCmdType
[WARNING]   - io.netty.handler.codec.socks.SocksCmdResponse
[WARNING]   - io.netty.handler.codec.socksx.v5.Socks5CommandRequest
[WARNING]   - io.netty.handler.codec.socksx.v5.Socks5PasswordAuthResponseDecoder$State
[WARNING]   - io.netty.handler.codec.socks.SocksResponse
[WARNING]   - io.netty.handler.codec.socksx.v5.Socks5InitialRequest
[WARNING]   - io.netty.handler.codec.socksx.v5.Socks5CommandType
[WARNING]   - 97 more...
[WARNING] netty-handler-4.1.30.Final.jar, netty-all-4.1.30.Final.jar define 254 overlapping classes: 
[WARNING]   - io.netty.handler.ssl.ApplicationProtocolNegotiator
[WARNING]   - io.netty.handler.ssl.Java9SslUtils$6
[WARNING]   - io.netty.handler.ssl.JdkDefaultApplicationProtocolNegotiator
[WARNING]   - io.netty.handler.ssl.PemReader
[WARNING]   - io.netty.handler.timeout.IdleStateHandler
[WARNING]   - io.netty.handler.ipfilter.IpSubnetFilterRule
[WARNING]   - io.netty.handler.traffic.GlobalChannelTrafficShapingHandler$1
[WARNING]   - io.netty.handler.ssl.OpenSslPrivateKey$OpenSslPrivateKeyMaterial
[WARNING]   - io.netty.handler.ssl.OpenSslCertificateException
[WARNING]   - io.netty.handler.ssl.SniHandler$Selection
[WARNING]   - 244 more...
[WARNING] maven-shade-plugin has detected that some class files are
[WARNING] present in two or more JARs. When this happens, only one
[WARNING] single version of the class is copied to the uber jar.
[WARNING] Usually this is not harmful and you can skip these warnings,
[WARNING] otherwise try to manually exclude artifacts based on
[WARNING] mvn dependency:tree -Ddetail=true and the above output.
[WARNING] See http://maven.apache.org/plugins/maven-shade-plugin/
[INFO] Replacing /usr/src/alluxio/assembly/client/target/alluxio-assembly-client-2.2.0-SNAPSHOT-jar-with-dependencies.jar with /usr/src/alluxio/assembly/client/target/alluxio-assembly-client-2.2.0-SNAPSHOT-shaded.jar
[INFO] 
[INFO] --- maven-install-plugin:2.4:install (default-install) @ alluxio-assembly-client ---
[INFO] Installing /usr/src/alluxio/assembly/client/target/alluxio-assembly-client-2.2.0-SNAPSHOT.jar to /home/jenkins/.m2/repository/org/alluxio/alluxio-assembly-client/2.2.0-SNAPSHOT/alluxio-assembly-client-2.2.0-SNAPSHOT.jar
[INFO] Installing /usr/src/alluxio/assembly/client/pom.xml to /home/jenkins/.m2/repository/org/alluxio/alluxio-assembly-client/2.2.0-SNAPSHOT/alluxio-assembly-client-2.2.0-SNAPSHOT.pom
Running alluxio.worker.block.evictor.EvictorFactoryTest
Running alluxio.master.block.BlockMasterMetricsTest
Running alluxio.master.block.BlockMasterTest
Running alluxio.master.AlluxioMasterProcessTest
Running alluxio.worker.block.evictor.LRFUEvictorTest
Running alluxio.master.SafeModeManagerTest
Tests run: 3, Failures: 0, Errors: 0, Skipped: 0, Time elapsed: 0.463 sec - in alluxio.worker.block.evictor.EvictorFactoryTest
Running alluxio.worker.block.evictor.LRUEvictorTest
Tests run: 9, Failures: 0, Errors: 0, Skipped: 0, Time elapsed: 0.469 sec - in alluxio.master.SafeModeManagerTest
Tests run: 2, Failures: 0, Errors: 0, Skipped: 0, Time elapsed: 0.684 sec - in alluxio.master.block.BlockMasterMetricsTest
Tests run: 7, Failures: 0, Errors: 0, Skipped: 0, Time elapsed: 1.034 sec - in alluxio.worker.block.evictor.EvictorContractTest
Tests run: 3, Failures: 0, Errors: 0, Skipped: 0, Time elapsed: 0.645 sec - in alluxio.worker.block.evictor.LRFUEvictorTest
Tests run: 4, Failures: 0, Errors: 0, Skipped: 0, Time elapsed: 0.556 sec - in alluxio.worker.block.evictor.LRUEvictorTest
Running alluxio.worker.block.evictor.PartialLRUEvictorTest
Tests run: 13, Failures: 0, Errors: 0, Skipped: 0, Time elapsed: 1.077 sec - in alluxio.master.block.BlockMasterTest
Running alluxio.master.block.meta.BlockContainerIdGeneratorTest
Tests run: 2, Failures: 0, Errors: 0, Skipped: 0, Time elapsed: 0.087 sec - in alluxio.master.block.meta.BlockContainerIdGeneratorTest
Running alluxio.master.block.meta.MasterBlockInfoTest
Running alluxio.worker.block.meta.BlockMetaTest
Running alluxio.worker.block.meta.AbstractBlockMetaTest
Tests run: 3, Failures: 0, Errors: 0, Skipped: 0, Time elapsed: 0.556 sec - in alluxio.worker.block.evictor.PartialLRUEvictorTest
Tests run: 10, Failures: 0, Errors: 0, Skipped: 0, Time elapsed: 0.234 sec - in alluxio.master.block.meta.MasterBlockInfoTest
Running alluxio.worker.block.meta.StorageDirTest
[INFO] Done SpotBugs Analysis....
Tests run: 2, Failures: 0, Errors: 0, Skipped: 0, Time elapsed: 0.422 sec - in alluxio.worker.block.meta.BlockMetaTest
Running alluxio.master.block.meta.MasterWorkerInfoTest
[INFO] 
[INFO] <<< spotbugs-maven-plugin:3.1.12.2:check (default) < :spotbugs @ alluxio-job-server <<<
[INFO] 
[INFO] 
[INFO] --- spotbugs-maven-plugin:3.1.12.2:check (default) @ alluxio-job-server ---
[INFO] BugInstance size is 0
[INFO] Error size is 0
[INFO] No errors/warnings found
[INFO] 
[INFO] --- swagger-maven-plugin:3.1.1:generate (default) @ alluxio-job-server ---
Tests run: 3, Failures: 0, Errors: 0, Skipped: 0, Time elapsed: 0.48 sec - in alluxio.worker.block.meta.AbstractBlockMetaTest
[INFO] Reflections took 110 ms to scan 244 urls, producing 4 keys and 4 values 
Tests run: 9, Failures: 0, Errors: 0, Skipped: 0, Time elapsed: 0.214 sec - in alluxio.master.block.meta.MasterWorkerInfoTest
Running alluxio.master.file.AccessTimeUpdaterTest
[INFO] Reflections took 102 ms to scan 244 urls, producing 4 keys and 4 values 
[INFO] Looking for path/query/header/form/cookie params in class java.lang.Boolean
[INFO] trying extension com.github.kongchen.swagger.docgen.jaxrs.BeanParamInjectParamExtention@1a7a09e2
[INFO] Looking for path/query/header/form/cookie params in class java.lang.Boolean
[INFO] trying extension com.github.kongchen.swagger.docgen.jaxrs.BeanParamInjectParamExtention@1a7a09e2
[INFO] Writing doc to /usr/src/alluxio/generated/job/index.html...
[INFO] Done!
[INFO] 
[INFO] --- maven-resources-plugin:2.7:testResources (default-testResources) @ alluxio-job-server ---
[INFO] Using 'UTF-8' encoding to copy filtered resources.
[INFO] Copying 1 resource
[INFO] 
[INFO] --- maven-compiler-plugin:3.2:testCompile (default-testCompile) @ alluxio-job-server ---
[INFO] Changes detected - recompiling the module!
[INFO] Compiling 24 source files to /usr/src/alluxio/job/server/target/test-classes
Running alluxio.worker.block.meta.StorageDirViewTest
Running alluxio.master.file.FileSystemMasterMetricsTest
Tests run: 26, Failures: 0, Errors: 0, Skipped: 0, Time elapsed: 0.736 sec - in alluxio.worker.block.meta.StorageDirTest
Running alluxio.worker.block.meta.StorageTierTest
[INFO] /usr/src/alluxio/job/server/src/test/java/alluxio/job/plan/transform/BaseTransformTest.java: /usr/src/alluxio/job/server/src/test/java/alluxio/job/plan/transform/BaseTransformTest.java uses or overrides a deprecated API.
[INFO] /usr/src/alluxio/job/server/src/test/java/alluxio/job/plan/transform/BaseTransformTest.java: Recompile with -Xlint:deprecation for details.
[INFO] /usr/src/alluxio/job/server/src/test/java/alluxio/master/job/JobMasterTest.java: /usr/src/alluxio/job/server/src/test/java/alluxio/master/job/JobMasterTest.java uses unchecked or unsafe operations.
[INFO] /usr/src/alluxio/job/server/src/test/java/alluxio/master/job/JobMasterTest.java: Recompile with -Xlint:unchecked for details.
[INFO] 
[INFO] --- maven-surefire-plugin:2.19.1:test (default-test) @ alluxio-job-server ---

-------------------------------------------------------
 T E S T S
-------------------------------------------------------
Running alluxio.worker.block.meta.StorageTierViewTest
Running alluxio.master.file.FileSystemMasterOptionsTest
Tests run: 9, Failures: 0, Errors: 0, Skipped: 0, Time elapsed: 0.759 sec - in alluxio.worker.block.meta.StorageDirViewTest
Tests run: 3, Failures: 0, Errors: 0, Skipped: 0, Time elapsed: 0.685 sec - in alluxio.master.file.FileSystemMasterMetricsTest
Tests run: 8, Failures: 0, Errors: 0, Skipped: 0, Time elapsed: 0.599 sec - in alluxio.worker.block.meta.StorageTierTest
Running alluxio.job.plan.PlanDefinitionRegistryTest
Running alluxio.job.command.CommandHandlingExecutorTest
Running alluxio.job.plan.migrate.MigrateDefinitionRunTaskTest
Tests run: 1, Failures: 0, Errors: 0, Skipped: 0, Time elapsed: 0.413 sec - in alluxio.master.file.FileSystemMasterOptionsTest
Running alluxio.job.plan.load.LoadDefinitionTest
Tests run: 6, Failures: 0, Errors: 0, Skipped: 0, Time elapsed: 0.616 sec - in alluxio.worker.block.meta.StorageTierViewTest
Running alluxio.worker.block.meta.TempBlockMetaTest
Tests run: 2, Failures: 0, Errors: 0, Skipped: 0, Time elapsed: 0.192 sec - in alluxio.job.plan.PlanDefinitionRegistryTest
Tests run: 3, Failures: 0, Errors: 0, Skipped: 1, Time elapsed: 3.615 sec - in alluxio.master.AlluxioMasterProcessTest
Tests run: 4, Failures: 0, Errors: 0, Skipped: 0, Time elapsed: 0.497 sec - in alluxio.worker.block.meta.TempBlockMetaTest
Running alluxio.worker.grpc.BlockReadHandlerTest
Running alluxio.master.file.FileSystemMasterTest
Running alluxio.worker.grpc.BlockWriteHandlerTest
Running alluxio.master.file.PermissionCheckTest
Running alluxio.worker.grpc.GrpcExecutorsTest
Running alluxio.job.plan.migrate.MigrateDefinitionSelectExecutorsTest
Running alluxio.master.file.PermissionCheckerTest
Running alluxio.worker.grpc.UfsFallbackBlockWriteHandlerTest
Tests run: 3, Failures: 0, Errors: 0, Skipped: 0, Time elapsed: 0.714 sec - in alluxio.worker.grpc.GrpcExecutorsTest
Tests run: 9, Failures: 0, Errors: 0, Skipped: 0, Time elapsed: 1.457 sec - in alluxio.worker.grpc.BlockWriteHandlerTest
Running alluxio.worker.grpc.UfsFileWriteHandlerTest
Tests run: 15, Failures: 0, Errors: 0, Skipped: 0, Time elapsed: 1.08 sec - in alluxio.master.file.PermissionCheckerTest
Tests run: 12, Failures: 0, Errors: 0, Skipped: 0, Time elapsed: 2.624 sec - in alluxio.job.plan.migrate.MigrateDefinitionRunTaskTest
Tests run: 4, Failures: 0, Errors: 0, Skipped: 0, Time elapsed: 2.659 sec - in alluxio.job.plan.load.LoadDefinitionTest
Tests run: 1, Failures: 0, Errors: 0, Skipped: 0, Time elapsed: 2.913 sec - in alluxio.job.command.CommandHandlingExecutorTest
Tests run: 10, Failures: 0, Errors: 0, Skipped: 0, Time elapsed: 1.513 sec - in alluxio.worker.grpc.UfsFallbackBlockWriteHandlerTest
Tests run: 7, Failures: 0, Errors: 0, Skipped: 0, Time elapsed: 2.574 sec - in alluxio.worker.grpc.BlockReadHandlerTest
Running alluxio.master.file.PersistJobTest
Running alluxio.job.plan.replicate.EvictDefinitionTest
Running alluxio.job.plan.persist.PersistDefinitionTest
Tests run: 1, Failures: 0, Errors: 0, Skipped: 0, Time elapsed: 0.186 sec - in alluxio.master.file.PersistJobTest
Tests run: 9, Failures: 0, Errors: 0, Skipped: 0, Time elapsed: 1.071 sec - in alluxio.worker.grpc.UfsFileWriteHandlerTest
Tests run: 18, Failures: 0, Errors: 0, Skipped: 0, Time elapsed: 2.601 sec - in alluxio.job.plan.migrate.MigrateDefinitionSelectExecutorsTest
Running alluxio.job.plan.replicate.ReplicateDefinitionTest
Results :
Tests run: 276, Failures: 0, Errors: 0, Skipped: 0
[INFO] 
[INFO] --- maven-jar-plugin:2.4:jar (default-jar) @ alluxio-core-server-worker ---
Tests run: 45, Failures: 0, Errors: 0, Skipped: 0, Time elapsed: 3.016 sec - in alluxio.master.file.PermissionCheckTest
[INFO] Building jar: /usr/src/alluxio/core/server/worker/target/alluxio-core-server-worker-2.2.0-SNAPSHOT.jar
[INFO] 
[INFO] >>> maven-source-plugin:2.3:jar (attach-sources) > generate-sources @ alluxio-core-server-worker >>>
[INFO] 
[INFO] --- maven-enforcer-plugin:1.4:enforce (enforce-maven) @ alluxio-core-server-worker ---
[INFO] 
[INFO] --- maven-enforcer-plugin:1.4:enforce (enforce-versions) @ alluxio-core-server-worker ---
[INFO] 
[INFO] --- maven-checkstyle-plugin:2.17:check (checkstyle) @ alluxio-core-server-worker ---
Running alluxio.master.file.PersistenceTest
Tests run: 5, Failures: 0, Errors: 0, Skipped: 0, Time elapsed: 5.677 sec - in alluxio.master.file.AccessTimeUpdaterTest
Running alluxio.job.plan.transform.CompactDefinitionSelectExecutorsTest
[WARNING] Discovered module-info.class. Shading will break its strong encapsulation.
Running alluxio.master.file.RpcContextTest
[WARNING] Discovered module-info.class. Shading will break its strong encapsulation.
[WARNING] Discovered module-info.class. Shading will break its strong encapsulation.
[INFO] Starting audit...
Audit done.
[INFO] 
[INFO] --- license-maven-plugin:2.9:check (default) @ alluxio-core-server-worker ---
[INFO] Checking licenses...
[INFO] 
[INFO] <<< maven-source-plugin:2.3:jar (attach-sources) < generate-sources @ alluxio-core-server-worker <<<
[INFO] 
[INFO] 
[INFO] --- maven-source-plugin:2.3:jar (attach-sources) @ alluxio-core-server-worker ---
[WARNING] javax.jdo-3.2.0-m3.jar, jdo-api-3.0.1.jar define 180 overlapping classes: 
[WARNING]   - javax.jdo.spi.JDOImplHelper$Meta
[WARNING]   - javax.jdo.annotations.ForeignKey
[WARNING]   - javax.jdo.metadata.InheritanceMetadata
[WARNING]   - javax.jdo.JDOHelper$16
[WARNING]   - javax.jdo.spi.JDOImplHelper
[WARNING]   - javax.jdo.identity.ObjectIdentity
[WARNING]   - javax.jdo.annotations.FetchGroups
[WARNING]   - javax.jdo.listener.StoreLifecycleListener
[WARNING]   - javax.jdo.annotations.Value
[WARNING]   - javax.jdo.JDODataStoreException
[WARNING]   - 170 more...
[WARNING] servlet-api-2.4.jar, javax.servlet-3.0.0.v201112011016.jar define 42 overlapping classes: 
[WARNING]   - javax.servlet.http.Cookie
[WARNING]   - javax.servlet.http.HttpSessionBindingEvent
[WARNING]   - javax.servlet.http.NoBodyResponse
[WARNING]   - javax.servlet.ServletContext
[WARNING]   - javax.servlet.ServletOutputStream
[WARNING]   - javax.servlet.http.HttpSessionListener
[WARNING]   - javax.servlet.http.HttpSessionContext
[WARNING]   - javax.servlet.FilterChain
[WARNING]   - javax.servlet.GenericServlet
[WARNING]   - javax.servlet.http.HttpServletRequestWrapper
[WARNING]   - 32 more...
[INFO] Building jar: /usr/src/alluxio/core/server/worker/target/alluxio-core-server-worker-2.2.0-SNAPSHOT-sources.jar
[WARNING] htrace-core4-4.0.1-incubating.jar, htrace-core-3.1.0-incubating.jar define 717 overlapping classes: 
[WARNING]   - org.apache.htrace.fasterxml.jackson.databind.introspect.BasicBeanDescription
[WARNING]   - org.apache.htrace.fasterxml.jackson.databind.KeyDeserializer$None
[WARNING]   - org.apache.htrace.fasterxml.jackson.databind.PropertyNamingStrategy$LowerCaseWithUnderscoresStrategy
[WARNING]   - org.apache.htrace.fasterxml.jackson.databind.deser.DataFormatReaders
[WARNING]   - org.apache.htrace.fasterxml.jackson.databind.deser.std.EnumDeserializer
[WARNING]   - org.apache.htrace.fasterxml.jackson.databind.node.NumericNode
[WARNING]   - org.apache.htrace.fasterxml.jackson.databind.deser.std.PrimitiveArrayDeserializers$ShortDeser
[WARNING]   - org.apache.htrace.fasterxml.jackson.core.JsonPointer
[WARNING]   - org.apache.htrace.fasterxml.jackson.databind.introspect.VisibilityChecker
[WARNING]   - org.apache.htrace.fasterxml.jackson.databind.ser.impl.UnknownSerializer
[WARNING]   - 707 more...
[WARNING] jasper-runtime-5.5.23.jar, jasper-compiler-5.5.23.jar define 1 overlapping classes: 
[WARNING]   - org.apache.jasper.compiler.Localizer
[WARNING] ant-1.9.1.jar, ant-1.6.5.jar define 554 overlapping classes: 
[WARNING]   - org.apache.tools.ant.taskdefs.WhichResource
[WARNING]   - org.apache.tools.ant.types.selectors.PresentSelector
[WARNING]   - org.apache.tools.ant.taskdefs.Touch$DateFormatFactory
[WARNING]   - org.apache.tools.ant.util.facade.FacadeTaskHelper
[WARNING]   - org.apache.tools.ant.helper.DefaultExecutor
[WARNING]   - org.apache.tools.ant.DefaultLogger
[WARNING]   - org.apache.tools.ant.taskdefs.Javadoc$DocletParam
[WARNING]   - org.apache.tools.ant.types.selectors.SelectorScanner
[WARNING]   - org.apache.tools.ant.types.PatternSet$NameEntry
[WARNING]   - org.apache.tools.ant.taskdefs.Nice
[WARNING]   - 544 more...
[WARNING] commons-beanutils-1.7.0.jar, commons-beanutils-core-1.8.0.jar, commons-collections-3.2.1.jar define 10 overlapping classes: 
[WARNING]   - org.apache.commons.collections.FastHashMap$EntrySet
[WARNING]   - org.apache.commons.collections.FastHashMap$KeySet
[WARNING]   - org.apache.commons.collections.ArrayStack
[WARNING]   - org.apache.commons.collections.FastHashMap$CollectionView$CollectionViewIterator
[WARNING]   - org.apache.commons.collections.FastHashMap$Values
[WARNING]   - org.apache.commons.collections.FastHashMap$CollectionView
[WARNING]   - org.apache.commons.collections.FastHashMap$1
[WARNING]   - org.apache.commons.collections.Buffer
[WARNING]   - org.apache.commons.collections.FastHashMap
[WARNING]   - org.apache.commons.collections.BufferUnderflowException
[WARNING] jline-2.14.6.jar, leveldbjni-all-1.8.jar define 4 overlapping classes: 
[WARNING]   - org.fusesource.hawtjni.runtime.Library
[WARNING]   - org.fusesource.hawtjni.runtime.PointerMath
[WARNING]   - org.fusesource.hawtjni.runtime.Callback
[WARNING]   - org.fusesource.hawtjni.runtime.JNIEnv
[WARNING] commons-beanutils-1.7.0.jar, commons-beanutils-core-1.8.0.jar define 82 overlapping classes: 
[WARNING]   - org.apache.commons.beanutils.ConvertUtilsBean
[WARNING]   - org.apache.commons.beanutils.converters.SqlTimeConverter
[WARNING]   - org.apache.commons.beanutils.Converter
[WARNING]   - org.apache.commons.beanutils.converters.FloatArrayConverter
[WARNING]   - org.apache.commons.beanutils.NestedNullException
[WARNING]   - org.apache.commons.beanutils.ConvertingWrapDynaBean
[WARNING]   - org.apache.commons.beanutils.converters.LongArrayConverter
[WARNING]   - org.apache.commons.beanutils.converters.SqlDateConverter
[WARNING]   - org.apache.commons.beanutils.converters.BooleanArrayConverter
[WARNING]   - org.apache.commons.beanutils.converters.StringConverter
[WARNING]   - 72 more...
[WARNING] jta-1.1.jar, geronimo-jta_1.1_spec-1.1.1.jar, transaction-api-1.1.jar define 18 overlapping classes: 
[WARNING]   - javax.transaction.Status
[WARNING]   - javax.transaction.UserTransaction
[WARNING]   - javax.transaction.TransactionRequiredException
[WARNING]   - javax.transaction.xa.XAResource
[WARNING]   - javax.transaction.Transaction
[WARNING]   - javax.transaction.InvalidTransactionException
[WARNING]   - javax.transaction.SystemException
[WARNING]   - javax.transaction.HeuristicCommitException
[WARNING]   - javax.transaction.NotSupportedException
[WARNING]   - javax.transaction.TransactionManager
[WARNING]   - 8 more...
[WARNING] hadoop-yarn-common-2.5.1.jar, hadoop-yarn-api-2.8.0.jar define 2 overlapping classes: 
[WARNING]   - org.apache.hadoop.yarn.factories.package-info
[WARNING]   - org.apache.hadoop.yarn.factory.providers.package-info
[WARNING] maven-shade-plugin has detected that some class files are
[WARNING] present in two or more JARs. When this happens, only one
[WARNING] single version of the class is copied to the uber jar.
[WARNING] Usually this is not harmful and you can skip these warnings,
[WARNING] otherwise try to manually exclude artifacts based on
[WARNING] mvn dependency:tree -Ddetail=true and the above output.
[WARNING] See http://maven.apache.org/plugins/maven-shade-plugin/
[INFO] 
[INFO] --- maven-javadoc-plugin:2.9:jar (attach-javadoc) @ alluxio-core-server-worker ---
[INFO] Skipping javadoc generation
[INFO] 
[INFO] --- maven-install-plugin:2.4:install (default-install) @ alluxio-core-server-worker ---
[INFO] Installing /usr/src/alluxio/core/server/worker/target/alluxio-core-server-worker-2.2.0-SNAPSHOT.jar to /home/jenkins/.m2/repository/org/alluxio/alluxio-core-server-worker/2.2.0-SNAPSHOT/alluxio-core-server-worker-2.2.0-SNAPSHOT.jar
[INFO] Installing /usr/src/alluxio/core/server/worker/pom.xml to /home/jenkins/.m2/repository/org/alluxio/alluxio-core-server-worker/2.2.0-SNAPSHOT/alluxio-core-server-worker-2.2.0-SNAPSHOT.pom
[INFO] Installing /usr/src/alluxio/core/server/worker/target/alluxio-core-server-worker-2.2.0-SNAPSHOT-sources.jar to /home/jenkins/.m2/repository/org/alluxio/alluxio-core-server-worker/2.2.0-SNAPSHOT/alluxio-core-server-worker-2.2.0-SNAPSHOT-sources.jar
[INFO] Replacing /usr/src/alluxio/table/server/underdb/hive/target/alluxio-table-server-underdb-hive-2.2.0-SNAPSHOT-jar-with-dependencies.jar with /usr/src/alluxio/table/server/underdb/hive/target/alluxio-table-server-underdb-hive-2.2.0-SNAPSHOT-shaded.jar
[INFO] 
[INFO] --- maven-jar-plugin:2.4:test-jar (default) @ alluxio-table-server-underdb-hive ---
[INFO] Building jar: /usr/src/alluxio/table/server/underdb/hive/target/alluxio-table-server-underdb-hive-2.2.0-SNAPSHOT-tests.jar
[INFO] 
[INFO] --- maven-install-plugin:2.4:install (default-install) @ alluxio-table-server-underdb-hive ---
[INFO] Installing /usr/src/alluxio/table/server/underdb/hive/target/alluxio-table-server-underdb-hive-2.2.0-SNAPSHOT.jar to /home/jenkins/.m2/repository/org/alluxio/alluxio-table-server-underdb-hive/2.2.0-SNAPSHOT/alluxio-table-server-underdb-hive-2.2.0-SNAPSHOT.jar
[INFO] Installing /usr/src/alluxio/table/server/underdb/hive/pom.xml to /home/jenkins/.m2/repository/org/alluxio/alluxio-table-server-underdb-hive/2.2.0-SNAPSHOT/alluxio-table-server-underdb-hive-2.2.0-SNAPSHOT.pom
[INFO] Installing /usr/src/alluxio/table/server/underdb/hive/target/alluxio-table-server-underdb-hive-2.2.0-SNAPSHOT-sources.jar to /home/jenkins/.m2/repository/org/alluxio/alluxio-table-server-underdb-hive/2.2.0-SNAPSHOT/alluxio-table-server-underdb-hive-2.2.0-SNAPSHOT-sources.jar
[INFO] Installing /usr/src/alluxio/table/server/underdb/hive/target/alluxio-table-server-underdb-hive-2.2.0-SNAPSHOT-tests.jar to /home/jenkins/.m2/repository/org/alluxio/alluxio-table-server-underdb-hive/2.2.0-SNAPSHOT/alluxio-table-server-underdb-hive-2.2.0-SNAPSHOT-tests.jar
[INFO] 
[INFO] --- copy-rename-maven-plugin:1.0:copy (copy-and-rename-file) @ alluxio-table-server-underdb-hive ---
Tests run: 6, Failures: 0, Errors: 0, Skipped: 0, Time elapsed: 0.55 sec - in alluxio.master.file.RpcContextTest
Running alluxio.master.file.async.DefaultAsyncPersistHandlerTest
[INFO] Copied /usr/src/alluxio/table/server/underdb/hive/target/alluxio-table-server-underdb-hive-2.2.0-SNAPSHOT-jar-with-dependencies.jar to /usr/src/alluxio/lib/alluxio-table-server-underdb-hive-2.2.0-SNAPSHOT.jar
Tests run: 2, Failures: 0, Errors: 0, Skipped: 0, Time elapsed: 2.015 sec - in alluxio.job.plan.persist.PersistDefinitionTest
Tests run: 6, Failures: 0, Errors: 0, Skipped: 0, Time elapsed: 2.039 sec - in alluxio.job.plan.replicate.EvictDefinitionTest
Tests run: 3, Failures: 0, Errors: 0, Skipped: 0, Time elapsed: 0.389 sec - in alluxio.master.file.async.DefaultAsyncPersistHandlerTest
Running alluxio.master.file.meta.AsyncUfsAbsentPathCacheTest
Running alluxio.job.plan.transform.format.JobPathTest
Running alluxio.job.plan.transform.format.ReadWriteTest
Running alluxio.master.file.meta.CompositeInodeLockListTest
Tests run: 9, Failures: 0, Errors: 0, Skipped: 0, Time elapsed: 3.137 sec - in alluxio.job.plan.replicate.ReplicateDefinitionTest
Tests run: 6, Failures: 0, Errors: 0, Skipped: 0, Time elapsed: 0.484 sec - in alluxio.master.file.meta.CompositeInodeLockListTest
Tests run: 6, Failures: 0, Errors: 0, Skipped: 0, Time elapsed: 1.079 sec - in alluxio.master.file.meta.AsyncUfsAbsentPathCacheTest
Running alluxio.master.file.meta.InodeLockManagerTest
Running alluxio.job.workflow.WorkflowExecutionRegistryTest
Tests run: 2, Failures: 0, Errors: 0, Skipped: 0, Time elapsed: 0.189 sec - in alluxio.job.workflow.WorkflowExecutionRegistryTest
Running alluxio.master.file.meta.InodeTreeBufferedIteratorTest
Tests run: 1, Failures: 0, Errors: 0, Skipped: 0, Time elapsed: 3.863 sec - in alluxio.job.plan.transform.CompactDefinitionSelectExecutorsTest
Tests run: 1, Failures: 0, Errors: 0, Skipped: 0, Time elapsed: 2.226 sec - in alluxio.job.plan.transform.format.ReadWriteTest
Tests run: 2, Failures: 0, Errors: 0, Skipped: 0, Time elapsed: 0.948 sec - in alluxio.master.file.meta.InodeLockManagerTest
Running alluxio.master.job.JobMasterTest
Tests run: 3, Failures: 0, Errors: 0, Skipped: 0, Time elapsed: 0.952 sec - in alluxio.master.file.meta.InodeTreeBufferedIteratorTest
Running alluxio.master.job.command.CommandManagerTest
Running alluxio.master.file.meta.InodeTreeTest
Running alluxio.master.job.plan.PlanCoordinatorTest
Tests run: 2, Failures: 0, Errors: 0, Skipped: 0, Time elapsed: 0.263 sec - in alluxio.master.job.command.CommandManagerTest
Running alluxio.master.file.meta.LazyUfsBlockLocationCacheTest
Tests run: 1, Failures: 0, Errors: 0, Skipped: 0, Time elapsed: 3.604 sec - in alluxio.job.plan.transform.format.JobPathTest
Running alluxio.master.job.plan.PlanTrackerTest
Tests run: 1, Failures: 0, Errors: 0, Skipped: 0, Time elapsed: 0.91 sec - in alluxio.master.file.meta.LazyUfsBlockLocationCacheTest
Running alluxio.master.job.workflow.WorkflowTrackerTest
Tests run: 28, Failures: 0, Errors: 0, Skipped: 0, Time elapsed: 1.691 sec - in alluxio.master.file.meta.InodeTreeTest
Tests run: 6, Failures: 0, Errors: 0, Skipped: 0, Time elapsed: 0.781 sec - in alluxio.master.job.plan.PlanTrackerTest
Tests run: 6, Failures: 0, Errors: 0, Skipped: 0, Time elapsed: 2.575 sec - in alluxio.master.job.JobMasterTest
Tests run: 2, Failures: 0, Errors: 0, Skipped: 0, Time elapsed: 0.721 sec - in alluxio.master.job.workflow.WorkflowTrackerTest
Running alluxio.master.file.meta.LockedInodePathTest
Tests run: 9, Failures: 0, Errors: 0, Skipped: 0, Time elapsed: 2.291 sec - in alluxio.master.job.plan.PlanCoordinatorTest
Running alluxio.master.file.meta.MountTableTest
Running alluxio.worker.job.task.TaskExecutorTest
Tests run: 28, Failures: 0, Errors: 0, Skipped: 0, Time elapsed: 0.541 sec - in alluxio.master.file.meta.LockedInodePathTest
Tests run: 7, Failures: 0, Errors: 0, Skipped: 0, Time elapsed: 0.738 sec - in alluxio.master.file.meta.MountTableTest
Running alluxio.master.file.meta.MutableInodeDirectoryTest
Tests run: 99, Failures: 0, Errors: 0, Skipped: 0, Time elapsed: 12.323 sec - in alluxio.master.file.FileSystemMasterTest
Tests run: 15, Failures: 0, Errors: 0, Skipped: 0, Time elapsed: 0.384 sec - in alluxio.master.file.meta.MutableInodeDirectoryTest
Running alluxio.master.file.meta.MutableInodeFileTest
Tests run: 2, Failures: 0, Errors: 0, Skipped: 0, Time elapsed: 1.51 sec - in alluxio.worker.job.task.TaskExecutorTest
Tests run: 7, Failures: 0, Errors: 0, Skipped: 0, Time elapsed: 0.383 sec - in alluxio.master.file.meta.MutableInodeFileTest
Running alluxio.master.file.meta.SimpleInodeLockListTest
Running alluxio.master.file.meta.TtlBucketListTest

Results :

Tests run: 86, Failures: 0, Errors: 0, Skipped: 0

[INFO] 
[INFO] --- maven-jar-plugin:2.4:jar (default-jar) @ alluxio-job-server ---
[INFO] Building jar: /usr/src/alluxio/job/server/target/alluxio-job-server-2.2.0-SNAPSHOT.jar
[INFO] 
[INFO] >>> maven-source-plugin:2.3:jar (attach-sources) > generate-sources @ alluxio-job-server >>>
[INFO] 
[INFO] --- maven-enforcer-plugin:1.4:enforce (enforce-maven) @ alluxio-job-server ---
[INFO] 
[INFO] --- maven-enforcer-plugin:1.4:enforce (enforce-versions) @ alluxio-job-server ---
[INFO] 
[INFO] --- maven-checkstyle-plugin:2.17:check (checkstyle) @ alluxio-job-server ---
Tests run: 20, Failures: 0, Errors: 0, Skipped: 0, Time elapsed: 0.52 sec - in alluxio.master.file.meta.SimpleInodeLockListTest
Running alluxio.master.file.meta.TtlBucketTest
Tests run: 2, Failures: 0, Errors: 0, Skipped: 0, Time elapsed: 0.567 sec - in alluxio.master.file.meta.TtlBucketListTest
[INFO] Starting audit...
Audit done.
[INFO] 
[INFO] --- license-maven-plugin:2.9:check (default) @ alluxio-job-server ---
[INFO] Checking licenses...
Tests run: 7, Failures: 0, Errors: 0, Skipped: 0, Time elapsed: 0.428 sec - in alluxio.master.file.meta.TtlBucketTest
[INFO] 
[INFO] <<< maven-source-plugin:2.3:jar (attach-sources) < generate-sources @ alluxio-job-server <<<
[INFO] 
[INFO] 
[INFO] --- maven-source-plugin:2.3:jar (attach-sources) @ alluxio-job-server ---
[INFO] Building jar: /usr/src/alluxio/job/server/target/alluxio-job-server-2.2.0-SNAPSHOT-sources.jar
[INFO] 
[INFO] --- maven-javadoc-plugin:2.9:jar (attach-javadoc) @ alluxio-job-server ---
[INFO] Skipping javadoc generation
[INFO] 
[INFO] --- maven-jar-plugin:2.4:test-jar (default) @ alluxio-job-server ---
[INFO] Building jar: /usr/src/alluxio/job/server/target/alluxio-job-server-2.2.0-SNAPSHOT-tests.jar
[INFO] 
[INFO] --- maven-install-plugin:2.4:install (default-install) @ alluxio-job-server ---
[INFO] Installing /usr/src/alluxio/job/server/target/alluxio-job-server-2.2.0-SNAPSHOT.jar to /home/jenkins/.m2/repository/org/alluxio/alluxio-job-server/2.2.0-SNAPSHOT/alluxio-job-server-2.2.0-SNAPSHOT.jar
[INFO] Installing /usr/src/alluxio/job/server/pom.xml to /home/jenkins/.m2/repository/org/alluxio/alluxio-job-server/2.2.0-SNAPSHOT/alluxio-job-server-2.2.0-SNAPSHOT.pom
[INFO] Installing /usr/src/alluxio/job/server/target/alluxio-job-server-2.2.0-SNAPSHOT-sources.jar to /home/jenkins/.m2/repository/org/alluxio/alluxio-job-server/2.2.0-SNAPSHOT/alluxio-job-server-2.2.0-SNAPSHOT-sources.jar
[INFO] Installing /usr/src/alluxio/job/server/target/alluxio-job-server-2.2.0-SNAPSHOT-tests.jar to /home/jenkins/.m2/repository/org/alluxio/alluxio-job-server/2.2.0-SNAPSHOT/alluxio-job-server-2.2.0-SNAPSHOT-tests.jar
Running alluxio.master.file.meta.UfsAbsentPathCacheTest
Running alluxio.master.file.meta.UfsSyncCachePathTest
Tests run: 8, Failures: 0, Errors: 0, Skipped: 0, Time elapsed: 11.234 sec - in alluxio.master.file.PersistenceTest
Tests run: 3, Failures: 0, Errors: 0, Skipped: 0, Time elapsed: 0.408 sec - in alluxio.master.file.meta.UfsAbsentPathCacheTest
Running alluxio.master.file.meta.options.MountInfoTest
Tests run: 1, Failures: 0, Errors: 0, Skipped: 0, Time elapsed: 0.509 sec - in alluxio.master.file.meta.options.MountInfoTest
Running alluxio.master.file.replication.ReplicationCheckerTest
Running alluxio.master.journal.options.JournalReaderOptionsTest
Tests run: 2, Failures: 0, Errors: 0, Skipped: 0, Time elapsed: 0.072 sec - in alluxio.master.journal.options.JournalReaderOptionsTest
Tests run: 10, Failures: 0, Errors: 0, Skipped: 0, Time elapsed: 1.199 sec - in alluxio.master.file.meta.UfsSyncCachePathTest
Running alluxio.master.journal.options.JournalWriterOptionsTest
Tests run: 2, Failures: 0, Errors: 0, Skipped: 0, Time elapsed: 0.068 sec - in alluxio.master.journal.options.JournalWriterOptionsTest
Running alluxio.master.journal.sink.JournalSinkTest
Running alluxio.master.journal.ufs.UfsJournalCheckpointThreadTest
Running alluxio.master.journal.ufs.UfsJournalCheckpointWriterTest
Tests run: 6, Failures: 0, Errors: 0, Skipped: 0, Time elapsed: 0.701 sec - in alluxio.master.journal.ufs.UfsJournalCheckpointWriterTest
Running alluxio.master.journal.ufs.UfsJournalConfTest
Tests run: 2, Failures: 0, Errors: 0, Skipped: 0, Time elapsed: 1.752 sec - in alluxio.master.journal.ufs.UfsJournalCheckpointThreadTest
Tests run: 2, Failures: 0, Errors: 0, Skipped: 0, Time elapsed: 0.33 sec - in alluxio.master.journal.ufs.UfsJournalConfTest
Running alluxio.master.journal.ufs.UfsJournalFileTest
Tests run: 12, Failures: 0, Errors: 0, Skipped: 0, Time elapsed: 3.642 sec - in alluxio.master.file.replication.ReplicationCheckerTest
Running alluxio.master.journal.ufs.UfsJournalLogWriterTest
Tests run: 9, Failures: 0, Errors: 0, Skipped: 0, Time elapsed: 0.449 sec - in alluxio.master.journal.ufs.UfsJournalFileTest
Tests run: 3, Failures: 0, Errors: 0, Skipped: 0, Time elapsed: 3.127 sec - in alluxio.master.journal.sink.JournalSinkTest
Running alluxio.master.journal.ufs.UfsJournalReaderTest
Running alluxio.master.journal.ufs.UfsJournalSnapshotTest
Running alluxio.master.journal.ufs.UfsJournalTest
Tests run: 11, Failures: 0, Errors: 0, Skipped: 0, Time elapsed: 0.91 sec - in alluxio.master.journal.ufs.UfsJournalLogWriterTest
Tests run: 1, Failures: 0, Errors: 0, Skipped: 0, Time elapsed: 0.462 sec - in alluxio.master.journal.ufs.UfsJournalSnapshotTest
Running alluxio.master.meta.AlluxioMasterRestServiceHandlerTest
Tests run: 9, Failures: 0, Errors: 0, Skipped: 0, Time elapsed: 1.047 sec - in alluxio.master.journal.ufs.UfsJournalReaderTest
Running alluxio.master.meta.DailyMetadataBackupTest
Tests run: 8, Failures: 0, Errors: 0, Skipped: 0, Time elapsed: 1.217 sec - in alluxio.master.journal.ufs.UfsJournalTest
Tests run: 1, Failures: 0, Errors: 0, Skipped: 0, Time elapsed: 0.618 sec - in alluxio.master.meta.DailyMetadataBackupTest
Running alluxio.master.meta.PathPropertiesTest
Running alluxio.master.meta.UpdateCheckTest
Tests run: 5, Failures: 0, Errors: 0, Skipped: 0, Time elapsed: 0.415 sec - in alluxio.master.meta.PathPropertiesTest
Running alluxio.master.meta.checkconf.ServerConfigurationCheckerTest
Tests run: 15, Failures: 0, Errors: 0, Skipped: 0, Time elapsed: 1.989 sec - in alluxio.master.meta.AlluxioMasterRestServiceHandlerTest
Tests run: 1, Failures: 0, Errors: 0, Skipped: 0, Time elapsed: 0.351 sec - in alluxio.master.meta.checkconf.ServerConfigurationCheckerTest
Running alluxio.master.meta.checkconf.ServerConfigurationStoreTest
Tests run: 3, Failures: 0, Errors: 0, Skipped: 0, Time elapsed: 0.962 sec - in alluxio.master.meta.UpdateCheckTest
Tests run: 4, Failures: 0, Errors: 0, Skipped: 0, Time elapsed: 0.284 sec - in alluxio.master.meta.checkconf.ServerConfigurationStoreTest
Running alluxio.master.metastore.InodeStoreTest
Running alluxio.master.metastore.caching.CachingInodeStoreMockedBackingStoreTest
Running alluxio.master.metastore.rocks.RocksInodeStoreTest
Running alluxio.master.metastore.rocks.RocksStoreTest
Tests run: 2, Failures: 0, Errors: 0, Skipped: 0, Time elapsed: 0.667 sec - in alluxio.master.metastore.rocks.RocksInodeStoreTest
Tests run: 1, Failures: 0, Errors: 0, Skipped: 0, Time elapsed: 0.474 sec - in alluxio.master.metastore.rocks.RocksStoreTest
Running alluxio.master.metrics.MetricsMasterTest
Running alluxio.master.metrics.MetricsStoreTest
Tests run: 17, Failures: 0, Errors: 0, Skipped: 0, Time elapsed: 2.005 sec - in alluxio.master.metastore.caching.CachingInodeStoreMockedBackingStoreTest
Tests run: 3, Failures: 0, Errors: 0, Skipped: 0, Time elapsed: 0.248 sec - in alluxio.master.metrics.MetricsStoreTest
Tests run: 3, Failures: 0, Errors: 0, Skipped: 0, Time elapsed: 0.714 sec - in alluxio.master.metrics.MetricsMasterTest
Tests run: 30, Failures: 0, Errors: 0, Skipped: 2, Time elapsed: 2.391 sec - in alluxio.master.metastore.InodeStoreTest
Running alluxio.master.metrics.TimeSeriesStoreTest
Tests run: 3, Failures: 0, Errors: 0, Skipped: 0, Time elapsed: 0.229 sec - in alluxio.master.metrics.TimeSeriesStoreTest
Results :
Tests run: 535, Failures: 0, Errors: 0, Skipped: 3
[INFO] 
[INFO] --- maven-jar-plugin:2.4:jar (default-jar) @ alluxio-core-server-master ---
[INFO] Building jar: /usr/src/alluxio/core/server/master/target/alluxio-core-server-master-2.2.0-SNAPSHOT.jar
[INFO] 
[INFO] >>> maven-source-plugin:2.3:jar (attach-sources) > generate-sources @ alluxio-core-server-master >>>
[INFO] 
[INFO] --- maven-enforcer-plugin:1.4:enforce (enforce-maven) @ alluxio-core-server-master ---
[INFO] 
[INFO] --- maven-enforcer-plugin:1.4:enforce (enforce-versions) @ alluxio-core-server-master ---
[INFO] 
[INFO] --- maven-checkstyle-plugin:2.17:check (checkstyle) @ alluxio-core-server-master ---
[INFO] Starting audit...
Audit done.
[INFO] 
[INFO] --- license-maven-plugin:2.9:check (default) @ alluxio-core-server-master ---
[INFO] Checking licenses...
[INFO] 
[INFO] <<< maven-source-plugin:2.3:jar (attach-sources) < generate-sources @ alluxio-core-server-master <<<
[INFO] 
[INFO] 
[INFO] --- maven-source-plugin:2.3:jar (attach-sources) @ alluxio-core-server-master ---
[INFO] Building jar: /usr/src/alluxio/core/server/master/target/alluxio-core-server-master-2.2.0-SNAPSHOT-sources.jar
[INFO] 
[INFO] --- maven-javadoc-plugin:2.9:jar (attach-javadoc) @ alluxio-core-server-master ---
[INFO] Skipping javadoc generation
[INFO] 
[INFO] --- maven-jar-plugin:2.4:test-jar (default) @ alluxio-core-server-master ---
[INFO] Building jar: /usr/src/alluxio/core/server/master/target/alluxio-core-server-master-2.2.0-SNAPSHOT-tests.jar
[INFO] 
[INFO] --- maven-install-plugin:2.4:install (default-install) @ alluxio-core-server-master ---
[INFO] Installing /usr/src/alluxio/core/server/master/target/alluxio-core-server-master-2.2.0-SNAPSHOT.jar to /home/jenkins/.m2/repository/org/alluxio/alluxio-core-server-master/2.2.0-SNAPSHOT/alluxio-core-server-master-2.2.0-SNAPSHOT.jar
[INFO] Installing /usr/src/alluxio/core/server/master/pom.xml to /home/jenkins/.m2/repository/org/alluxio/alluxio-core-server-master/2.2.0-SNAPSHOT/alluxio-core-server-master-2.2.0-SNAPSHOT.pom
[INFO] Installing /usr/src/alluxio/core/server/master/target/alluxio-core-server-master-2.2.0-SNAPSHOT-sources.jar to /home/jenkins/.m2/repository/org/alluxio/alluxio-core-server-master/2.2.0-SNAPSHOT/alluxio-core-server-master-2.2.0-SNAPSHOT-sources.jar
[INFO] Installing /usr/src/alluxio/core/server/master/target/alluxio-core-server-master-2.2.0-SNAPSHOT-tests.jar to /home/jenkins/.m2/repository/org/alluxio/alluxio-core-server-master/2.2.0-SNAPSHOT/alluxio-core-server-master-2.2.0-SNAPSHOT-tests.jar
[INFO] 
[INFO] --------------< org.alluxio:alluxio-table-server-master >---------------
[INFO] Building Alluxio Table - Server - Master 2.2.0-SNAPSHOT          [50/54]
[INFO] --------------------------------[ jar ]---------------------------------
[INFO] 
[INFO] ---------------< org.alluxio:alluxio-integration-mesos >----------------
[INFO] 
[INFO] Building Alluxio Integration - Mesos 2.2.0-SNAPSHOT              [51/54]
[INFO] ------------------< org.alluxio:alluxio-minicluster >-------------------
[INFO] --------------------------------[ jar ]---------------------------------
[INFO] Building Alluxio MiniCluster 2.2.0-SNAPSHOT                      [52/54]
[INFO] --------------------------------[ jar ]---------------------------------
[INFO] 
[INFO] --- maven-clean-plugin:3.0.0:clean (default-clean) @ alluxio-table-server-master ---
[INFO] 
[INFO] --- maven-enforcer-plugin:1.4:enforce (enforce-maven) @ alluxio-table-server-master ---
[INFO] 
[INFO] --- maven-enforcer-plugin:1.4:enforce (enforce-versions) @ alluxio-table-server-master ---
[INFO] 
[INFO] --- maven-clean-plugin:3.0.0:clean (default-clean) @ alluxio-integration-mesos ---
[INFO] 
[INFO] --- maven-checkstyle-plugin:2.17:check (checkstyle) @ alluxio-table-server-master ---
[INFO] 
[INFO] --- maven-enforcer-plugin:1.4:enforce (enforce-maven) @ alluxio-integration-mesos ---
[INFO] 
[INFO] --- maven-enforcer-plugin:1.4:enforce (enforce-versions) @ alluxio-integration-mesos ---
[INFO] 
[INFO] --- maven-checkstyle-plugin:2.17:check (checkstyle) @ alluxio-integration-mesos ---
[INFO] 
[INFO] --- maven-clean-plugin:3.0.0:clean (default-clean) @ alluxio-minicluster ---
[INFO] 
[INFO] --- maven-enforcer-plugin:1.4:enforce (enforce-maven) @ alluxio-minicluster ---
[INFO] 
[INFO] --- maven-enforcer-plugin:1.4:enforce (enforce-versions) @ alluxio-minicluster ---
[INFO] 
[INFO] --- maven-checkstyle-plugin:2.17:check (checkstyle) @ alluxio-minicluster ---
[INFO] Starting audit...
Audit done.
[INFO] 
[INFO] --- license-maven-plugin:2.9:check (default) @ alluxio-integration-mesos ---
[INFO] Checking licenses...
[INFO] 
[INFO] --- maven-resources-plugin:2.7:resources (default-resources) @ alluxio-integration-mesos ---
[INFO] Using 'UTF-8' encoding to copy filtered resources.
[INFO] skip non existing resourceDirectory /usr/src/alluxio/integration/mesos/src/main/resources
[INFO] 
[INFO] --- maven-compiler-plugin:3.2:compile (default-compile) @ alluxio-integration-mesos ---
[INFO] Changes detected - recompiling the module!
[INFO] Compiling 5 source files to /usr/src/alluxio/integration/mesos/target/classes
[INFO] Starting audit...
Audit done.
[INFO] 
[INFO] --- license-maven-plugin:2.9:check (default) @ alluxio-minicluster ---
[INFO] Checking licenses...
[INFO] 
[INFO] --- maven-resources-plugin:2.7:resources (default-resources) @ alluxio-minicluster ---
[INFO] Using 'UTF-8' encoding to copy filtered resources.
[INFO] skip non existing resourceDirectory /usr/src/alluxio/minicluster/src/main/resources
[INFO] 
[INFO] --- maven-compiler-plugin:3.2:compile (default-compile) @ alluxio-minicluster ---
[INFO] Changes detected - recompiling the module!
[INFO] Compiling 17 source files to /usr/src/alluxio/minicluster/target/classes
[INFO] Starting audit...
Audit done.
[INFO] 
[INFO] --- license-maven-plugin:2.9:check (default) @ alluxio-table-server-master ---
[INFO] Checking licenses...
[INFO] 
[INFO] >>> spotbugs-maven-plugin:3.1.12.2:check (default) > :spotbugs @ alluxio-integration-mesos >>>
[INFO] 
[INFO] --- spotbugs-maven-plugin:3.1.12.2:spotbugs (spotbugs) @ alluxio-integration-mesos ---
[INFO] Fork Value is true
[INFO] 
[INFO] --- maven-resources-plugin:2.7:resources (default-resources) @ alluxio-table-server-master ---
[INFO] Using 'UTF-8' encoding to copy filtered resources.
[INFO] Copying 1 resource
[INFO] 
[INFO] --- maven-compiler-plugin:3.2:compile (default-compile) @ alluxio-table-server-master ---
[INFO] Changes detected - recompiling the module!
[INFO] Compiling 18 source files to /usr/src/alluxio/table/server/master/target/classes
[INFO] /usr/src/alluxio/minicluster/src/main/java/alluxio/master/MultiMasterLocalAlluxioCluster.java: /usr/src/alluxio/minicluster/src/main/java/alluxio/master/MultiMasterLocalAlluxioCluster.java uses or overrides a deprecated API.
[INFO] /usr/src/alluxio/minicluster/src/main/java/alluxio/master/MultiMasterLocalAlluxioCluster.java: Recompile with -Xlint:deprecation for details.
[INFO] /usr/src/alluxio/minicluster/src/main/java/alluxio/multi/process/PortCoordination.java: /usr/src/alluxio/minicluster/src/main/java/alluxio/multi/process/PortCoordination.java uses unchecked or unsafe operations.
[INFO] /usr/src/alluxio/minicluster/src/main/java/alluxio/multi/process/PortCoordination.java: Recompile with -Xlint:unchecked for details.
[INFO] 
[INFO] >>> spotbugs-maven-plugin:3.1.12.2:check (default) > :spotbugs @ alluxio-minicluster >>>
[INFO] 
[INFO] --- spotbugs-maven-plugin:3.1.12.2:spotbugs (spotbugs) @ alluxio-minicluster ---
[INFO] Fork Value is true
[INFO] /usr/src/alluxio/table/server/master/src/main/java/alluxio/master/table/Domain.java: /usr/src/alluxio/table/server/master/src/main/java/alluxio/master/table/Domain.java uses unchecked or unsafe operations.
[INFO] /usr/src/alluxio/table/server/master/src/main/java/alluxio/master/table/Domain.java: Recompile with -Xlint:unchecked for details.
[INFO] 
[INFO] >>> spotbugs-maven-plugin:3.1.12.2:check (default) > :spotbugs @ alluxio-table-server-master >>>
[INFO] 
[INFO] --- spotbugs-maven-plugin:3.1.12.2:spotbugs (spotbugs) @ alluxio-table-server-master ---
[INFO] Fork Value is true
[INFO] Done SpotBugs Analysis....
[INFO] 
[INFO] <<< spotbugs-maven-plugin:3.1.12.2:check (default) < :spotbugs @ alluxio-integration-mesos <<<
[INFO] 
[INFO] 
[INFO] --- spotbugs-maven-plugin:3.1.12.2:check (default) @ alluxio-integration-mesos ---
[INFO] BugInstance size is 0
[INFO] Error size is 0
[INFO] No errors/warnings found
[INFO] 
[INFO] --- maven-resources-plugin:2.7:testResources (default-testResources) @ alluxio-integration-mesos ---
[INFO] Using 'UTF-8' encoding to copy filtered resources.
[INFO] skip non existing resourceDirectory /usr/src/alluxio/integration/mesos/src/test/resources
[INFO] 
[INFO] --- maven-compiler-plugin:3.2:testCompile (default-testCompile) @ alluxio-integration-mesos ---
[INFO] No sources to compile
[INFO] 
[INFO] --- maven-surefire-plugin:2.19.1:test (default-test) @ alluxio-integration-mesos ---
[INFO] No tests to run.
[INFO] 
[INFO] --- maven-jar-plugin:2.4:jar (default-jar) @ alluxio-integration-mesos ---
[INFO] Building jar: /usr/src/alluxio/integration/mesos/target/alluxio-integration-mesos-2.2.0-SNAPSHOT.jar
[INFO] 
[INFO] >>> maven-source-plugin:2.3:jar (attach-sources) > generate-sources @ alluxio-integration-mesos >>>
[INFO] 
[INFO] --- maven-enforcer-plugin:1.4:enforce (enforce-maven) @ alluxio-integration-mesos ---
[INFO] 
[INFO] --- maven-enforcer-plugin:1.4:enforce (enforce-versions) @ alluxio-integration-mesos ---
[INFO] 
[INFO] --- maven-checkstyle-plugin:2.17:check (checkstyle) @ alluxio-integration-mesos ---
[INFO] Starting audit...
Audit done.
[INFO] 
[INFO] --- license-maven-plugin:2.9:check (default) @ alluxio-integration-mesos ---
[INFO] Checking licenses...
[INFO] 
[INFO] <<< maven-source-plugin:2.3:jar (attach-sources) < generate-sources @ alluxio-integration-mesos <<<
[INFO] 
[INFO] 
[INFO] --- maven-source-plugin:2.3:jar (attach-sources) @ alluxio-integration-mesos ---
[INFO] Building jar: /usr/src/alluxio/integration/mesos/target/alluxio-integration-mesos-2.2.0-SNAPSHOT-sources.jar
[INFO] 
[INFO] --- maven-javadoc-plugin:2.9:jar (attach-javadoc) @ alluxio-integration-mesos ---
[INFO] Skipping javadoc generation
[INFO] 
[INFO] --- maven-install-plugin:2.4:install (default-install) @ alluxio-integration-mesos ---
[INFO] Installing /usr/src/alluxio/integration/mesos/target/alluxio-integration-mesos-2.2.0-SNAPSHOT.jar to /home/jenkins/.m2/repository/org/alluxio/alluxio-integration-mesos/2.2.0-SNAPSHOT/alluxio-integration-mesos-2.2.0-SNAPSHOT.jar
[INFO] Installing /usr/src/alluxio/integration/mesos/pom.xml to /home/jenkins/.m2/repository/org/alluxio/alluxio-integration-mesos/2.2.0-SNAPSHOT/alluxio-integration-mesos-2.2.0-SNAPSHOT.pom
[INFO] Installing /usr/src/alluxio/integration/mesos/target/alluxio-integration-mesos-2.2.0-SNAPSHOT-sources.jar to /home/jenkins/.m2/repository/org/alluxio/alluxio-integration-mesos/2.2.0-SNAPSHOT/alluxio-integration-mesos-2.2.0-SNAPSHOT-sources.jar
[INFO] Done SpotBugs Analysis....
[INFO] 
[INFO] <<< spotbugs-maven-plugin:3.1.12.2:check (default) < :spotbugs @ alluxio-table-server-master <<<
[INFO] 
[INFO] 
[INFO] --- spotbugs-maven-plugin:3.1.12.2:check (default) @ alluxio-table-server-master ---
[INFO] BugInstance size is 0
[INFO] Error size is 0
[INFO] No errors/warnings found
[INFO] 
[INFO] --- maven-resources-plugin:2.7:testResources (default-testResources) @ alluxio-table-server-master ---
[INFO] Using 'UTF-8' encoding to copy filtered resources.
[INFO] Copying 1 resource
[INFO] 
[INFO] --- maven-compiler-plugin:3.2:testCompile (default-testCompile) @ alluxio-table-server-master ---
[INFO] Changes detected - recompiling the module!
[INFO] Compiling 6 source files to /usr/src/alluxio/table/server/master/target/test-classes
[INFO] Done SpotBugs Analysis....
[INFO] 
[INFO] <<< spotbugs-maven-plugin:3.1.12.2:check (default) < :spotbugs @ alluxio-minicluster <<<
[INFO] 
[INFO] 
[INFO] --- spotbugs-maven-plugin:3.1.12.2:check (default) @ alluxio-minicluster ---
[INFO] BugInstance size is 0
[INFO] Error size is 0
[INFO] No errors/warnings found
[INFO] 
[INFO] --- maven-resources-plugin:2.7:testResources (default-testResources) @ alluxio-minicluster ---
[INFO] Using 'UTF-8' encoding to copy filtered resources.
[INFO] Copying 1 resource
[INFO] 
[INFO] --- maven-compiler-plugin:3.2:testCompile (default-testCompile) @ alluxio-minicluster ---
[INFO] Changes detected - recompiling the module!
[INFO] Compiling 1 source file to /usr/src/alluxio/minicluster/target/test-classes
[INFO] /usr/src/alluxio/table/server/master/src/test/java/alluxio/master/table/AlluxioCatalogTest.java: /usr/src/alluxio/table/server/master/src/test/java/alluxio/master/table/AlluxioCatalogTest.java uses unchecked or unsafe operations.
[INFO] /usr/src/alluxio/table/server/master/src/test/java/alluxio/master/table/AlluxioCatalogTest.java: Recompile with -Xlint:unchecked for details.
[INFO] 
[INFO] --- maven-surefire-plugin:2.19.1:test (default-test) @ alluxio-table-server-master ---

-------------------------------------------------------
 T E S T S
-------------------------------------------------------
[INFO] 
[INFO] --- maven-surefire-plugin:2.19.1:test (default-test) @ alluxio-minicluster ---

-------------------------------------------------------
 T E S T S
-------------------------------------------------------
Running alluxio.master.table.transform.TransformManagerTest
Running alluxio.master.table.AlluxioCatalogTest
Running alluxio.master.table.TableMasterFactoryTest
Running alluxio.multi.process.MultiProcessClusterTest
Tests run: 2, Failures: 0, Errors: 0, Skipped: 0, Time elapsed: 0.98 sec - in alluxio.master.table.TableMasterFactoryTest
Tests run: 20, Failures: 0, Errors: 0, Skipped: 0, Time elapsed: 1.909 sec - in alluxio.master.table.AlluxioCatalogTest
Tests run: 5, Failures: 0, Errors: 0, Skipped: 0, Time elapsed: 2.896 sec - in alluxio.master.table.transform.TransformManagerTest

Results :

Tests run: 27, Failures: 0, Errors: 0, Skipped: 0

[INFO] 
[INFO] --- maven-jar-plugin:2.4:jar (default-jar) @ alluxio-table-server-master ---
[INFO] Building jar: /usr/src/alluxio/table/server/master/target/alluxio-table-server-master-2.2.0-SNAPSHOT.jar
[INFO] 
[INFO] >>> maven-source-plugin:2.3:jar (attach-sources) > generate-sources @ alluxio-table-server-master >>>
[INFO] 
[INFO] --- maven-enforcer-plugin:1.4:enforce (enforce-maven) @ alluxio-table-server-master ---
[INFO] 
[INFO] --- maven-enforcer-plugin:1.4:enforce (enforce-versions) @ alluxio-table-server-master ---
[INFO] 
[INFO] --- maven-checkstyle-plugin:2.17:check (checkstyle) @ alluxio-table-server-master ---
[INFO] Starting audit...
Audit done.
[INFO] 
[INFO] --- license-maven-plugin:2.9:check (default) @ alluxio-table-server-master ---
[INFO] Checking licenses...
[INFO] 
[INFO] <<< maven-source-plugin:2.3:jar (attach-sources) < generate-sources @ alluxio-table-server-master <<<
[INFO] 
[INFO] 
[INFO] --- maven-source-plugin:2.3:jar (attach-sources) @ alluxio-table-server-master ---
[INFO] Building jar: /usr/src/alluxio/table/server/master/target/alluxio-table-server-master-2.2.0-SNAPSHOT-sources.jar
[INFO] 
[INFO] --- maven-javadoc-plugin:2.9:jar (attach-javadoc) @ alluxio-table-server-master ---
[INFO] Skipping javadoc generation
[INFO] 
[INFO] --- maven-jar-plugin:2.4:test-jar (default) @ alluxio-table-server-master ---
[INFO] Building jar: /usr/src/alluxio/table/server/master/target/alluxio-table-server-master-2.2.0-SNAPSHOT-tests.jar
[INFO] 
[INFO] --- maven-install-plugin:2.4:install (default-install) @ alluxio-table-server-master ---
[INFO] Installing /usr/src/alluxio/table/server/master/target/alluxio-table-server-master-2.2.0-SNAPSHOT.jar to /home/jenkins/.m2/repository/org/alluxio/alluxio-table-server-master/2.2.0-SNAPSHOT/alluxio-table-server-master-2.2.0-SNAPSHOT.jar
[INFO] Installing /usr/src/alluxio/table/server/master/pom.xml to /home/jenkins/.m2/repository/org/alluxio/alluxio-table-server-master/2.2.0-SNAPSHOT/alluxio-table-server-master-2.2.0-SNAPSHOT.pom
[INFO] Installing /usr/src/alluxio/table/server/master/target/alluxio-table-server-master-2.2.0-SNAPSHOT-sources.jar to /home/jenkins/.m2/repository/org/alluxio/alluxio-table-server-master/2.2.0-SNAPSHOT/alluxio-table-server-master-2.2.0-SNAPSHOT-sources.jar
[INFO] Installing /usr/src/alluxio/table/server/master/target/alluxio-table-server-master-2.2.0-SNAPSHOT-tests.jar to /home/jenkins/.m2/repository/org/alluxio/alluxio-table-server-master/2.2.0-SNAPSHOT/alluxio-table-server-master-2.2.0-SNAPSHOT-tests.jar
[INFO] 
[INFO] ----------------< org.alluxio:alluxio-assembly-server >-----------------
[INFO] Building Alluxio Assembly - Server 2.2.0-SNAPSHOT                [53/54]
[INFO] --------------------------------[ jar ]---------------------------------
[INFO] 
[INFO] --- maven-clean-plugin:3.0.0:clean (default-clean) @ alluxio-assembly-server ---
[INFO] 
[INFO] --- maven-enforcer-plugin:1.4:enforce (enforce-maven) @ alluxio-assembly-server ---
[INFO] 
[INFO] --- maven-enforcer-plugin:1.4:enforce (enforce-versions) @ alluxio-assembly-server ---
[INFO] 
[INFO] --- maven-checkstyle-plugin:2.17:check (checkstyle) @ alluxio-assembly-server ---
[INFO] Starting audit...
Audit done.
[INFO] 
[INFO] --- license-maven-plugin:2.9:check (default) @ alluxio-assembly-server ---
[INFO] Checking licenses...
[INFO] 
[INFO] --- maven-resources-plugin:2.7:resources (default-resources) @ alluxio-assembly-server ---
[INFO] Using 'UTF-8' encoding to copy filtered resources.
[INFO] skip non existing resourceDirectory /usr/src/alluxio/assembly/server/src/main/resources
[INFO] 
[INFO] --- maven-compiler-plugin:3.2:compile (default-compile) @ alluxio-assembly-server ---
[INFO] No sources to compile
[INFO] 
[INFO] >>> spotbugs-maven-plugin:3.1.12.2:check (default) > :spotbugs @ alluxio-assembly-server >>>
[INFO] 
[INFO] --- spotbugs-maven-plugin:3.1.12.2:spotbugs (spotbugs) @ alluxio-assembly-server ---
[INFO] 
[INFO] <<< spotbugs-maven-plugin:3.1.12.2:check (default) < :spotbugs @ alluxio-assembly-server <<<
[INFO] 
[INFO] 
[INFO] --- spotbugs-maven-plugin:3.1.12.2:check (default) @ alluxio-assembly-server ---
[INFO] 
[INFO] --- maven-resources-plugin:2.7:testResources (default-testResources) @ alluxio-assembly-server ---
[INFO] Using 'UTF-8' encoding to copy filtered resources.
[INFO] skip non existing resourceDirectory /usr/src/alluxio/assembly/server/src/test/resources
[INFO] 
[INFO] --- maven-compiler-plugin:3.2:testCompile (default-testCompile) @ alluxio-assembly-server ---
[INFO] No sources to compile
[INFO] 
[INFO] --- maven-surefire-plugin:2.19.1:test (default-test) @ alluxio-assembly-server ---
[INFO] No tests to run.
[INFO] 
[INFO] --- maven-jar-plugin:2.4:jar (default-jar) @ alluxio-assembly-server ---
[WARNING] JAR will be empty - no content was marked for inclusion!
[INFO] Building jar: /usr/src/alluxio/assembly/server/target/alluxio-assembly-server-2.2.0-SNAPSHOT.jar
[INFO] 
[INFO] >>> maven-source-plugin:2.3:jar (attach-sources) > generate-sources @ alluxio-assembly-server >>>
[INFO] 
[INFO] --- maven-enforcer-plugin:1.4:enforce (enforce-maven) @ alluxio-assembly-server ---
[INFO] 
[INFO] --- maven-enforcer-plugin:1.4:enforce (enforce-versions) @ alluxio-assembly-server ---
[INFO] 
[INFO] --- maven-checkstyle-plugin:2.17:check (checkstyle) @ alluxio-assembly-server ---
[INFO] Starting audit...
Audit done.
[INFO] 
[INFO] --- license-maven-plugin:2.9:check (default) @ alluxio-assembly-server ---
[INFO] Checking licenses...
[INFO] 
[INFO] <<< maven-source-plugin:2.3:jar (attach-sources) < generate-sources @ alluxio-assembly-server <<<
[INFO] 
[INFO] 
[INFO] --- maven-source-plugin:2.3:jar (attach-sources) @ alluxio-assembly-server ---
[INFO] No sources in project. Archive not created.
[INFO] 
[INFO] --- maven-javadoc-plugin:2.9:jar (attach-javadoc) @ alluxio-assembly-server ---
[INFO] Skipping javadoc generation
[INFO] 
[INFO] --- maven-shade-plugin:3.2.1:shade (uber-jar) @ alluxio-assembly-server ---
[INFO] Including org.alluxio:alluxio-core-server-master:jar:2.2.0-SNAPSHOT in the shaded jar.
[INFO] Including com.google.guava:guava:jar:27.0.1-jre in the shaded jar.
[INFO] Including com.google.guava:failureaccess:jar:1.0.1 in the shaded jar.
[INFO] Including com.google.guava:listenablefuture:jar:9999.0-empty-to-avoid-conflict-with-guava in the shaded jar.
[INFO] Including org.codehaus.mojo:animal-sniffer-annotations:jar:1.17 in the shaded jar.
[INFO] Including commons-lang:commons-lang:jar:2.6 in the shaded jar.
[INFO] Including io.dropwizard.metrics:metrics-core:jar:3.1.2 in the shaded jar.
[INFO] Including io.swagger:swagger-annotations:jar:1.5.22 in the shaded jar.
[INFO] Including javax.servlet:javax.servlet-api:jar:3.1.0 in the shaded jar.
[INFO] Including javax.ws.rs:javax.ws.rs-api:jar:2.0.1 in the shaded jar.
[INFO] Including org.apache.commons:commons-lang3:jar:3.4 in the shaded jar.
[INFO] Including org.eclipse.jetty:jetty-servlet:jar:9.2.16.v20160414 in the shaded jar.
[INFO] Including org.eclipse.jetty:jetty-security:jar:9.2.16.v20160414 in the shaded jar.
[INFO] Including org.glassfish.jersey.containers:jersey-container-servlet-core:jar:2.22 in the shaded jar.
[INFO] Including org.glassfish.hk2.external:javax.inject:jar:2.4.0-b31 in the shaded jar.
[INFO] Including org.glassfish.jersey.core:jersey-common:jar:2.22 in the shaded jar.
[INFO] Including org.glassfish.jersey.bundles.repackaged:jersey-guava:jar:2.22 in the shaded jar.
[INFO] Including org.glassfish.hk2:osgi-resource-locator:jar:1.0.1 in the shaded jar.
[INFO] Including org.glassfish.jersey.core:jersey-server:jar:2.22 in the shaded jar.
[INFO] Including org.glassfish.jersey.core:jersey-client:jar:2.22 in the shaded jar.
[INFO] Including org.glassfish.jersey.media:jersey-media-jaxb:jar:2.22 in the shaded jar.
[INFO] Including javax.annotation:javax.annotation-api:jar:1.2 in the shaded jar.
[INFO] Including org.glassfish.hk2:hk2-api:jar:2.4.0-b31 in the shaded jar.
[INFO] Including org.glassfish.hk2:hk2-utils:jar:2.4.0-b31 in the shaded jar.
[INFO] Including org.glassfish.hk2.external:aopalliance-repackaged:jar:2.4.0-b31 in the shaded jar.
[INFO] Including org.glassfish.hk2:hk2-locator:jar:2.4.0-b31 in the shaded jar.
[INFO] Including javax.validation:validation-api:jar:1.1.0.Final in the shaded jar.
[INFO] Including org.rocksdb:rocksdbjni:jar:5.15.10 in the shaded jar.
[INFO] Including org.alluxio:alluxio-core-common:jar:2.2.0-SNAPSHOT in the shaded jar.
[INFO] Including commons-cli:commons-cli:jar:1.3.1 in the shaded jar.
[INFO] Including commons-httpclient:commons-httpclient:jar:3.1 in the shaded jar.
[INFO] Including io.dropwizard.metrics:metrics-graphite:jar:3.1.2 in the shaded jar.
[INFO] Including io.dropwizard.metrics:metrics-jvm:jar:3.1.2 in the shaded jar.
[INFO] Including io.grpc:grpc-core:jar:1.17.1 in the shaded jar.
[INFO] Including io.grpc:grpc-context:jar:1.17.1 in the shaded jar.
[INFO] Including com.google.code.gson:gson:jar:2.7 in the shaded jar.
[INFO] Including io.opencensus:opencensus-api:jar:0.17.0 in the shaded jar.
[INFO] Including io.opencensus:opencensus-contrib-grpc-metrics:jar:0.17.0 in the shaded jar.
[INFO] Including io.grpc:grpc-netty:jar:1.17.1 in the shaded jar.
[INFO] Including io.netty:netty-codec-http2:jar:4.1.30.Final in the shaded jar.
[INFO] Including io.netty:netty-codec-http:jar:4.1.30.Final in the shaded jar.
[INFO] Including io.netty:netty-codec:jar:4.1.30.Final in the shaded jar.
[INFO] Including io.netty:netty-handler:jar:4.1.30.Final in the shaded jar.
[INFO] Including io.netty:netty-buffer:jar:4.1.30.Final in the shaded jar.
[INFO] Including io.netty:netty-common:jar:4.1.30.Final in the shaded jar.
[INFO] Including io.netty:netty-handler-proxy:jar:4.1.30.Final in the shaded jar.
[INFO] Including io.netty:netty-transport:jar:4.1.30.Final in the shaded jar.
[INFO] Including io.netty:netty-resolver:jar:4.1.30.Final in the shaded jar.
[INFO] Including io.netty:netty-codec-socks:jar:4.1.30.Final in the shaded jar.
[INFO] Including io.grpc:grpc-stub:jar:1.17.1 in the shaded jar.
[INFO] Including org.apache.curator:curator-client:jar:4.2.0 in the shaded jar.
[INFO] Including org.apache.curator:curator-framework:jar:4.2.0 in the shaded jar.
[INFO] Including org.apache.zookeeper:zookeeper:jar:3.5.5 in the shaded jar.
[INFO] Including org.apache.zookeeper:zookeeper-jute:jar:3.5.5 in the shaded jar.
[INFO] Including org.apache.yetus:audience-annotations:jar:0.5.0 in the shaded jar.
[INFO] Including io.netty:netty-all:jar:4.1.30.Final in the shaded jar.
[INFO] Including org.reflections:reflections:jar:0.9.10 in the shaded jar.
[INFO] Including org.alluxio:alluxio-core-base:jar:2.2.0-SNAPSHOT in the shaded jar.
[INFO] Including org.alluxio:alluxio-core-transport:jar:2.2.0-SNAPSHOT in the shaded jar.
[INFO] Including io.grpc:grpc-protobuf:jar:1.17.1 in the shaded jar.
[INFO] Including com.google.api.grpc:proto-google-common-protos:jar:1.0.0 in the shaded jar.
[INFO] Including io.grpc:grpc-protobuf-lite:jar:1.17.1 in the shaded jar.
[INFO] Including org.alluxio:alluxio-core-client-fs:jar:2.2.0-SNAPSHOT in the shaded jar.
[INFO] Including org.alluxio:alluxio-core-server-common:jar:2.2.0-SNAPSHOT in the shaded jar.
[INFO] Including com.esotericsoftware:kryo:jar:4.0.2 in the shaded jar.
[INFO] Including com.esotericsoftware:reflectasm:jar:1.11.3 in the shaded jar.
[INFO] Including org.ow2.asm:asm:jar:5.0.4 in the shaded jar.
[INFO] Including com.esotericsoftware:minlog:jar:1.3.0 in the shaded jar.
[INFO] Including io.atomix.copycat.alluxio:copycat-server:jar:1.2.14 in the shaded jar.
[INFO] Including io.atomix.copycat.alluxio:copycat-protocol:jar:1.2.14 in the shaded jar.
[INFO] Including io.atomix.catalyst:catalyst-transport:jar:1.2.1 in the shaded jar.
[INFO] Including io.atomix.catalyst:catalyst-concurrent:jar:1.2.1 in the shaded jar.
[INFO] Including io.atomix.catalyst:catalyst-serializer:jar:1.2.1 in the shaded jar.
[INFO] Including io.atomix.catalyst:catalyst-buffer:jar:1.2.1 in the shaded jar.
[INFO] Including io.atomix.catalyst:catalyst-common:jar:1.2.1 in the shaded jar.
[INFO] Including io.atomix.copycat.alluxio:copycat-client:jar:1.2.14 in the shaded jar.
[INFO] Including com.fasterxml.jackson.core:jackson-core:jar:2.10.1 in the shaded jar.
[INFO] Including com.fasterxml.jackson.core:jackson-databind:jar:2.10.1 in the shaded jar.
[INFO] Including io.dropwizard.metrics:metrics-json:jar:3.1.2 in the shaded jar.
[INFO] Including io.prometheus:simpleclient:jar:0.3.0 in the shaded jar.
[INFO] Including io.prometheus:simpleclient_servlet:jar:0.3.0 in the shaded jar.
[INFO] Including io.prometheus:simpleclient_common:jar:0.3.0 in the shaded jar.
[INFO] Including io.prometheus:simpleclient_dropwizard:jar:0.3.0 in the shaded jar.
[INFO] Including org.apache.commons:commons-compress:jar:1.16.1 in the shaded jar.
[INFO] Including org.apache.curator:curator-recipes:jar:4.2.0 in the shaded jar.
[INFO] Including org.eclipse.jetty:jetty-util:jar:9.2.16.v20160414 in the shaded jar.
[INFO] Including com.hubspot.jackson:jackson-datatype-protobuf:jar:0.9.10-jackson2.9-proto3 in the shaded jar.
[INFO] Including com.google.protobuf:protobuf-java-util:jar:3.3.0 in the shaded jar.
[INFO] Including org.apache.httpcomponents:httpclient:jar:4.5.3 in the shaded jar.
[INFO] Including commons-logging:commons-logging:jar:1.1.1 in the shaded jar.
[INFO] Including commons-codec:commons-codec:jar:1.10 in the shaded jar.
[INFO] Including org.alluxio:alluxio-core-server-proxy:jar:2.2.0-SNAPSHOT in the shaded jar.
[INFO] Including com.fasterxml.jackson.dataformat:jackson-dataformat-xml:jar:2.10.1 in the shaded jar.
[INFO] Including com.fasterxml.jackson.core:jackson-annotations:jar:2.10.1 in the shaded jar.
[INFO] Including com.fasterxml.jackson.module:jackson-module-jaxb-annotations:jar:2.10.1 in the shaded jar.
[INFO] Including jakarta.xml.bind:jakarta.xml.bind-api:jar:2.3.2 in the shaded jar.
[INFO] Including jakarta.activation:jakarta.activation-api:jar:1.2.1 in the shaded jar.
[INFO] Including org.codehaus.woodstox:stax2-api:jar:4.2 in the shaded jar.
[INFO] Including com.fasterxml.woodstox:woodstox-core:jar:6.0.2 in the shaded jar.
[INFO] Including commons-io:commons-io:jar:2.4 in the shaded jar.
[INFO] Including org.apache.httpcomponents:httpcore:jar:4.4.6 in the shaded jar.
[INFO] Including org.eclipse.jetty:jetty-server:jar:9.2.16.v20160414 in the shaded jar.
[INFO] Including org.eclipse.jetty:jetty-http:jar:9.2.16.v20160414 in the shaded jar.
[INFO] Including org.eclipse.jetty:jetty-io:jar:9.2.16.v20160414 in the shaded jar.
[INFO] Including org.glassfish.jersey.media:jersey-media-json-jackson:jar:2.22 in the shaded jar.
[INFO] Including org.glassfish.jersey.ext:jersey-entity-filtering:jar:2.22 in the shaded jar.
[INFO] Including com.fasterxml.jackson.jaxrs:jackson-jaxrs-base:jar:2.5.4 in the shaded jar.
[INFO] Including com.fasterxml.jackson.jaxrs:jackson-jaxrs-json-provider:jar:2.5.4 in the shaded jar.
[INFO] Including org.alluxio:alluxio-core-server-worker:jar:2.2.0-SNAPSHOT in the shaded jar.
[INFO] Including org.alluxio:alluxio-job-client:jar:2.2.0-SNAPSHOT in the shaded jar.
[INFO] Including org.alluxio:alluxio-job-common:jar:2.2.0-SNAPSHOT in the shaded jar.
[INFO] Including org.alluxio:alluxio-job-server:jar:2.2.0-SNAPSHOT in the shaded jar.
[INFO] Including com.github.oshi:oshi-core:jar:4.2.0 in the shaded jar.
[INFO] Including net.java.dev.jna:jna:jar:5.5.0 in the shaded jar.
[INFO] Including net.java.dev.jna:jna-platform:jar:5.5.0 in the shaded jar.
[INFO] Including org.apache.parquet:parquet-avro:jar:1.10.0 in the shaded jar.
[INFO] Including org.apache.parquet:parquet-column:jar:1.10.0 in the shaded jar.
[INFO] Including org.apache.parquet:parquet-common:jar:1.10.0 in the shaded jar.
[INFO] Including org.apache.parquet:parquet-encoding:jar:1.10.0 in the shaded jar.
[INFO] Including org.apache.parquet:parquet-hadoop:jar:1.10.0 in the shaded jar.
[INFO] Including org.apache.parquet:parquet-jackson:jar:1.10.0 in the shaded jar.
[INFO] Including org.codehaus.jackson:jackson-mapper-asl:jar:1.9.13 in the shaded jar.
[INFO] Including org.codehaus.jackson:jackson-core-asl:jar:1.9.13 in the shaded jar.
[INFO] Including org.xerial.snappy:snappy-java:jar:1.1.2.6 in the shaded jar.
[INFO] Including commons-pool:commons-pool:jar:1.6 in the shaded jar.
[INFO] Including org.apache.parquet:parquet-format:jar:2.4.0 in the shaded jar.
[INFO] Including org.apache.avro:avro:jar:1.8.2 in the shaded jar.
[INFO] Including com.thoughtworks.paranamer:paranamer:jar:2.7 in the shaded jar.
[INFO] Including org.tukaani:xz:jar:1.5 in the shaded jar.
[INFO] Including it.unimi.dsi:fastutil:jar:7.0.13 in the shaded jar.
[INFO] Including org.apache.parquet:parquet-cli:jar:1.10.0 in the shaded jar.
[INFO] Including net.sf.opencsv:opencsv:jar:2.3 in the shaded jar.
[INFO] Including org.alluxio:alluxio-core-client-hdfs:jar:2.2.0-SNAPSHOT in the shaded jar.
[INFO] Including org.apache.hadoop:hadoop-client:jar:2.6.0 in the shaded jar.
[INFO] Including org.apache.hadoop:hadoop-common:jar:2.6.0 in the shaded jar.
[INFO] Including org.apache.commons:commons-math3:jar:3.1.1 in the shaded jar.
[INFO] Including xmlenc:xmlenc:jar:0.52 in the shaded jar.
[INFO] Including commons-net:commons-net:jar:3.1 in the shaded jar.
[INFO] Including commons-collections:commons-collections:jar:3.2.1 in the shaded jar.
[INFO] Including commons-configuration:commons-configuration:jar:1.6 in the shaded jar.
[INFO] Including commons-digester:commons-digester:jar:1.8 in the shaded jar.
[INFO] Including commons-beanutils:commons-beanutils:jar:1.7.0 in the shaded jar.
[INFO] Including commons-beanutils:commons-beanutils-core:jar:1.8.0 in the shaded jar.
[INFO] Including org.apache.hadoop:hadoop-auth:jar:2.6.0 in the shaded jar.
[INFO] Including org.apache.directory.server:apacheds-kerberos-codec:jar:2.0.0-M15 in the shaded jar.
[INFO] Including org.apache.directory.server:apacheds-i18n:jar:2.0.0-M15 in the shaded jar.
[INFO] Including org.apache.directory.api:api-asn1-api:jar:1.0.0-M20 in the shaded jar.
[INFO] Including org.apache.directory.api:api-util:jar:1.0.0-M20 in the shaded jar.
[INFO] Including org.htrace:htrace-core:jar:3.0.4 in the shaded jar.
[INFO] Including org.apache.hadoop:hadoop-hdfs:jar:2.6.0 in the shaded jar.
[INFO] Including org.mortbay.jetty:jetty-util:jar:6.1.26 in the shaded jar.
[INFO] Including io.netty:netty:jar:3.6.2.Final in the shaded jar.
[INFO] Including xerces:xercesImpl:jar:2.9.1 in the shaded jar.
[INFO] Including xml-apis:xml-apis:jar:1.3.04 in the shaded jar.
[INFO] Including org.apache.hadoop:hadoop-mapreduce-client-app:jar:2.6.0 in the shaded jar.
[INFO] Including org.apache.hadoop:hadoop-mapreduce-client-common:jar:2.6.0 in the shaded jar.
[INFO] Including org.apache.hadoop:hadoop-yarn-client:jar:2.6.0 in the shaded jar.
[INFO] Including org.apache.hadoop:hadoop-yarn-server-common:jar:2.6.0 in the shaded jar.
[INFO] Including org.apache.hadoop:hadoop-mapreduce-client-shuffle:jar:2.6.0 in the shaded jar.
[INFO] Including org.fusesource.leveldbjni:leveldbjni-all:jar:1.8 in the shaded jar.
[INFO] Including org.apache.hadoop:hadoop-yarn-api:jar:2.6.0 in the shaded jar.
[INFO] Including org.apache.hadoop:hadoop-mapreduce-client-core:jar:2.6.0 in the shaded jar.
[INFO] Including org.apache.hadoop:hadoop-yarn-common:jar:2.6.0 in the shaded jar.
[INFO] Including javax.xml.bind:jaxb-api:jar:2.2.2 in the shaded jar.
[INFO] Including javax.xml.stream:stax-api:jar:1.0-2 in the shaded jar.
[INFO] Including javax.activation:activation:jar:1.1 in the shaded jar.
[INFO] Including com.sun.jersey:jersey-client:jar:1.9 in the shaded jar.
[INFO] Including org.codehaus.jackson:jackson-jaxrs:jar:1.9.13 in the shaded jar.
[INFO] Including org.codehaus.jackson:jackson-xc:jar:1.9.13 in the shaded jar.
[INFO] Including org.apache.hadoop:hadoop-mapreduce-client-jobclient:jar:2.6.0 in the shaded jar.
[INFO] Including org.apache.hadoop:hadoop-annotations:jar:2.6.0 in the shaded jar.
[INFO] Including org.alluxio:alluxio-logserver:jar:2.2.0-SNAPSHOT in the shaded jar.
[INFO] Including org.alluxio:alluxio-table-server-master:jar:2.2.0-SNAPSHOT in the shaded jar.
[INFO] Including org.alluxio:alluxio-table-base:jar:2.2.0-SNAPSHOT in the shaded jar.
[INFO] Including org.alluxio:alluxio-table-server-common:jar:2.2.0-SNAPSHOT in the shaded jar.
[INFO] Including org.alluxio:alluxio-integration-mesos:jar:2.2.0-SNAPSHOT in the shaded jar.
[INFO] Including com.beust:jcommander:jar:1.48 in the shaded jar.
[INFO] Including com.google.protobuf:protobuf-java:jar:3.5.1 in the shaded jar.
[INFO] Including org.apache.mesos:mesos:jar:0.23.0 in the shaded jar.
[INFO] Including com.google.code.findbugs:jsr305:jar:3.0.1 in the shaded jar.
[INFO] Including log4j:log4j:jar:1.2.17 in the shaded jar.
[INFO] Including org.slf4j:slf4j-api:jar:1.7.2 in the shaded jar.
[INFO] Including org.slf4j:slf4j-log4j12:jar:1.7.2 in the shaded jar.
[INFO] Including org.checkerframework:checker-qual:jar:2.5.2 in the shaded jar.
[INFO] Including com.google.errorprone:error_prone_annotations:jar:2.2.0 in the shaded jar.
[INFO] Including com.google.j2objc:j2objc-annotations:jar:1.1 in the shaded jar.
[INFO] Including org.javassist:javassist:jar:3.19.0-GA in the shaded jar.
[INFO] Including org.objenesis:objenesis:jar:2.1 in the shaded jar.
[WARNING] Discovered module-info.class. Shading will break its strong encapsulation.
[WARNING] Discovered module-info.class. Shading will break its strong encapsulation.
[WARNING] Discovered module-info.class. Shading will break its strong encapsulation.
[WARNING] Discovered module-info.class. Shading will break its strong encapsulation.
[WARNING] Discovered module-info.class. Shading will break its strong encapsulation.
[WARNING] Discovered module-info.class. Shading will break its strong encapsulation.
[WARNING] Discovered module-info.class. Shading will break its strong encapsulation.
[WARNING] Discovered module-info.class. Shading will break its strong encapsulation.
Tests run: 2, Failures: 0, Errors: 0, Skipped: 0, Time elapsed: 16.541 sec - in alluxio.multi.process.MultiProcessClusterTest

Results :

Tests run: 2, Failures: 0, Errors: 0, Skipped: 0

[INFO] 
[INFO] --- maven-jar-plugin:2.4:jar (default-jar) @ alluxio-minicluster ---
[INFO] Building jar: /usr/src/alluxio/minicluster/target/alluxio-minicluster-2.2.0-SNAPSHOT.jar
[INFO] 
[INFO] >>> maven-source-plugin:2.3:jar (attach-sources) > generate-sources @ alluxio-minicluster >>>
[INFO] 
[INFO] --- maven-enforcer-plugin:1.4:enforce (enforce-maven) @ alluxio-minicluster ---
[INFO] 
[INFO] --- maven-enforcer-plugin:1.4:enforce (enforce-versions) @ alluxio-minicluster ---
[INFO] 
[INFO] --- maven-checkstyle-plugin:2.17:check (checkstyle) @ alluxio-minicluster ---
[INFO] Starting audit...
Audit done.
[INFO] 
[INFO] --- license-maven-plugin:2.9:check (default) @ alluxio-minicluster ---
[INFO] Checking licenses...
[INFO] 
[INFO] <<< maven-source-plugin:2.3:jar (attach-sources) < generate-sources @ alluxio-minicluster <<<
[INFO] 
[INFO] 
[INFO] --- maven-source-plugin:2.3:jar (attach-sources) @ alluxio-minicluster ---
[INFO] Building jar: /usr/src/alluxio/minicluster/target/alluxio-minicluster-2.2.0-SNAPSHOT-sources.jar
[INFO] 
[INFO] --- maven-javadoc-plugin:2.9:jar (attach-javadoc) @ alluxio-minicluster ---
[INFO] Skipping javadoc generation
[INFO] 
[INFO] --- maven-install-plugin:2.4:install (default-install) @ alluxio-minicluster ---
[INFO] Installing /usr/src/alluxio/minicluster/target/alluxio-minicluster-2.2.0-SNAPSHOT.jar to /home/jenkins/.m2/repository/org/alluxio/alluxio-minicluster/2.2.0-SNAPSHOT/alluxio-minicluster-2.2.0-SNAPSHOT.jar
[INFO] Installing /usr/src/alluxio/minicluster/pom.xml to /home/jenkins/.m2/repository/org/alluxio/alluxio-minicluster/2.2.0-SNAPSHOT/alluxio-minicluster-2.2.0-SNAPSHOT.pom
[INFO] Installing /usr/src/alluxio/minicluster/target/alluxio-minicluster-2.2.0-SNAPSHOT-sources.jar to /home/jenkins/.m2/repository/org/alluxio/alluxio-minicluster/2.2.0-SNAPSHOT/alluxio-minicluster-2.2.0-SNAPSHOT-sources.jar
[INFO] 
[INFO] ---------------------< org.alluxio:alluxio-tests >----------------------
[INFO] Building Alluxio Tests 2.2.0-SNAPSHOT                            [54/54]
[INFO] --------------------------------[ jar ]---------------------------------
[INFO] 
[INFO] --- maven-clean-plugin:3.0.0:clean (default-clean) @ alluxio-tests ---
[INFO] 
[INFO] --- maven-enforcer-plugin:1.4:enforce (enforce-maven) @ alluxio-tests ---
[INFO] 
[INFO] --- maven-enforcer-plugin:1.4:enforce (enforce-versions) @ alluxio-tests ---
[INFO] 
[INFO] --- maven-checkstyle-plugin:2.17:check (checkstyle) @ alluxio-tests ---
[INFO] Starting audit...
Audit done.
[INFO] 
[INFO] --- license-maven-plugin:2.9:check (default) @ alluxio-tests ---
[INFO] Checking licenses...
[INFO] 
[INFO] --- maven-resources-plugin:2.7:resources (default-resources) @ alluxio-tests ---
[INFO] Using 'UTF-8' encoding to copy filtered resources.
[INFO] skip non existing resourceDirectory /usr/src/alluxio/tests/src/main/resources
[INFO] 
[INFO] --- maven-compiler-plugin:3.2:compile (default-compile) @ alluxio-tests ---
[INFO] Changes detected - recompiling the module!
[INFO] Compiling 16 source files to /usr/src/alluxio/tests/target/classes
[INFO] 
[INFO] >>> spotbugs-maven-plugin:3.1.12.2:check (default) > :spotbugs @ alluxio-tests >>>
[INFO] 
[INFO] --- spotbugs-maven-plugin:3.1.12.2:spotbugs (spotbugs) @ alluxio-tests ---
[INFO] Fork Value is true
[WARNING] netty-codec-http-4.1.30.Final.jar, netty-all-4.1.30.Final.jar define 338 overlapping classes: 
[WARNING]   - io.netty.handler.codec.http.websocketx.ContinuationWebSocketFrame
[WARNING]   - io.netty.handler.codec.http.HttpObjectDecoder$State
[WARNING]   - io.netty.handler.codec.http.multipart.InterfaceHttpData$HttpDataType
[WARNING]   - io.netty.handler.codec.http.websocketx.extensions.WebSocketClientExtensionHandler
[WARNING]   - io.netty.handler.codec.http.HttpClientCodec$Decoder
[WARNING]   - io.netty.handler.codec.http.ClientCookieEncoder
[WARNING]   - io.netty.handler.codec.http.HttpObjectDecoder$1
[WARNING]   - io.netty.handler.codec.http.HttpHeaderDateFormat$1
[WARNING]   - io.netty.handler.codec.http.HttpHeaders
[WARNING]   - io.netty.handler.codec.http.multipart.HttpPostBodyUtil
[WARNING]   - 328 more...
[WARNING] hadoop-yarn-common-2.6.0.jar, hadoop-yarn-api-2.6.0.jar define 3 overlapping classes: 
[WARNING]   - org.apache.hadoop.yarn.util.package-info
[WARNING]   - org.apache.hadoop.yarn.factories.package-info
[WARNING]   - org.apache.hadoop.yarn.factory.providers.package-info
[WARNING] netty-handler-proxy-4.1.30.Final.jar, netty-all-4.1.30.Final.jar define 9 overlapping classes: 
[WARNING]   - io.netty.handler.proxy.ProxyConnectException
[WARNING]   - io.netty.handler.proxy.ProxyHandler$LazyChannelPromise
[WARNING]   - io.netty.handler.proxy.Socks4ProxyHandler
[WARNING]   - io.netty.handler.proxy.ProxyHandler
[WARNING]   - io.netty.handler.proxy.ProxyHandler$1
[WARNING]   - io.netty.handler.proxy.ProxyHandler$2
[WARNING]   - io.netty.handler.proxy.HttpProxyHandler
[WARNING]   - io.netty.handler.proxy.ProxyConnectionEvent
[WARNING]   - io.netty.handler.proxy.Socks5ProxyHandler
[WARNING] jaxb-api-2.2.2.jar, jakarta.xml.bind-api-2.3.2.jar define 101 overlapping classes: 
[WARNING]   - javax.xml.bind.annotation.XmlValue
[WARNING]   - javax.xml.bind.annotation.XmlElement
[WARNING]   - javax.xml.bind.annotation.adapters.XmlJavaTypeAdapter
[WARNING]   - javax.xml.bind.ContextFinder
[WARNING]   - javax.xml.bind.annotation.XmlElementRefs
[WARNING]   - javax.xml.bind.ParseConversionEvent
[WARNING]   - javax.xml.bind.helpers.DefaultValidationEventHandler
[WARNING]   - javax.xml.bind.annotation.XmlSchema
[WARNING]   - javax.xml.bind.ValidationException
[WARNING]   - javax.xml.bind.annotation.XmlElement$DEFAULT
[WARNING]   - 91 more...
[WARNING] netty-transport-4.1.30.Final.jar, netty-all-4.1.30.Final.jar define 350 overlapping classes: 
[WARNING]   - io.netty.channel.socket.nio.NioSocketChannel$3
[WARNING]   - io.netty.channel.AbstractCoalescingBufferQueue
[WARNING]   - io.netty.channel.SimpleUserEventChannelHandler
[WARNING]   - io.netty.channel.AbstractChannel$AbstractUnsafe$8
[WARNING]   - io.netty.channel.DefaultChannelPipeline$2
[WARNING]   - io.netty.channel.oio.AbstractOioChannel
[WARNING]   - io.netty.bootstrap.Bootstrap$1
[WARNING]   - io.netty.channel.group.ChannelMatchers$ClassMatcher
[WARNING]   - io.netty.channel.nio.AbstractNioMessageChannel$NioMessageUnsafe
[WARNING]   - io.netty.channel.EventLoopGroup
[WARNING]   - 340 more...
[WARNING] netty-all-4.1.30.Final.jar, netty-common-4.1.30.Final.jar define 444 overlapping classes: 
[WARNING]   - io.netty.util.ResourceLeakException
[WARNING]   - io.netty.util.collection.CharObjectHashMap$KeySet
[WARNING]   - io.netty.util.Signal$SignalConstant
[WARNING]   - io.netty.util.concurrent.ImmediateExecutor
[WARNING]   - io.netty.util.AsciiString$CharEqualityComparator
[WARNING]   - io.netty.util.AsciiString$AsciiCaseInsensitiveCharEqualityComparator
[WARNING]   - io.netty.util.collection.LongObjectMap
[WARNING]   - io.netty.util.internal.shaded.org.jctools.queues.CircularArrayOffsetCalculator
[WARNING]   - io.netty.util.AsciiString$1
[WARNING]   - io.netty.util.internal.logging.AbstractInternalLogger
[WARNING]   - 434 more...
[WARNING] commons-beanutils-1.7.0.jar, commons-beanutils-core-1.8.0.jar, commons-collections-3.2.1.jar define 10 overlapping classes: 
[WARNING]   - org.apache.commons.collections.FastHashMap$EntrySet
[WARNING]   - org.apache.commons.collections.FastHashMap$KeySet
[WARNING]   - org.apache.commons.collections.ArrayStack
[WARNING]   - org.apache.commons.collections.FastHashMap$CollectionView$CollectionViewIterator
[WARNING]   - org.apache.commons.collections.FastHashMap$Values
[WARNING]   - org.apache.commons.collections.FastHashMap$CollectionView
[WARNING]   - org.apache.commons.collections.FastHashMap$1
[WARNING]   - org.apache.commons.collections.Buffer
[WARNING]   - org.apache.commons.collections.FastHashMap
[WARNING]   - org.apache.commons.collections.BufferUnderflowException
[WARNING] hadoop-yarn-common-2.6.0.jar, hadoop-yarn-client-2.6.0.jar define 2 overlapping classes: 
[WARNING]   - org.apache.hadoop.yarn.client.api.package-info
[WARNING]   - org.apache.hadoop.yarn.client.api.impl.package-info
[WARNING] activation-1.1.jar, jakarta.activation-api-1.2.1.jar define 27 overlapping classes: 
[WARNING]   - javax.activation.DataContentHandlerFactory
[WARNING]   - javax.activation.ObjectDataContentHandler
[WARNING]   - javax.activation.DataContentHandler
[WARNING]   - javax.activation.CommandObject
[WARNING]   - javax.activation.SecuritySupport$2
[WARNING]   - javax.activation.FileTypeMap
[WARNING]   - javax.activation.CommandInfo
[WARNING]   - javax.activation.MailcapCommandMap
[WARNING]   - javax.activation.DataHandler$1
[WARNING]   - javax.activation.UnsupportedDataTypeException
[WARNING]   - 17 more...
[WARNING] netty-codec-http2-4.1.30.Final.jar, netty-all-4.1.30.Final.jar define 249 overlapping classes: 
[WARNING]   - io.netty.handler.codec.http2.DefaultHttp2LocalFlowController$FlowState
[WARNING]   - io.netty.handler.codec.http2.HpackUtil$IndexType
[WARNING]   - io.netty.handler.codec.http2.HpackEncoder$1
[WARNING]   - io.netty.handler.codec.http2.Http2FrameCodec$Http2RemoteFlowControllerListener
[WARNING]   - io.netty.handler.codec.http2.DefaultHttp2ConnectionEncoder$2
[WARNING]   - io.netty.handler.codec.http2.Http2FrameCodec
[WARNING]   - io.netty.handler.codec.http2.Http2ConnectionHandler$4
[WARNING]   - io.netty.handler.codec.http2.Http2MultiplexCodec$DefaultHttp2StreamChannel$Http2ChannelUnsafe$1
[WARNING]   - io.netty.handler.codec.http2.Http2ClientUpgradeCodec
[WARNING]   - io.netty.handler.codec.http2.DefaultHttp2RemoteFlowController$1
[WARNING]   - 239 more...
[WARNING] netty-buffer-4.1.30.Final.jar, netty-all-4.1.30.Final.jar define 114 overlapping classes: 
[WARNING]   - io.netty.buffer.AdvancedLeakAwareCompositeByteBuf
[WARNING]   - io.netty.buffer.UnsafeByteBufUtil
[WARNING]   - io.netty.buffer.AbstractReferenceCountedByteBuf
[WARNING]   - io.netty.buffer.ByteBufUtil$HexUtil
[WARNING]   - io.netty.buffer.FixedCompositeByteBuf$Component
[WARNING]   - io.netty.buffer.PoolArenaMetric
[WARNING]   - io.netty.buffer.PoolThreadCache$SubPageMemoryRegionCache
[WARNING]   - io.netty.buffer.ByteBufUtil$ThreadLocalDirectByteBuf$1
[WARNING]   - io.netty.buffer.PoolChunkMetric
[WARNING]   - io.netty.buffer.UnpooledDuplicatedByteBuf
[WARNING]   - 104 more...
[WARNING] netty-codec-4.1.30.Final.jar, netty-all-4.1.30.Final.jar define 197 overlapping classes: 
[WARNING]   - io.netty.handler.codec.compression.ZlibUtil
[WARNING]   - io.netty.handler.codec.CharSequenceValueConverter
[WARNING]   - io.netty.handler.codec.compression.Bzip2Encoder$3
[WARNING]   - io.netty.handler.codec.DefaultHeaders$1
[WARNING]   - io.netty.handler.codec.compression.Bzip2BlockDecompressor
[WARNING]   - io.netty.handler.codec.compression.Lz4FrameDecoder$1
[WARNING]   - io.netty.handler.codec.compression.SnappyFrameDecoder
[WARNING]   - io.netty.handler.codec.compression.DecompressionException
[WARNING]   - io.netty.handler.codec.compression.Bzip2Decoder$State
[WARNING]   - io.netty.handler.codec.compression.Bzip2DivSufSort$TRBudget
[WARNING]   - 187 more...
[WARNING] netty-resolver-4.1.30.Final.jar, netty-all-4.1.30.Final.jar define 26 overlapping classes: 
[WARNING]   - io.netty.resolver.RoundRobinInetAddressResolver
[WARNING]   - io.netty.resolver.CompositeNameResolver$2
[WARNING]   - io.netty.resolver.DefaultHostsFileEntriesResolver
[WARNING]   - io.netty.resolver.HostsFileEntriesResolver
[WARNING]   - io.netty.resolver.InetSocketAddressResolver$1
[WARNING]   - io.netty.resolver.DefaultNameResolver
[WARNING]   - io.netty.resolver.AddressResolverGroup
[WARNING]   - io.netty.resolver.InetSocketAddressResolver
[WARNING]   - io.netty.resolver.NoopAddressResolver
[WARNING]   - io.netty.resolver.SimpleNameResolver
[WARNING]   - 16 more...
[WARNING] netty-codec-socks-4.1.30.Final.jar, netty-all-4.1.30.Final.jar define 107 overlapping classes: 
[WARNING]   - io.netty.handler.codec.socks.SocksInitRequestDecoder
[WARNING]   - io.netty.handler.codec.socks.UnknownSocksResponse
[WARNING]   - io.netty.handler.codec.socksx.v5.DefaultSocks5PasswordAuthRequest
[WARNING]   - io.netty.handler.codec.socks.SocksCmdType
[WARNING]   - io.netty.handler.codec.socks.SocksCmdResponse
[WARNING]   - io.netty.handler.codec.socksx.v5.Socks5CommandRequest
[WARNING]   - io.netty.handler.codec.socksx.v5.Socks5PasswordAuthResponseDecoder$State
[WARNING]   - io.netty.handler.codec.socks.SocksResponse
[WARNING]   - io.netty.handler.codec.socksx.v5.Socks5InitialRequest
[WARNING]   - io.netty.handler.codec.socksx.v5.Socks5CommandType
[WARNING]   - 97 more...
[WARNING] commons-beanutils-1.7.0.jar, commons-beanutils-core-1.8.0.jar define 82 overlapping classes: 
[WARNING]   - org.apache.commons.beanutils.ConvertUtilsBean
[WARNING]   - org.apache.commons.beanutils.converters.SqlTimeConverter
[WARNING]   - org.apache.commons.beanutils.Converter
[WARNING]   - org.apache.commons.beanutils.converters.FloatArrayConverter
[WARNING]   - org.apache.commons.beanutils.NestedNullException
[WARNING]   - org.apache.commons.beanutils.ConvertingWrapDynaBean
[WARNING]   - org.apache.commons.beanutils.converters.LongArrayConverter
[WARNING]   - org.apache.commons.beanutils.converters.SqlDateConverter
[WARNING]   - org.apache.commons.beanutils.converters.BooleanArrayConverter
[WARNING]   - org.apache.commons.beanutils.converters.StringConverter
[WARNING]   - 72 more...
[WARNING] netty-handler-4.1.30.Final.jar, netty-all-4.1.30.Final.jar define 254 overlapping classes: 
[WARNING]   - io.netty.handler.ssl.ApplicationProtocolNegotiator
[WARNING]   - io.netty.handler.ssl.Java9SslUtils$6
[WARNING]   - io.netty.handler.ssl.JdkDefaultApplicationProtocolNegotiator
[WARNING]   - io.netty.handler.ssl.PemReader
[WARNING]   - io.netty.handler.timeout.IdleStateHandler
[WARNING]   - io.netty.handler.ipfilter.IpSubnetFilterRule
[WARNING]   - io.netty.handler.traffic.GlobalChannelTrafficShapingHandler$1
[WARNING]   - io.netty.handler.ssl.OpenSslPrivateKey$OpenSslPrivateKeyMaterial
[WARNING]   - io.netty.handler.ssl.OpenSslCertificateException
[WARNING]   - io.netty.handler.ssl.SniHandler$Selection
[WARNING]   - 244 more...
[WARNING] maven-shade-plugin has detected that some class files are
[WARNING] present in two or more JARs. When this happens, only one
[WARNING] single version of the class is copied to the uber jar.
[WARNING] Usually this is not harmful and you can skip these warnings,
[WARNING] otherwise try to manually exclude artifacts based on
[WARNING] mvn dependency:tree -Ddetail=true and the above output.
[WARNING] See http://maven.apache.org/plugins/maven-shade-plugin/
[INFO] Replacing /usr/src/alluxio/assembly/server/target/alluxio-assembly-server-2.2.0-SNAPSHOT-jar-with-dependencies.jar with /usr/src/alluxio/assembly/server/target/alluxio-assembly-server-2.2.0-SNAPSHOT-shaded.jar
[INFO] 
[INFO] --- maven-install-plugin:2.4:install (default-install) @ alluxio-assembly-server ---
[INFO] Installing /usr/src/alluxio/assembly/server/target/alluxio-assembly-server-2.2.0-SNAPSHOT.jar to /home/jenkins/.m2/repository/org/alluxio/alluxio-assembly-server/2.2.0-SNAPSHOT/alluxio-assembly-server-2.2.0-SNAPSHOT.jar
[INFO] Installing /usr/src/alluxio/assembly/server/pom.xml to /home/jenkins/.m2/repository/org/alluxio/alluxio-assembly-server/2.2.0-SNAPSHOT/alluxio-assembly-server-2.2.0-SNAPSHOT.pom
[WARNING] Discovered module-info.class. Shading will break its strong encapsulation.
[WARNING] Discovered module-info.class. Shading will break its strong encapsulation.
[WARNING] Discovered module-info.class. Shading will break its strong encapsulation.
[INFO] Done SpotBugs Analysis....
[INFO] 
[INFO] <<< spotbugs-maven-plugin:3.1.12.2:check (default) < :spotbugs @ alluxio-tests <<<
[INFO] 
[INFO] 
[INFO] --- spotbugs-maven-plugin:3.1.12.2:check (default) @ alluxio-tests ---
[INFO] BugInstance size is 0
[INFO] Error size is 0
[INFO] No errors/warnings found
[INFO] 
[INFO] --- jcp:6.1.2:preprocessTests (preprocessSources) @ alluxio-tests ---
[INFO] Preprocess sources : /usr/src/alluxio/tests/src/test/java
[INFO] Preprocess destination : /usr/src/alluxio/tests/target/generated-test-sources/preprocessed
[INFO] -----------------------------------------------------------------
[INFO] Completed, preprocessed 204 files, copied 0 files, elapsed time 191ms
[INFO] A Compile source root has been removed from the root list [/usr/src/alluxio/tests/src/test/java]
[INFO] The New compile source root has been added into the list [/usr/src/alluxio/tests/target/generated-test-sources/preprocessed]
[INFO] 
[INFO] --- maven-resources-plugin:2.7:testResources (default-testResources) @ alluxio-tests ---
[INFO] Using 'UTF-8' encoding to copy filtered resources.
[INFO] Copying 10 resources
[INFO] 
[INFO] --- maven-compiler-plugin:3.2:testCompile (default-testCompile) @ alluxio-tests ---
[INFO] Changes detected - recompiling the module!
[INFO] Compiling 196 source files to /usr/src/alluxio/tests/target/test-classes
[INFO] /usr/src/alluxio/tests/target/generated-test-sources/preprocessed/alluxio/client/rest/BlockMasterClientRestApiTest.java: Some input files use or override a deprecated API.
[INFO] /usr/src/alluxio/tests/target/generated-test-sources/preprocessed/alluxio/client/rest/BlockMasterClientRestApiTest.java: Recompile with -Xlint:deprecation for details.
[INFO] /usr/src/alluxio/tests/target/generated-test-sources/preprocessed/alluxio/client/rest/AlluxioMasterRestApiTest.java: Some input files use unchecked or unsafe operations.
[INFO] /usr/src/alluxio/tests/target/generated-test-sources/preprocessed/alluxio/client/rest/AlluxioMasterRestApiTest.java: Recompile with -Xlint:unchecked for details.
[INFO] 
[INFO] --- maven-surefire-plugin:2.19.1:test (default-test) @ alluxio-tests ---

-------------------------------------------------------
 T E S T S
-------------------------------------------------------
Running alluxio.client.cli.fs.GetConfTest
Running alluxio.client.cli.JournalToolTest
Running alluxio.client.cli.fs.ConfigurationDocGeneratorTest
Running alluxio.client.cli.fs.FileSystemShellUtilsTest
Tests run: 24, Failures: 0, Errors: 0, Skipped: 0, Time elapsed: 0.437 sec - in alluxio.client.cli.fs.ConfigurationDocGeneratorTest
Tests run: 7, Failures: 0, Errors: 0, Skipped: 0, Time elapsed: 0.887 sec - in alluxio.client.cli.fs.GetConfTest
Running alluxio.client.cli.fs.JobServiceFaultToleranceShellTest
Running alluxio.client.cli.fs.command.CatCommandIntegrationTest
Tests run: 1, Failures: 0, Errors: 0, Skipped: 0, Time elapsed: 11.64 sec - in alluxio.client.cli.fs.JobServiceFaultToleranceShellTest
Tests run: 5, Failures: 0, Errors: 0, Skipped: 0, Time elapsed: 13.695 sec - in alluxio.client.cli.fs.FileSystemShellUtilsTest
Running alluxio.client.cli.fs.command.CheckConsistencyCommandIntegrationTest
Running alluxio.client.cli.fs.command.ChecksumCommandIntegrationTest
Tests run: 4, Failures: 0, Errors: 0, Skipped: 0, Time elapsed: 16.998 sec - in alluxio.client.cli.fs.command.CatCommandIntegrationTest
Running alluxio.client.cli.fs.command.ChgrpCommandIntegrationTest
Tests run: 5, Failures: 0, Errors: 0, Skipped: 0, Time elapsed: 24.421 sec - in alluxio.client.cli.JournalToolTest
Running alluxio.client.cli.fs.command.ChmodCommandIntegrationTest
Tests run: 3, Failures: 0, Errors: 0, Skipped: 0, Time elapsed: 12.86 sec - in alluxio.client.cli.fs.command.ChecksumCommandIntegrationTest
Running alluxio.client.cli.fs.command.ChownCommandIntegrationTest
Tests run: 4, Failures: 0, Errors: 0, Skipped: 0, Time elapsed: 15.662 sec - in alluxio.client.cli.fs.command.CheckConsistencyCommandIntegrationTest
Running alluxio.client.cli.fs.command.CopyFromLocalCommandIntegrationTest
Tests run: 3, Failures: 0, Errors: 0, Skipped: 0, Time elapsed: 12.379 sec - in alluxio.client.cli.fs.command.ChgrpCommandIntegrationTest
Running alluxio.client.cli.fs.command.CopyToLocalCommandIntegrationTest
Tests run: 4, Failures: 0, Errors: 0, Skipped: 0, Time elapsed: 14.845 sec - in alluxio.client.cli.fs.command.ChmodCommandIntegrationTest
Running alluxio.client.cli.fs.command.CountCommandTest
Tests run: 2, Failures: 0, Errors: 0, Skipped: 0, Time elapsed: 12.063 sec - in alluxio.client.cli.fs.command.CountCommandTest
Tests run: 8, Failures: 0, Errors: 0, Skipped: 0, Time elapsed: 25.549 sec - in alluxio.client.cli.fs.command.ChownCommandIntegrationTest
Running alluxio.client.cli.fs.command.CpCommandIntegrationTest
Running alluxio.client.cli.fs.command.DistributedLoadCommandTest
Tests run: 10, Failures: 0, Errors: 0, Skipped: 0, Time elapsed: 31.941 sec - in alluxio.client.cli.fs.command.CopyToLocalCommandIntegrationTest
Running alluxio.client.cli.fs.command.DistributedMvCommandTest
Tests run: 2, Failures: 0, Errors: 0, Skipped: 0, Time elapsed: 12.552 sec - in alluxio.client.cli.fs.command.DistributedLoadCommandTest
Running alluxio.client.cli.fs.command.DuCommandIntegrationTest
[WARNING] netty-codec-http-4.1.30.Final.jar, netty-all-4.1.30.Final.jar define 338 overlapping classes: 
[WARNING]   - io.netty.handler.codec.http.websocketx.ContinuationWebSocketFrame
[WARNING]   - io.netty.handler.codec.http.HttpObjectDecoder$State
[WARNING]   - io.netty.handler.codec.http.multipart.InterfaceHttpData$HttpDataType
[WARNING]   - io.netty.handler.codec.http.websocketx.extensions.WebSocketClientExtensionHandler
[WARNING]   - io.netty.handler.codec.http.HttpClientCodec$Decoder
[WARNING]   - io.netty.handler.codec.http.ClientCookieEncoder
[WARNING]   - io.netty.handler.codec.http.HttpObjectDecoder$1
[WARNING]   - io.netty.handler.codec.http.HttpHeaderDateFormat$1
[WARNING]   - io.netty.handler.codec.http.HttpHeaders
[WARNING]   - io.netty.handler.codec.http.multipart.HttpPostBodyUtil
[WARNING]   - 328 more...
[WARNING] netty-handler-proxy-4.1.30.Final.jar, netty-all-4.1.30.Final.jar define 9 overlapping classes: 
[WARNING]   - io.netty.handler.proxy.ProxyConnectException
[WARNING]   - io.netty.handler.proxy.ProxyHandler$LazyChannelPromise
[WARNING]   - io.netty.handler.proxy.Socks4ProxyHandler
[WARNING]   - io.netty.handler.proxy.ProxyHandler
[WARNING]   - io.netty.handler.proxy.ProxyHandler$1
[WARNING]   - io.netty.handler.proxy.ProxyHandler$2
[WARNING]   - io.netty.handler.proxy.HttpProxyHandler
[WARNING]   - io.netty.handler.proxy.ProxyConnectionEvent
[WARNING]   - io.netty.handler.proxy.Socks5ProxyHandler
[WARNING] netty-transport-4.1.30.Final.jar, netty-all-4.1.30.Final.jar define 350 overlapping classes: 
[WARNING]   - io.netty.channel.socket.nio.NioSocketChannel$3
[WARNING]   - io.netty.channel.AbstractCoalescingBufferQueue
[WARNING]   - io.netty.channel.AbstractChannel$AbstractUnsafe$8
[WARNING]   - io.netty.channel.SimpleUserEventChannelHandler
[WARNING]   - io.netty.channel.DefaultChannelPipeline$2
[WARNING]   - io.netty.channel.oio.AbstractOioChannel
[WARNING]   - io.netty.bootstrap.Bootstrap$1
[WARNING]   - io.netty.channel.group.ChannelMatchers$ClassMatcher
[WARNING]   - io.netty.channel.nio.AbstractNioMessageChannel$NioMessageUnsafe
[WARNING]   - io.netty.channel.EventLoopGroup
[WARNING]   - 340 more...
[WARNING] netty-all-4.1.30.Final.jar, netty-common-4.1.30.Final.jar define 444 overlapping classes: 
[WARNING]   - io.netty.util.ResourceLeakException
[WARNING]   - io.netty.util.collection.CharObjectHashMap$KeySet
[WARNING]   - io.netty.util.Signal$SignalConstant
[WARNING]   - io.netty.util.concurrent.ImmediateExecutor
[WARNING]   - io.netty.util.AsciiString$CharEqualityComparator
[WARNING]   - io.netty.util.AsciiString$AsciiCaseInsensitiveCharEqualityComparator
[WARNING]   - io.netty.util.collection.LongObjectMap
[WARNING]   - io.netty.util.internal.shaded.org.jctools.queues.CircularArrayOffsetCalculator
[WARNING]   - io.netty.util.AsciiString$1
[WARNING]   - io.netty.util.internal.logging.AbstractInternalLogger
[WARNING]   - 434 more...
[WARNING] netty-codec-http2-4.1.30.Final.jar, netty-all-4.1.30.Final.jar define 249 overlapping classes: 
[WARNING]   - io.netty.handler.codec.http2.DefaultHttp2LocalFlowController$FlowState
[WARNING]   - io.netty.handler.codec.http2.HpackUtil$IndexType
[WARNING]   - io.netty.handler.codec.http2.HpackEncoder$1
[WARNING]   - io.netty.handler.codec.http2.Http2FrameCodec$Http2RemoteFlowControllerListener
[WARNING]   - io.netty.handler.codec.http2.DefaultHttp2ConnectionEncoder$2
[WARNING]   - io.netty.handler.codec.http2.Http2ConnectionHandler$4
[WARNING]   - io.netty.handler.codec.http2.Http2FrameCodec
[WARNING]   - io.netty.handler.codec.http2.Http2MultiplexCodec$DefaultHttp2StreamChannel$Http2ChannelUnsafe$1
[WARNING]   - io.netty.handler.codec.http2.Http2ClientUpgradeCodec
[WARNING]   - io.netty.handler.codec.http2.DefaultHttp2RemoteFlowController$1
[WARNING]   - 239 more...
[WARNING] netty-buffer-4.1.30.Final.jar, netty-all-4.1.30.Final.jar define 114 overlapping classes: 
[WARNING]   - io.netty.buffer.AdvancedLeakAwareCompositeByteBuf
[WARNING]   - io.netty.buffer.UnsafeByteBufUtil
[WARNING]   - io.netty.buffer.AbstractReferenceCountedByteBuf
[WARNING]   - io.netty.buffer.FixedCompositeByteBuf$Component
[WARNING]   - io.netty.buffer.ByteBufUtil$HexUtil
[WARNING]   - io.netty.buffer.PoolArenaMetric
[WARNING]   - io.netty.buffer.PoolThreadCache$SubPageMemoryRegionCache
[WARNING]   - io.netty.buffer.ByteBufUtil$ThreadLocalDirectByteBuf$1
[WARNING]   - io.netty.buffer.PoolChunkMetric
[WARNING]   - io.netty.buffer.UnpooledDuplicatedByteBuf
[WARNING]   - 104 more...
[WARNING] netty-codec-4.1.30.Final.jar, netty-all-4.1.30.Final.jar define 197 overlapping classes: 
[WARNING]   - io.netty.handler.codec.compression.ZlibUtil
[WARNING]   - io.netty.handler.codec.CharSequenceValueConverter
[WARNING]   - io.netty.handler.codec.compression.Bzip2Encoder$3
[WARNING]   - io.netty.handler.codec.DefaultHeaders$1
[WARNING]   - io.netty.handler.codec.compression.Bzip2BlockDecompressor
[WARNING]   - io.netty.handler.codec.compression.Lz4FrameDecoder$1
[WARNING]   - io.netty.handler.codec.compression.SnappyFrameDecoder
[WARNING]   - io.netty.handler.codec.compression.DecompressionException
[WARNING]   - io.netty.handler.codec.compression.Bzip2DivSufSort$TRBudget
[WARNING]   - io.netty.handler.codec.compression.Bzip2Decoder$State
[WARNING]   - 187 more...
[WARNING] netty-resolver-4.1.30.Final.jar, netty-all-4.1.30.Final.jar define 26 overlapping classes: 
[WARNING]   - io.netty.resolver.RoundRobinInetAddressResolver
[WARNING]   - io.netty.resolver.CompositeNameResolver$2
[WARNING]   - io.netty.resolver.DefaultHostsFileEntriesResolver
[WARNING]   - io.netty.resolver.InetSocketAddressResolver$1
[WARNING]   - io.netty.resolver.DefaultNameResolver
[WARNING]   - io.netty.resolver.HostsFileEntriesResolver
[WARNING]   - io.netty.resolver.InetSocketAddressResolver
[WARNING]   - io.netty.resolver.AddressResolverGroup
[WARNING]   - io.netty.resolver.NoopAddressResolver
[WARNING]   - io.netty.resolver.SimpleNameResolver
[WARNING]   - 16 more...
[WARNING] netty-codec-socks-4.1.30.Final.jar, netty-all-4.1.30.Final.jar define 107 overlapping classes: 
[WARNING]   - io.netty.handler.codec.socks.SocksInitRequestDecoder
[WARNING]   - io.netty.handler.codec.socks.UnknownSocksResponse
[WARNING]   - io.netty.handler.codec.socksx.v5.DefaultSocks5PasswordAuthRequest
[WARNING]   - io.netty.handler.codec.socks.SocksCmdType
[WARNING]   - io.netty.handler.codec.socks.SocksCmdResponse
[WARNING]   - io.netty.handler.codec.socksx.v5.Socks5CommandRequest
[WARNING]   - io.netty.handler.codec.socksx.v5.Socks5PasswordAuthResponseDecoder$State
[WARNING]   - io.netty.handler.codec.socks.SocksResponse
[WARNING]   - io.netty.handler.codec.socksx.v5.Socks5InitialRequest
[WARNING]   - io.netty.handler.codec.socksx.v5.Socks5CommandType
[WARNING]   - 97 more...
[WARNING] netty-handler-4.1.30.Final.jar, netty-all-4.1.30.Final.jar define 254 overlapping classes: 
[WARNING]   - io.netty.handler.ssl.ApplicationProtocolNegotiator
[WARNING]   - io.netty.handler.ssl.Java9SslUtils$6
[WARNING]   - io.netty.handler.ssl.JdkDefaultApplicationProtocolNegotiator
[WARNING]   - io.netty.handler.ssl.PemReader
[WARNING]   - io.netty.handler.timeout.IdleStateHandler
[WARNING]   - io.netty.handler.ipfilter.IpSubnetFilterRule
[WARNING]   - io.netty.handler.traffic.GlobalChannelTrafficShapingHandler$1
[WARNING]   - io.netty.handler.ssl.OpenSslPrivateKey$OpenSslPrivateKeyMaterial
[WARNING]   - io.netty.handler.ssl.OpenSslCertificateException
[WARNING]   - io.netty.handler.ssl.SniHandler$Selection
[WARNING]   - 244 more...
[WARNING] maven-shade-plugin has detected that some class files are
[WARNING] present in two or more JARs. When this happens, only one
[WARNING] single version of the class is copied to the uber jar.
[WARNING] Usually this is not harmful and you can skip these warnings,
[WARNING] otherwise try to manually exclude artifacts based on
[WARNING] mvn dependency:tree -Ddetail=true and the above output.
[WARNING] See http://maven.apache.org/plugins/maven-shade-plugin/
Tests run: 1, Failures: 0, Errors: 0, Skipped: 0, Time elapsed: 8.972 sec - in alluxio.client.cli.fs.command.DistributedMvCommandTest
Running alluxio.client.cli.fs.command.FreeCommandIntegrationTest
Tests run: 2, Failures: 0, Errors: 0, Skipped: 0, Time elapsed: 10.723 sec - in alluxio.client.cli.fs.command.DuCommandIntegrationTest
Running alluxio.client.cli.fs.command.HeadCommandIntegrationTest
Tests run: 16, Failures: 0, Errors: 0, Skipped: 0, Time elapsed: 53.157 sec - in alluxio.client.cli.fs.command.CopyFromLocalCommandIntegrationTest
Running alluxio.client.cli.fs.command.HelpCommandIntegrationTest
[INFO] Replacing original artifact with shaded artifact.
[INFO] Replacing /usr/src/alluxio/shaded/client/target/alluxio-shaded-client-2.2.0-SNAPSHOT.jar with /usr/src/alluxio/shaded/client/target/alluxio-shaded-client-2.2.0-SNAPSHOT-shaded.jar
[INFO] Replacing original source artifact with shaded source artifact.
[INFO] Replacing /usr/src/alluxio/shaded/client/target/alluxio-shaded-client-2.2.0-SNAPSHOT-sources.jar with /usr/src/alluxio/shaded/client/target/alluxio-shaded-client-2.2.0-SNAPSHOT-shaded-sources.jar
[INFO] Dependency-reduced POM written at: /usr/src/alluxio/shaded/client/dependency-reduced-pom.xml
[INFO] 
[INFO] --- maven-install-plugin:2.4:install (default-install) @ alluxio-shaded-client ---
[INFO] Installing /usr/src/alluxio/shaded/client/target/alluxio-shaded-client-2.2.0-SNAPSHOT.jar to /home/jenkins/.m2/repository/org/alluxio/alluxio-shaded-client/2.2.0-SNAPSHOT/alluxio-shaded-client-2.2.0-SNAPSHOT.jar
[INFO] Installing /usr/src/alluxio/shaded/client/dependency-reduced-pom.xml to /home/jenkins/.m2/repository/org/alluxio/alluxio-shaded-client/2.2.0-SNAPSHOT/alluxio-shaded-client-2.2.0-SNAPSHOT.pom
[INFO] Installing /usr/src/alluxio/shaded/client/target/alluxio-shaded-client-2.2.0-SNAPSHOT-javadoc.jar to /home/jenkins/.m2/repository/org/alluxio/alluxio-shaded-client/2.2.0-SNAPSHOT/alluxio-shaded-client-2.2.0-SNAPSHOT-javadoc.jar
[INFO] Installing /usr/src/alluxio/shaded/client/target/alluxio-shaded-client-2.2.0-SNAPSHOT-sources.jar to /home/jenkins/.m2/repository/org/alluxio/alluxio-shaded-client/2.2.0-SNAPSHOT/alluxio-shaded-client-2.2.0-SNAPSHOT-sources.jar
[INFO] Installing /usr/src/alluxio/shaded/client/target/alluxio-shaded-client-2.2.0-SNAPSHOT-sources.jar to /home/jenkins/.m2/repository/org/alluxio/alluxio-shaded-client/2.2.0-SNAPSHOT/alluxio-shaded-client-2.2.0-SNAPSHOT-sources.jar
[INFO] 
[INFO] --- copy-rename-maven-plugin:1.0:copy (copy-and-rename-file) @ alluxio-shaded-client ---
[INFO] Copied /usr/src/alluxio/shaded/client/target/alluxio-shaded-client-2.2.0-SNAPSHOT.jar to /usr/src/alluxio/client/alluxio-2.2.0-SNAPSHOT-client.jar
Tests run: 4, Failures: 0, Errors: 0, Skipped: 0, Time elapsed: 20.576 sec - in alluxio.client.cli.fs.command.HelpCommandIntegrationTest
Tests run: 8, Failures: 0, Errors: 0, Skipped: 0, Time elapsed: 30.446 sec - in alluxio.client.cli.fs.command.FreeCommandIntegrationTest
Running alluxio.client.cli.fs.command.LeaderCommandIntegrationTest
Running alluxio.client.cli.fs.command.LoadCommandIntegrationTest
Tests run: 7, Failures: 0, Errors: 0, Skipped: 0, Time elapsed: 28.229 sec - in alluxio.client.cli.fs.command.HeadCommandIntegrationTest
Running alluxio.client.cli.fs.command.LocationCommandIntegrationTest
Tests run: 2, Failures: 0, Errors: 0, Skipped: 0, Time elapsed: 9.607 sec - in alluxio.client.cli.fs.command.LeaderCommandIntegrationTest
Tests run: 1, Failures: 0, Errors: 0, Skipped: 0, Time elapsed: 7.316 sec - in alluxio.client.cli.fs.command.LocationCommandIntegrationTest
Running alluxio.client.cli.fs.command.LsCommandIntegrationTest
Running alluxio.client.cli.fs.command.MkdirCommandIntegrationTest
Tests run: 4, Failures: 0, Errors: 0, Skipped: 0, Time elapsed: 14.949 sec - in alluxio.client.cli.fs.command.LoadCommandIntegrationTest
Running alluxio.client.cli.fs.command.MountCommandTest
Tests run: 7, Failures: 0, Errors: 0, Skipped: 0, Time elapsed: 23.511 sec - in alluxio.client.cli.fs.command.MkdirCommandIntegrationTest
Running alluxio.client.cli.fs.command.MvCommandIntegrationTest
Tests run: 10, Failures: 0, Errors: 0, Skipped: 0, Time elapsed: 29.999 sec - in alluxio.client.cli.fs.command.MountCommandTest
Tests run: 3, Failures: 0, Errors: 0, Skipped: 0, Time elapsed: 11.225 sec - in alluxio.client.cli.fs.command.MvCommandIntegrationTest
Running alluxio.client.cli.fs.command.PersistCommandTest
Running alluxio.client.cli.fs.command.PinCommandIntegrationTest
Tests run: 29, Failures: 0, Errors: 2, Skipped: 0, Time elapsed: 115.475 sec <<< FAILURE! - in alluxio.client.cli.fs.command.CpCommandIntegrationTest
copyFromLocalLarge(alluxio.client.cli.fs.command.CpCommandIntegrationTest)  Time elapsed: 10.164 sec  <<< ERROR!
alluxio.exception.status.InternalException: http2 exception (Zero Copy GrpcDataReader)
	at alluxio.client.cli.fs.command.CpCommandIntegrationTest.copyFromLocalLarge(CpCommandIntegrationTest.java:442)
Caused by: io.grpc.StatusRuntimeException: INTERNAL: http2 exception
Caused by: io.netty.handler.codec.http2.Http2Exception$StreamException: Stream closed before write could take place

copyFromLocalLarge(alluxio.client.cli.fs.command.CpCommandIntegrationTest)  Time elapsed: 11.081 sec  <<< ERROR!
alluxio.exception.status.InternalException: http2 exception (Zero Copy GrpcDataReader)
	at alluxio.client.cli.fs.command.CpCommandIntegrationTest.copyFromLocalLarge(CpCommandIntegrationTest.java:442)
Caused by: io.grpc.StatusRuntimeException: INTERNAL: http2 exception
Caused by: io.netty.handler.codec.http2.Http2Exception$StreamException: Stream closed before write could take place

Running alluxio.client.cli.fs.command.RmCommandIntegrationTest
Tests run: 23, Failures: 0, Errors: 0, Skipped: 0, Time elapsed: 68.07 sec - in alluxio.client.cli.fs.command.LsCommandIntegrationTest
Running alluxio.client.cli.fs.command.SetFaclCommandIntegrationTest
Tests run: 6, Failures: 0, Errors: 0, Skipped: 0, Time elapsed: 18.46 sec - in alluxio.client.cli.fs.command.RmCommandIntegrationTest
Running alluxio.client.cli.fs.command.SetReplicationCommandTest
Tests run: 2, Failures: 0, Errors: 0, Skipped: 0, Time elapsed: 9.877 sec - in alluxio.client.cli.fs.command.SetFaclCommandIntegrationTest
Running alluxio.client.cli.fs.command.SetTtlCommandIntegrationTest
Tests run: 8, Failures: 0, Errors: 0, Skipped: 0, Time elapsed: 21.946 sec - in alluxio.client.cli.fs.command.SetTtlCommandIntegrationTest
Running alluxio.client.cli.fs.command.StatCommandIntegrationTest
Tests run: 13, Failures: 0, Errors: 0, Skipped: 0, Time elapsed: 33.674 sec - in alluxio.client.cli.fs.command.SetReplicationCommandTest
Running alluxio.client.cli.fs.command.TailCommandIntegrationTest
Tests run: 6, Failures: 0, Errors: 2, Skipped: 0, Time elapsed: 79.33 sec <<< FAILURE! - in alluxio.client.cli.fs.command.PinCommandIntegrationTest
setPinToSpecificMedia(alluxio.client.cli.fs.command.PinCommandIntegrationTest)  Time elapsed: 65.672 sec  <<< ERROR!
java.lang.RuntimeException: Timed out waiting for process Alluxio job master @ 9ad10818d940:44220 to start

setPinToSpecificMedia(alluxio.client.cli.fs.command.PinCommandIntegrationTest)  Time elapsed: 65.673 sec  <<< ERROR!
java.lang.NullPointerException

Tests run: 20, Failures: 0, Errors: 0, Skipped: 0, Time elapsed: 80.091 sec - in alluxio.client.cli.fs.command.PersistCommandTest
Running alluxio.client.cli.fs.command.TestCommandIntegrationTest
Running alluxio.client.cli.fs.command.TouchCommandIntegrationTest
Tests run: 5, Failures: 0, Errors: 0, Skipped: 0, Time elapsed: 16.472 sec - in alluxio.client.cli.fs.command.StatCommandIntegrationTest
Running alluxio.client.cli.fs.command.UnsetTtlTest
Tests run: 1, Failures: 0, Errors: 0, Skipped: 0, Time elapsed: 7.726 sec - in alluxio.client.cli.fs.command.UnsetTtlTest
Tests run: 7, Failures: 0, Errors: 0, Skipped: 0, Time elapsed: 21.357 sec - in alluxio.client.cli.fs.command.TailCommandIntegrationTest
Tests run: 2, Failures: 0, Errors: 0, Skipped: 0, Time elapsed: 10.355 sec - in alluxio.client.cli.fs.command.TouchCommandIntegrationTest
Running alluxio.client.cli.fs.command.UpdateMountCommandTest
Running alluxio.client.cli.fsadmin.BackupCommandIntegrationTest
Running alluxio.client.cli.fsadmin.command.CapacityCommandIntegrationTest
Tests run: 2, Failures: 0, Errors: 0, Skipped: 0, Time elapsed: 10.574 sec - in alluxio.client.cli.fsadmin.BackupCommandIntegrationTest
Running alluxio.client.cli.fsadmin.command.CheckpointCommandIntegrationTest
Tests run: 4, Failures: 0, Errors: 0, Skipped: 0, Time elapsed: 12.376 sec - in alluxio.client.cli.fsadmin.command.CapacityCommandIntegrationTest
Running alluxio.client.cli.fsadmin.command.DoctorCommandIntegrationTest
Tests run: 1, Failures: 0, Errors: 0, Skipped: 0, Time elapsed: 6.466 sec - in alluxio.client.cli.fsadmin.command.CheckpointCommandIntegrationTest
Running alluxio.client.cli.fsadmin.command.GetBlockInfoCommandIntegrationTest
Tests run: 8, Failures: 0, Errors: 0, Skipped: 0, Time elapsed: 25.354 sec - in alluxio.client.cli.fs.command.UpdateMountCommandTest
Tests run: 4, Failures: 0, Errors: 0, Skipped: 0, Time elapsed: 11.387 sec - in alluxio.client.cli.fsadmin.command.DoctorCommandIntegrationTest
Running alluxio.client.cli.fsadmin.command.JournalCommandIntegrationTest
Running alluxio.client.cli.fsadmin.command.MetricsCommandIntegrationTest
Tests run: 3, Failures: 0, Errors: 0, Skipped: 0, Time elapsed: 9.541 sec - in alluxio.client.cli.fsadmin.command.GetBlockInfoCommandIntegrationTest
Running alluxio.client.cli.fsadmin.command.PathConfCommandIntegrationTest
Tests run: 1, Failures: 0, Errors: 0, Skipped: 0, Time elapsed: 6.424 sec - in alluxio.client.cli.fsadmin.command.JournalCommandIntegrationTest
Tests run: 1, Failures: 0, Errors: 0, Skipped: 0, Time elapsed: 6.623 sec - in alluxio.client.cli.fsadmin.command.MetricsCommandIntegrationTest
Running alluxio.client.cli.fsadmin.command.QuorumCommandIntegrationTest
Running alluxio.client.cli.fsadmin.command.ReportCommandIntegrationTest
Tests run: 17, Failures: 0, Errors: 0, Skipped: 0, Time elapsed: 47.011 sec - in alluxio.client.cli.fs.command.TestCommandIntegrationTest
Running alluxio.client.cli.fsadmin.metrics.MetricsCommandIntegrationTest
Tests run: 1, Failures: 0, Errors: 0, Skipped: 0, Time elapsed: 7.044 sec - in alluxio.client.cli.fsadmin.metrics.MetricsCommandIntegrationTest
Running alluxio.client.cli.fsadmin.pathconf.AddCommandIntegrationTest
Tests run: 4, Failures: 0, Errors: 0, Skipped: 0, Time elapsed: 11.89 sec - in alluxio.client.cli.fsadmin.command.ReportCommandIntegrationTest
Running alluxio.client.cli.fsadmin.pathconf.ListCommandIntegrationTest
Tests run: 10, Failures: 0, Errors: 0, Skipped: 0, Time elapsed: 20.139 sec - in alluxio.client.cli.fsadmin.command.PathConfCommandIntegrationTest
Running alluxio.client.cli.fsadmin.pathconf.RemoveCommandIntegrationTest
Tests run: 2, Failures: 0, Errors: 0, Skipped: 0, Time elapsed: 7.611 sec - in alluxio.client.cli.fsadmin.pathconf.ListCommandIntegrationTest
Running alluxio.client.cli.fsadmin.pathconf.ShowCommandIntegrationTest
Tests run: 1, Failures: 0, Errors: 0, Skipped: 0, Time elapsed: 6.627 sec - in alluxio.client.cli.fsadmin.pathconf.RemoveCommandIntegrationTest
Running alluxio.client.cli.job.CancelCommandTest
Tests run: 6, Failures: 0, Errors: 0, Skipped: 0, Time elapsed: 14.698 sec - in alluxio.client.cli.fsadmin.pathconf.AddCommandIntegrationTest
Running alluxio.client.cli.job.LeaderCommandTest
Tests run: 1, Failures: 0, Errors: 0, Skipped: 0, Time elapsed: 8.077 sec - in alluxio.client.cli.job.CancelCommandTest
Tests run: 1, Failures: 0, Errors: 0, Skipped: 0, Time elapsed: 7.558 sec - in alluxio.client.cli.job.LeaderCommandTest
Running alluxio.client.cli.job.ListCommandTest
Running alluxio.client.cli.job.StatCommandTest
Tests run: 8, Failures: 0, Errors: 0, Skipped: 0, Time elapsed: 17.195 sec - in alluxio.client.cli.fsadmin.pathconf.ShowCommandIntegrationTest
Tests run: 3, Failures: 0, Errors: 0, Skipped: 0, Time elapsed: 39.733 sec - in alluxio.client.cli.fsadmin.command.QuorumCommandIntegrationTest
Running alluxio.client.fs.BlockWorkerClientCloseIntegrationTest
Running alluxio.client.fs.BufferedBlockInStreamIntegrationTest
Tests run: 1, Failures: 0, Errors: 0, Skipped: 0, Time elapsed: 8.157 sec - in alluxio.client.cli.job.ListCommandTest
Tests run: 1, Failures: 0, Errors: 0, Skipped: 0, Time elapsed: 8.026 sec - in alluxio.client.cli.job.StatCommandTest
Running alluxio.client.fs.CheckConsistencyIntegrationTest
Running alluxio.client.fs.ConcurrentDeleteIntegrationTest
Tests run: 4, Failures: 0, Errors: 0, Skipped: 0, Time elapsed: 7.988 sec - in alluxio.client.fs.BufferedBlockInStreamIntegrationTest
Running alluxio.client.fs.ConcurrentFileSystemMasterCreateTest
Tests run: 8, Failures: 0, Errors: 0, Skipped: 0, Time elapsed: 19.158 sec - in alluxio.client.fs.CheckConsistencyIntegrationTest
Tests run: 1, Failures: 0, Errors: 0, Skipped: 0, Time elapsed: 23.148 sec - in alluxio.client.fs.BlockWorkerClientCloseIntegrationTest
Running alluxio.client.fs.ConcurrentFileSystemMasterLoadMetadataTest
Running alluxio.client.fs.ConcurrentFileSystemMasterSetTtlTest
Tests run: 1, Failures: 0, Errors: 0, Skipped: 0, Time elapsed: 8.471 sec - in alluxio.client.fs.ConcurrentFileSystemMasterSetTtlTest
Running alluxio.client.fs.ConcurrentRecursiveCreateTest
Tests run: 5, Failures: 0, Errors: 0, Skipped: 0, Time elapsed: 36.614 sec - in alluxio.client.fs.ConcurrentDeleteIntegrationTest
Running alluxio.client.fs.ConcurrentRenameIntegrationTest
Tests run: 1, Failures: 0, Errors: 0, Skipped: 0, Time elapsed: 10.634 sec - in alluxio.client.fs.ConcurrentRecursiveCreateTest
Running alluxio.client.fs.FileInStreamConcurrencyIntegrationTest
Tests run: 1, Failures: 0, Errors: 0, Skipped: 0, Time elapsed: 9.088 sec - in alluxio.client.fs.FileInStreamConcurrencyIntegrationTest
Running alluxio.client.fs.FileInStreamIntegrationTest
Tests run: 21, Failures: 0, Errors: 0, Skipped: 0, Time elapsed: 65.445 sec - in alluxio.client.fs.ConcurrentFileSystemMasterCreateTest
Tests run: 2, Failures: 0, Errors: 0, Skipped: 0, Time elapsed: 52.89 sec - in alluxio.client.fs.ConcurrentFileSystemMasterLoadMetadataTest
Running alluxio.client.fs.FileOutStreamAsyncWriteIntegrationTest
Tests run: 10, Failures: 0, Errors: 0, Skipped: 0, Time elapsed: 35.993 sec - in alluxio.client.fs.ConcurrentRenameIntegrationTest
Running alluxio.client.fs.FileOutStreamAsyncWriteJobIntegrationTest
Running alluxio.client.fs.FileOutStreamIntegrationTest
Tests run: 10, Failures: 0, Errors: 0, Skipped: 0, Time elapsed: 39.391 sec - in alluxio.client.fs.FileOutStreamAsyncWriteIntegrationTest
Running alluxio.client.fs.FileSystemConcurrencyTest
Tests run: 1, Failures: 0, Errors: 0, Skipped: 0, Time elapsed: 6.803 sec - in alluxio.client.fs.FileSystemConcurrencyTest
Running alluxio.client.fs.FileSystemContextReinitIntegrationTest
Tests run: 20, Failures: 0, Errors: 0, Skipped: 0, Time elapsed: 60.26 sec - in alluxio.client.fs.FileOutStreamAsyncWriteJobIntegrationTest
Running alluxio.client.fs.FileSystemIntegrationTest
Tests run: 6, Failures: 0, Errors: 0, Skipped: 0, Time elapsed: 17.075 sec - in alluxio.client.fs.FileSystemContextReinitIntegrationTest
Running alluxio.client.fs.FileSystemMasterClientIntegrationTest
Tests run: 16, Failures: 0, Errors: 0, Skipped: 0, Time elapsed: 95.794 sec - in alluxio.client.fs.FileInStreamIntegrationTest
Running alluxio.client.fs.FileSystemMasterIntegrationTest
Tests run: 3, Failures: 0, Errors: 0, Skipped: 0, Time elapsed: 14.465 sec - in alluxio.client.fs.FileSystemMasterClientIntegrationTest
Running alluxio.client.fs.FileSystemMasterRestartIntegrationTest
Tests run: 55, Failures: 0, Errors: 0, Skipped: 1, Time elapsed: 14.292 sec - in alluxio.client.fs.FileSystemMasterIntegrationTest
Running alluxio.client.fs.FileSystemUtilsIntegrationTest
Tests run: 28, Failures: 0, Errors: 0, Skipped: 0, Time elapsed: 96.492 sec - in alluxio.client.fs.FileOutStreamIntegrationTest
Running alluxio.client.fs.FreeAndDeleteIntegrationTest
Tests run: 6, Failures: 0, Errors: 0, Skipped: 0, Time elapsed: 20.882 sec - in alluxio.client.fs.FileSystemMasterRestartIntegrationTest
Running alluxio.client.fs.ImpersonationIntegrationTest
Tests run: 4, Failures: 0, Errors: 0, Skipped: 0, Time elapsed: 16.283 sec - in alluxio.client.fs.FileSystemUtilsIntegrationTest
Running alluxio.client.fs.IsolatedFileSystemIntegrationTest
Tests run: 2, Failures: 0, Errors: 0, Skipped: 0, Time elapsed: 9.643 sec - in alluxio.client.fs.FreeAndDeleteIntegrationTest
Running alluxio.client.fs.LoadMetadataIntegrationTest
Tests run: 33, Failures: 0, Errors: 0, Skipped: 0, Time elapsed: 63.656 sec - in alluxio.client.fs.FileSystemIntegrationTest
Running alluxio.client.fs.LocalBlockInStreamIntegrationTest
Tests run: 14, Failures: 0, Errors: 0, Skipped: 0, Time elapsed: 33.419 sec - in alluxio.client.fs.ImpersonationIntegrationTest
Tests run: 7, Failures: 0, Errors: 0, Skipped: 0, Time elapsed: 9.446 sec - in alluxio.client.fs.LocalBlockInStreamIntegrationTest
Running alluxio.client.fs.LocalFirstPolicyIntegrationTest
Running alluxio.client.fs.MultiUfsMountIntegrationTest
Tests run: 1, Failures: 0, Errors: 0, Skipped: 0, Time elapsed: 5.774 sec - in alluxio.client.fs.LocalFirstPolicyIntegrationTest
Tests run: 6, Failures: 0, Errors: 0, Skipped: 0, Time elapsed: 35.669 sec - in alluxio.client.fs.IsolatedFileSystemIntegrationTest
Running alluxio.client.fs.PathConfigurationIntegrationTest
Running alluxio.client.fs.PersistMultipleMountsIntegrationTest
Tests run: 1, Failures: 0, Errors: 0, Skipped: 0, Time elapsed: 6.479 sec - in alluxio.client.fs.PathConfigurationIntegrationTest
Running alluxio.client.fs.PersistPermissionIntegrationTest
Tests run: 9, Failures: 0, Errors: 0, Skipped: 0, Time elapsed: 44.753 sec - in alluxio.client.fs.LoadMetadataIntegrationTest
Tests run: 2, Failures: 0, Errors: 0, Skipped: 0, Time elapsed: 9.07 sec - in alluxio.client.fs.PersistMultipleMountsIntegrationTest
Running alluxio.client.fs.PinIntegrationTest
Running alluxio.client.fs.ReadOnlyMountIntegrationTest
Tests run: 12, Failures: 0, Errors: 0, Skipped: 0, Time elapsed: 23.018 sec - in alluxio.client.fs.MultiUfsMountIntegrationTest
Running alluxio.client.fs.RemoteReadIntegrationTest
Tests run: 3, Failures: 0, Errors: 0, Skipped: 0, Time elapsed: 11.467 sec - in alluxio.client.fs.PersistPermissionIntegrationTest
Running alluxio.client.fs.TtlIntegrationTest
Tests run: 3, Failures: 0, Errors: 0, Skipped: 0, Time elapsed: 9.146 sec - in alluxio.client.fs.PinIntegrationTest
Running alluxio.client.fs.UfsFallbackFileOutStreamIntegrationTest
Tests run: 1, Failures: 0, Errors: 0, Skipped: 0, Time elapsed: 7.917 sec - in alluxio.client.fs.TtlIntegrationTest
Running alluxio.client.fs.UfsSyncIntegrationTest
Tests run: 14, Failures: 0, Errors: 0, Skipped: 0, Time elapsed: 25.161 sec - in alluxio.client.fs.ReadOnlyMountIntegrationTest
Running alluxio.client.fs.UnderStorageReadIntegrationTest
Tests run: 5, Failures: 0, Errors: 0, Skipped: 0, Time elapsed: 18.218 sec - in alluxio.client.fs.UnderStorageReadIntegrationTest
Running alluxio.client.fuse.FuseFileSystemIntegrationTest
Tests run: 17, Failures: 0, Errors: 0, Skipped: 0, Time elapsed: 43.478 sec - in alluxio.client.fs.RemoteReadIntegrationTest
Running alluxio.client.hadoop.DFSIOIntegrationTest
Tests run: 12, Failures: 0, Errors: 0, Skipped: 0, Time elapsed: 9.345 sec - in alluxio.client.fuse.FuseFileSystemIntegrationTest
Running alluxio.client.hadoop.FileSystemAclIntegrationTest
Tests run: 1, Failures: 0, Errors: 0, Skipped: 1, Time elapsed: 5.514 sec - in alluxio.client.hadoop.DFSIOIntegrationTest
Running alluxio.client.hadoop.FileSystemBlockLocationIntegrationTest
Tests run: 19, Failures: 0, Errors: 0, Skipped: 8, Time elapsed: 7.743 sec - in alluxio.client.hadoop.FileSystemAclIntegrationTest
Tests run: 1, Failures: 0, Errors: 0, Skipped: 0, Time elapsed: 6.369 sec - in alluxio.client.hadoop.FileSystemBlockLocationIntegrationTest
Running alluxio.client.hadoop.FileSystemIntegrationTest
Running alluxio.client.hadoop.FileSystemRenameIntegrationTest
Tests run: 25, Failures: 0, Errors: 0, Skipped: 0, Time elapsed: 49.581 sec - in alluxio.client.fs.UfsSyncIntegrationTest
Tests run: 8, Failures: 0, Errors: 0, Skipped: 4, Time elapsed: 57.855 sec - in alluxio.client.fs.UfsFallbackFileOutStreamIntegrationTest
Running alluxio.client.hadoop.FileSystemStatisticsTest
Running alluxio.client.hadoop.FileSystemUriIntegrationTest
Tests run: 1, Failures: 0, Errors: 0, Skipped: 0, Time elapsed: 7.099 sec - in alluxio.client.hadoop.FileSystemIntegrationTest
Running alluxio.client.hadoop.HdfsFileInputStreamIntegrationTest
Tests run: 11, Failures: 0, Errors: 0, Skipped: 1, Time elapsed: 8.219 sec - in alluxio.client.hadoop.FileSystemRenameIntegrationTest
Running alluxio.client.meta.MetaMasterIntegrationTest
Tests run: 3, Failures: 0, Errors: 0, Skipped: 0, Time elapsed: 9.68 sec - in alluxio.client.hadoop.FileSystemStatisticsTest
Running alluxio.client.rest.AlluxioMasterRestApiTest
Tests run: 15, Failures: 0, Errors: 0, Skipped: 0, Time elapsed: 12.198 sec - in alluxio.client.hadoop.HdfsFileInputStreamIntegrationTest
Tests run: 3, Failures: 0, Errors: 0, Skipped: 0, Time elapsed: 10.969 sec - in alluxio.client.meta.MetaMasterIntegrationTest
Running alluxio.client.rest.AlluxioWorkerRestApiTest
Running alluxio.client.rest.BlockMasterClientRestApiTest
Tests run: 13, Failures: 0, Errors: 0, Skipped: 0, Time elapsed: 8.478 sec - in alluxio.client.rest.AlluxioMasterRestApiTest
Tests run: 2, Failures: 0, Errors: 0, Skipped: 0, Time elapsed: 19.761 sec - in alluxio.client.hadoop.FileSystemUriIntegrationTest
Running alluxio.client.rest.JobMasterClientRestApiTest
Running alluxio.client.rest.JobMasterRestApiTest
Tests run: 3, Failures: 0, Errors: 0, Skipped: 0, Time elapsed: 6.594 sec - in alluxio.client.rest.BlockMasterClientRestApiTest
Tests run: 9, Failures: 0, Errors: 0, Skipped: 0, Time elapsed: 7.04 sec - in alluxio.client.rest.AlluxioWorkerRestApiTest
Running alluxio.client.rest.S3ClientRestApiTest
Running alluxio.client.rest.TestCaseOptionsTest
Tests run: 3, Failures: 0, Errors: 0, Skipped: 0, Time elapsed: 0.966 sec - in alluxio.client.rest.TestCaseOptionsTest
Running alluxio.job.cancel.CancelIntegrationTest
Tests run: 1, Failures: 0, Errors: 0, Skipped: 0, Time elapsed: 6.867 sec - in alluxio.client.rest.JobMasterRestApiTest
Running alluxio.job.master.JobMasterIntegrationTest
Tests run: 6, Failures: 0, Errors: 0, Skipped: 0, Time elapsed: 11.152 sec - in alluxio.client.rest.JobMasterClientRestApiTest
Running alluxio.job.master.LostWorkerIntegrationTest
Tests run: 1, Failures: 0, Errors: 0, Skipped: 0, Time elapsed: 7.561 sec - in alluxio.job.cancel.CancelIntegrationTest
Running alluxio.job.plan.load.LoadIntegrationTest
Tests run: 1, Failures: 0, Errors: 0, Skipped: 0, Time elapsed: 7.511 sec - in alluxio.job.master.LostWorkerIntegrationTest
Running alluxio.job.plan.migrate.MigrateIntegrationTest
Tests run: 2, Failures: 0, Errors: 0, Skipped: 0, Time elapsed: 11.44 sec - in alluxio.job.plan.load.LoadIntegrationTest
Running alluxio.job.plan.persist.PersistIntegrationTest
Tests run: 37, Failures: 0, Errors: 0, Skipped: 0, Time elapsed: 28.639 sec - in alluxio.client.rest.S3ClientRestApiTest
Tests run: 8, Failures: 0, Errors: 0, Skipped: 0, Time elapsed: 25.494 sec - in alluxio.job.master.JobMasterIntegrationTest
Running alluxio.job.plan.replicate.EvictIntegrationTest
Running alluxio.job.plan.replicate.ReplicateIntegrationTest
Tests run: 4, Failures: 0, Errors: 0, Skipped: 0, Time elapsed: 17.629 sec - in alluxio.job.plan.migrate.MigrateIntegrationTest
Running alluxio.job.plan.transform.format.TableReaderIntegrationTest
Tests run: 2, Failures: 0, Errors: 0, Skipped: 0, Time elapsed: 10.036 sec - in alluxio.job.plan.replicate.EvictIntegrationTest
Tests run: 5, Failures: 0, Errors: 0, Skipped: 0, Time elapsed: 17.437 sec - in alluxio.job.plan.persist.PersistIntegrationTest
Running alluxio.job.plan.transform.format.TableWriterIntegrationTest
Running alluxio.job.workflow.composite.CompositeIntegrationTest
Tests run: 3, Failures: 0, Errors: 0, Skipped: 0, Time elapsed: 12.427 sec - in alluxio.job.plan.replicate.ReplicateIntegrationTest
Tests run: 2, Failures: 0, Errors: 0, Skipped: 0, Time elapsed: 8.976 sec - in alluxio.job.plan.transform.format.TableReaderIntegrationTest
Running alluxio.master.PortRegistryTest
Tests run: 4, Failures: 0, Errors: 0, Skipped: 0, Time elapsed: 0.082 sec - in alluxio.master.PortRegistryTest
Running alluxio.server.auth.ClusterInitializationIntegrationTest
Running alluxio.server.auth.MasterClientAuthenticationIntegrationTest
Tests run: 3, Failures: 0, Errors: 0, Skipped: 0, Time elapsed: 11.982 sec - in alluxio.server.auth.ClusterInitializationIntegrationTest
Running alluxio.server.configuration.ConfigCheckerIntegrationTest
Tests run: 4, Failures: 0, Errors: 0, Skipped: 0, Time elapsed: 17.817 sec - in alluxio.job.plan.transform.format.TableWriterIntegrationTest
Tests run: 5, Failures: 0, Errors: 0, Skipped: 0, Time elapsed: 17.248 sec - in alluxio.job.workflow.composite.CompositeIntegrationTest
Tests run: 5, Failures: 0, Errors: 0, Skipped: 0, Time elapsed: 15.444 sec - in alluxio.server.auth.MasterClientAuthenticationIntegrationTest
Running alluxio.server.ft.FlakyUfsIntegrationTest
Running alluxio.server.ft.MasterFailoverIntegrationTest
Running alluxio.server.ft.MasterFaultToleranceIntegrationTest
Tests run: 1, Failures: 0, Errors: 0, Skipped: 1, Time elapsed: 0.029 sec - in alluxio.server.ft.MasterFaultToleranceIntegrationTest
Running alluxio.server.ft.MultiWorkerIntegrationTest
Tests run: 1, Failures: 0, Errors: 0, Skipped: 0, Time elapsed: 10.55 sec - in alluxio.server.ft.FlakyUfsIntegrationTest
Running alluxio.server.ft.ZookeeperFailureIntegrationTest
Tests run: 4, Failures: 0, Errors: 0, Skipped: 0, Time elapsed: 17.495 sec - in alluxio.server.ft.MultiWorkerIntegrationTest
Running alluxio.server.ft.journal.BlockMasterJournalIntegrationTest
Tests run: 1, Failures: 0, Errors: 0, Skipped: 0, Time elapsed: 20.383 sec - in alluxio.server.ft.MasterFailoverIntegrationTest
Running alluxio.server.ft.journal.JournalBackupIntegrationTest
Tests run: 2, Failures: 0, Errors: 0, Skipped: 0, Time elapsed: 11.071 sec - in alluxio.server.ft.journal.BlockMasterJournalIntegrationTest
Running alluxio.server.ft.journal.JournalCheckpointIntegrationTest
Tests run: 5, Failures: 0, Errors: 0, Skipped: 0, Time elapsed: 41.955 sec - in alluxio.server.configuration.ConfigCheckerIntegrationTest
Running alluxio.server.ft.journal.JournalIntegrationTest
Tests run: 2, Failures: 0, Errors: 0, Skipped: 0, Time elapsed: 8.563 sec - in alluxio.server.ft.journal.JournalCheckpointIntegrationTest
Running alluxio.server.ft.journal.JournalMigrationIntegrationTest
Tests run: 3, Failures: 0, Errors: 0, Skipped: 0, Time elapsed: 11.588 sec - in alluxio.server.ft.journal.JournalIntegrationTest
Running alluxio.server.ft.journal.JournalReplayIntegrationTest
Tests run: 1, Failures: 0, Errors: 0, Skipped: 0, Time elapsed: 6.765 sec - in alluxio.server.ft.journal.JournalReplayIntegrationTest
Running alluxio.server.ft.journal.JournalShutdownIntegrationTest
Tests run: 1, Failures: 0, Errors: 0, Skipped: 1, Time elapsed: 0.015 sec - in alluxio.server.ft.journal.JournalShutdownIntegrationTest
Running alluxio.server.ft.journal.MetaMasterJournalTest
Tests run: 1, Failures: 0, Errors: 0, Skipped: 0, Time elapsed: 24.997 sec - in alluxio.server.ft.journal.JournalMigrationIntegrationTest
Running alluxio.server.ft.journal.MultiMasterJournalTest
Tests run: 1, Failures: 0, Errors: 0, Skipped: 0, Time elapsed: 6.329 sec - in alluxio.server.ft.journal.MetaMasterJournalTest
Running alluxio.server.ft.journal.MultiProcessCheckpointTest
Tests run: 1, Failures: 0, Errors: 0, Skipped: 0, Time elapsed: 20.646 sec - in alluxio.server.ft.journal.MultiProcessCheckpointTest
Running alluxio.server.ft.journal.TableMasterJournalIntegrationTest
Tests run: 3, Failures: 0, Errors: 2, Skipped: 0, Time elapsed: 28.901 sec <<< FAILURE! - in alluxio.server.ft.journal.MultiMasterJournalTest
testCheckpointReplay(alluxio.server.ft.journal.MultiMasterJournalTest)  Time elapsed: 8.408 sec  <<< ERROR!
java.io.IOException: java.util.concurrent.TimeoutException: Timed out waiting for master starts serving RPCs options: WaitForOptions{interval=20, timeout=5000}
	at alluxio.server.ft.journal.MultiMasterJournalTest.before(MultiMasterJournalTest.java:53)
Caused by: java.util.concurrent.TimeoutException: Timed out waiting for master starts serving RPCs options: WaitForOptions{interval=20, timeout=5000}
	at alluxio.server.ft.journal.MultiMasterJournalTest.before(MultiMasterJournalTest.java:53)

testCheckpointReplay(alluxio.server.ft.journal.MultiMasterJournalTest)  Time elapsed: 8.803 sec  <<< ERROR!
java.io.IOException: java.util.concurrent.TimeoutException: Timed out waiting for master starts serving RPCs options: WaitForOptions{interval=20, timeout=5000}
	at alluxio.server.ft.journal.MultiMasterJournalTest.testCheckpointReplay(MultiMasterJournalTest.java:64)
Caused by: java.util.concurrent.TimeoutException: Timed out waiting for master starts serving RPCs options: WaitForOptions{interval=20, timeout=5000}
	at alluxio.server.ft.journal.MultiMasterJournalTest.testCheckpointReplay(MultiMasterJournalTest.java:64)

Running alluxio.server.ft.journal.TriggeredCheckpointTest
Tests run: 3, Failures: 0, Errors: 0, Skipped: 0, Time elapsed: 10.68 sec - in alluxio.server.ft.journal.TableMasterJournalIntegrationTest
Running alluxio.server.ft.journal.raft.EmbeddedJournalIntegrationTest
Tests run: 2, Failures: 0, Errors: 0, Skipped: 0, Time elapsed: 31.257 sec - in alluxio.server.ft.journal.TriggeredCheckpointTest
Running alluxio.server.ft.journal.ufs.RenameFailureJournalTest
Tests run: 1, Failures: 0, Errors: 0, Skipped: 0, Time elapsed: 12.555 sec - in alluxio.server.ft.journal.ufs.RenameFailureJournalTest
Running alluxio.server.ft.journal.ufs.SecondaryMasterTest
Tests run: 3, Failures: 0, Errors: 0, Skipped: 0, Time elapsed: 135.006 sec - in alluxio.server.ft.ZookeeperFailureIntegrationTest
Running alluxio.server.ft.journal.ufs.UfsConfigurationJournalTest
Tests run: 1, Failures: 0, Errors: 0, Skipped: 0, Time elapsed: 7.761 sec - in alluxio.server.ft.journal.ufs.SecondaryMasterTest
Running alluxio.server.ft.journal.ufs.UfsJournalIntegrationTest
Tests run: 1, Failures: 0, Errors: 0, Skipped: 0, Time elapsed: 7.676 sec - in alluxio.server.ft.journal.ufs.UfsConfigurationJournalTest
Running alluxio.server.health.BlockMasterIntegrityIntegrationTest
Tests run: 3, Failures: 0, Errors: 0, Skipped: 0, Time elapsed: 12.292 sec - in alluxio.server.health.BlockMasterIntegrityIntegrationTest
Running alluxio.server.health.JobMasterHealthCheckClientIntegrationTest
Tests run: 4, Failures: 0, Errors: 0, Skipped: 0, Time elapsed: 14.174 sec - in alluxio.server.health.JobMasterHealthCheckClientIntegrationTest
Running alluxio.server.health.JobWorkerHealthCheckClientIntegrationTest
Tests run: 2, Failures: 0, Errors: 0, Skipped: 0, Time elapsed: 9.517 sec - in alluxio.server.health.JobWorkerHealthCheckClientIntegrationTest
Running alluxio.server.health.MasterHealthCheckClientIntegrationTest
Tests run: 7, Failures: 0, Errors: 0, Skipped: 0, Time elapsed: 177.19 sec - in alluxio.server.ft.journal.JournalBackupIntegrationTest
Running alluxio.server.health.ProxyHealthCheckClientIntegrationTest
Tests run: 15, Failures: 0, Errors: 0, Skipped: 0, Time elapsed: 49.352 sec - in alluxio.server.ft.journal.ufs.UfsJournalIntegrationTest
Running alluxio.server.health.WorkerHealthCheckClientIntegrationTest
Tests run: 2, Failures: 0, Errors: 0, Skipped: 0, Time elapsed: 8.718 sec - in alluxio.server.health.MasterHealthCheckClientIntegrationTest
Running alluxio.server.tieredstore.LostStorageIntegrationTest
Tests run: 2, Failures: 0, Errors: 0, Skipped: 0, Time elapsed: 8.62 sec - in alluxio.server.health.ProxyHealthCheckClientIntegrationTest
Running alluxio.server.tieredstore.SpecificTierWriteIntegrationTest
Tests run: 5, Failures: 0, Errors: 0, Skipped: 0, Time elapsed: 110.01 sec - in alluxio.server.ft.journal.raft.EmbeddedJournalIntegrationTest
Tests run: 2, Failures: 0, Errors: 0, Skipped: 0, Time elapsed: 9.163 sec - in alluxio.server.health.WorkerHealthCheckClientIntegrationTest
Running alluxio.server.tieredstore.TierPromoteIntegrationTest
Running alluxio.server.tieredstore.TieredStoreIntegrationTest
Tests run: 3, Failures: 0, Errors: 0, Skipped: 0, Time elapsed: 11.671 sec - in alluxio.server.tieredstore.LostStorageIntegrationTest
Running alluxio.server.web.ServiceSocketBindIntegrationTest
Tests run: 2, Failures: 0, Errors: 0, Skipped: 0, Time elapsed: 17.566 sec - in alluxio.server.tieredstore.TierPromoteIntegrationTest
Tests run: 3, Failures: 0, Errors: 0, Skipped: 0, Time elapsed: 13.03 sec - in alluxio.server.web.ServiceSocketBindIntegrationTest
Tests run: 8, Failures: 0, Errors: 0, Skipped: 0, Time elapsed: 22.226 sec - in alluxio.server.tieredstore.SpecificTierWriteIntegrationTest
Running alluxio.server.web.WebServerIntegrationTest
Running alluxio.testutils.underfs.sleeping.SleepingUnderFileSystemOptionsTest
Tests run: 2, Failures: 0, Errors: 0, Skipped: 0, Time elapsed: 0.07 sec - in alluxio.testutils.underfs.sleeping.SleepingUnderFileSystemOptionsTest
Tests run: 4, Failures: 0, Errors: 0, Skipped: 0, Time elapsed: 25.64 sec - in alluxio.server.tieredstore.TieredStoreIntegrationTest
Tests run: 3, Failures: 0, Errors: 0, Skipped: 0, Time elapsed: 8.939 sec - in alluxio.server.web.WebServerIntegrationTest

Results :

Tests in error: 
alluxio.client.cli.fs.command.CpCommandIntegrationTest.copyFromLocalLarge(alluxio.client.cli.fs.command.CpCommandIntegrationTest)
  Run 1: CpCommandIntegrationTest.copyFromLocalLarge:442 » Internal http2 exception (Ze...
  Run 2: CpCommandIntegrationTest.copyFromLocalLarge:442 » Internal http2 exception (Ze...

alluxio.server.ft.journal.MultiMasterJournalTest.testCheckpointReplay(alluxio.server.ft.journal.MultiMasterJournalTest)
  Run 1: MultiMasterJournalTest.before:53 » IO java.util.concurrent.TimeoutException: T...
  Run 2: MultiMasterJournalTest.testCheckpointReplay:64 » IO java.util.concurrent.Timeo...

Flaked tests: 
alluxio.client.cli.fs.command.PinCommandIntegrationTest.setPinToSpecificMedia(alluxio.client.cli.fs.command.PinCommandIntegrationTest)
  Run 1: PinCommandIntegrationTest>AbstractFileSystemShellTest.before:123 » Runtime Tim...
  Run 2: PinCommandIntegrationTest>AbstractFileSystemShellTest.after:132 » NullPointer
  Run 3: PASS
  Run 4: PASS


Tests run: 1004, Failures: 0, Errors: 2, Skipped: 17, Flakes: 1

[INFO] ------------------------------------------------------------------------
[INFO] Reactor Summary:
[INFO] 
[INFO] Alluxio Parent 2.2.0-SNAPSHOT ...................... SUCCESS [  7.809 s]
[INFO] Alluxio Core ....................................... SUCCESS [  2.273 s]
[INFO] Alluxio Core - Transport ........................... SUCCESS [ 20.720 s]
[INFO] Alluxio Core - Base module ......................... SUCCESS [ 56.532 s]
[INFO] Alluxio Core - Common Utilities .................... SUCCESS [01:17 min]
[INFO] Alluxio Core - Client .............................. SUCCESS [  1.048 s]
[INFO] Alluxio Core - Client - File System ................ SUCCESS [04:20 min]
[INFO] Alluxio Examples ................................... SUCCESS [ 19.992 s]
[INFO] Alluxio Table ...................................... SUCCESS [  1.945 s]
[INFO] Alluxio Table - Base Module ........................ SUCCESS [  5.866 s]
[INFO] Alluxio Table - Client ............................. SUCCESS [ 32.197 s]
[INFO] Alluxio Job Service ................................ SUCCESS [  1.112 s]
[INFO] Alluxio Job Service - Common Utilities ............. SUCCESS [ 48.231 s]
[INFO] Alluxio Job Service - Client ....................... SUCCESS [ 28.116 s]
[INFO] Alluxio Shell ...................................... SUCCESS [ 30.859 s]
[INFO] Alluxio Table - Shell .............................. SUCCESS [ 25.593 s]
[INFO] Alluxio Assembly ................................... SUCCESS [  1.311 s]
[INFO] Alluxio Assembly - Client .......................... SUCCESS [ 10.325 s]
[INFO] Alluxio Core - Server .............................. SUCCESS [  1.218 s]
[INFO] Alluxio Core - Server - Common Utilities ........... SUCCESS [01:54 min]
[INFO] Alluxio Under File System .......................... SUCCESS [  1.906 s]
[INFO] Alluxio Under File System - Local FS ............... SUCCESS [ 33.118 s]
[INFO] Alluxio Core - Server - Master ..................... SUCCESS [01:14 min]
[INFO] Alluxio Core - Server - Proxy ...................... SUCCESS [ 23.807 s]
[INFO] Alluxio Core - Server - Worker ..................... SUCCESS [ 49.997 s]
[INFO] Alluxio Core - Client - HDFS ....................... SUCCESS [ 30.391 s]
[INFO] Alluxio Job Service - Server ....................... SUCCESS [ 29.396 s]
[INFO] Alluxio Log Server ................................. SUCCESS [  5.719 s]
[INFO] Alluxio Table - Server ............................. SUCCESS [  0.773 s]
[INFO] Alluxio Table - Server - Common .................... SUCCESS [ 17.524 s]
[INFO] Alluxio Table - Server - Master .................... SUCCESS [ 12.491 s]
[INFO] Alluxio Integration ................................ SUCCESS [  1.933 s]
[INFO] Alluxio Integration - Mesos ........................ SUCCESS [  7.401 s]
[INFO] Alluxio Assembly - Server .......................... SUCCESS [ 16.711 s]
[INFO] Alluxio Integration - Checker ...................... SUCCESS [01:11 min]
[INFO] Alluxio Integration - FUSE ......................... SUCCESS [ 35.679 s]
[INFO] Alluxio MiniCluster ................................ SUCCESS [ 26.310 s]
[INFO] Alluxio Shaded Libraries ........................... SUCCESS [  1.904 s]
[INFO] Alluxio Shaded Libraries - Client .................. SUCCESS [02:49 min]
[INFO] Alluxio Shaded Libraries - Hadoop 2.7.3 ............ SUCCESS [ 19.058 s]
[INFO] Alluxio Table - Server - UnderDB ................... SUCCESS [  1.760 s]
[INFO] Alluxio Table - Server - UnderDB - Hive ............ SUCCESS [ 30.955 s]
[INFO] Alluxio Tests ...................................... FAILURE [16:04 min]
[INFO] Alluxio Under File System - Tencent Cloud COS ...... SUCCESS [ 35.482 s]
[INFO] Alluxio Under File System - GCS .................... SUCCESS [ 34.370 s]
[INFO] Alluxio Under File System - HDFS ................... SUCCESS [ 55.632 s]
[INFO] Alluxio Under File System - Qiniu Kodo ............. SUCCESS [ 43.565 s]
[INFO] Alluxio Under File System - Aliyun OSS ............. SUCCESS [ 48.478 s]
[INFO] Alluxio Under File System - S3 ..................... SUCCESS [ 51.449 s]
[INFO] Alluxio Under File System - Swift .................. SUCCESS [ 42.870 s]
[INFO] Alluxio Under File System - Microsoft Azure Blob Storage SUCCESS [ 33.565 s]
[INFO] Alluxio Under File System - Web .................... SUCCESS [ 36.729 s]
[INFO] Alluxio UI ......................................... SUCCESS [04:05 min]
[INFO] Alluxio Integration - YARN 2.2.0-SNAPSHOT .......... SUCCESS [ 55.623 s]
[INFO] ------------------------------------------------------------------------
[INFO] BUILD FAILURE
[INFO] ------------------------------------------------------------------------
[INFO] Total time: 24:52 min (Wall Clock)
[INFO] Finished at: 2020-01-21T08:34:57Z
[INFO] ------------------------------------------------------------------------
[ERROR] Failed to execute goal org.apache.maven.plugins:maven-surefire-plugin:2.19.1:test (default-test) on project alluxio-tests: There are test failures.
[ERROR] 
[ERROR] Please refer to /usr/src/alluxio/tests/target/surefire-reports for the individual test results.
[ERROR] -> [Help 1]
[ERROR] 
[ERROR] To see the full stack trace of the errors, re-run Maven with the -e switch.
[ERROR] Re-run Maven using the -X switch to enable full debug logging.
[ERROR] 
[ERROR] For more information about the errors and possible solutions, please read the following articles:
[ERROR] [Help 1] http://cwiki.apache.org/confluence/display/MAVEN/MojoFailureException
[ERROR] 
[ERROR] After correcting the problems, you can resume the build with the command
[ERROR]   mvn <goals> -rf :alluxio-tests
Build step 'Execute shell' marked build as failure
Archiving artifacts
Recording test results
Sending e-mails to: calvin@tachyonnexus.com binfan@tachyonnexus.com gene@tachyonnexus.com andrew@tachyonnexus.com
Finished: FAILURE