FailedConsole Output

Skipping 18,786 KB.. Full Log
r: Lost task 0.0 in stage 11278.0 (TID 20906, localhost, executor driver): org.apache.spark.SparkException: Could not read footer for file: file:/home/jenkins/workspace/NewSparkPullRequestBuilder/target/tmp/spark-6dd743d5-3d92-4a5b-bdc2-e9f0919f8adb/third/part-00000-b7dc827d-97cf-4748-a363-93ef800a24c9-c000.json
	at org.apache.spark.sql.hive.orc.OrcFileOperator$.$anonfun$getFileReader$3(OrcFileOperator.scala:83)
	at scala.collection.Iterator$$anon$10.next(Iterator.scala:459)
	at scala.collection.TraversableOnce.collectFirst(TraversableOnce.scala:148)
	at scala.collection.TraversableOnce.collectFirst$(TraversableOnce.scala:135)
	at scala.collection.AbstractIterator.collectFirst(Iterator.scala:1429)
	at org.apache.spark.sql.hive.orc.OrcFileOperator$.getFileReader(OrcFileOperator.scala:87)
	at org.apache.spark.sql.hive.orc.OrcFileOperator$.$anonfun$readSchema$1(OrcFileOperator.scala:96)
	at scala.collection.Iterator$$anon$10.next(Iterator.scala:459)
	at scala.collection.TraversableOnce.collectFirst(TraversableOnce.scala:148)
	at scala.collection.TraversableOnce.collectFirst$(TraversableOnce.scala:135)
	at scala.collection.AbstractIterator.collectFirst(Iterator.scala:1429)
	at org.apache.spark.sql.hive.orc.OrcFileOperator$.readSchema(OrcFileOperator.scala:96)
	at org.apache.spark.sql.hive.orc.OrcFileFormat.$anonfun$buildReader$2(OrcFileFormat.scala:163)
	at org.apache.spark.sql.execution.datasources.FileFormat$$anon$1.apply(FileFormat.scala:147)
	at org.apache.spark.sql.execution.datasources.FileFormat$$anon$1.apply(FileFormat.scala:132)
	at org.apache.spark.sql.execution.datasources.FileScanRDD$$anon$1.org$apache$spark$sql$execution$datasources$FileScanRDD$$anon$$readCurrentFile(FileScanRDD.scala:119)
	at org.apache.spark.sql.execution.datasources.FileScanRDD$$anon$1.nextIterator(FileScanRDD.scala:172)
	at org.apache.spark.sql.execution.datasources.FileScanRDD$$anon$1.hasNext(FileScanRDD.scala:96)
	at scala.collection.Iterator$$anon$10.hasNext(Iterator.scala:458)
	at scala.collection.Iterator$$anon$10.hasNext(Iterator.scala:458)
	at scala.collection.Iterator$$anon$10.hasNext(Iterator.scala:458)
	at org.apache.spark.util.Utils$.getIteratorSize(Utils.scala:1832)
	at org.apache.spark.rdd.RDD.$anonfun$count$1(RDD.scala:1184)
	at org.apache.spark.rdd.RDD.$anonfun$count$1$adapted(RDD.scala:1184)
	at org.apache.spark.SparkContext.$anonfun$runJob$5(SparkContext.scala:2120)
	at org.apache.spark.scheduler.ResultTask.runTask(ResultTask.scala:90)
	at org.apache.spark.scheduler.Task.run(Task.scala:127)
	at org.apache.spark.executor.Executor$TaskRunner.$anonfun$run$3(Executor.scala:449)
	at org.apache.spark.util.Utils$.tryWithSafeFinally(Utils.scala:1377)
	at org.apache.spark.executor.Executor$TaskRunner.run(Executor.scala:452)
	at java.util.concurrent.ThreadPoolExecutor.runWorker(ThreadPoolExecutor.java:1149)
	at java.util.concurrent.ThreadPoolExecutor$Worker.run(ThreadPoolExecutor.java:624)
	at java.lang.Thread.run(Thread.java:748)
Caused by: java.io.IOException: Malformed ORC file file:/home/jenkins/workspace/NewSparkPullRequestBuilder/target/tmp/spark-6dd743d5-3d92-4a5b-bdc2-e9f0919f8adb/third/part-00000-b7dc827d-97cf-4748-a363-93ef800a24c9-c000.json. Invalid postscript.
	at org.apache.hadoop.hive.ql.io.orc.ReaderImpl.ensureOrcFooter(ReaderImpl.java:250)
	at org.apache.hadoop.hive.ql.io.orc.ReaderImpl.extractMetaInfoFromFooter(ReaderImpl.java:375)
	at org.apache.hadoop.hive.ql.io.orc.ReaderImpl.<init>(ReaderImpl.java:316)
	at org.apache.hadoop.hive.ql.io.orc.OrcFile.createReader(OrcFile.java:187)
	at org.apache.spark.sql.hive.orc.OrcFileOperator$.$anonfun$getFileReader$3(OrcFileOperator.scala:76)
	... 32 more

11:56:02.526 ERROR org.apache.spark.scheduler.TaskSetManager: Task 0 in stage 11278.0 failed 1 times; aborting job
11:56:03.791 ERROR org.apache.spark.executor.Executor: Exception in task 0.0 in stage 11282.0 (TID 20910)
org.apache.spark.SparkException: Could not read footer for file: file:/home/jenkins/workspace/NewSparkPullRequestBuilder/target/tmp/spark-caf0c18a-8c93-4fc1-9edb-f3cd34996370/third/part-00000-e37356b3-1a9d-4bba-99db-26714f0a1e9b-c000.json
	at org.apache.spark.sql.hive.orc.OrcFileOperator$.$anonfun$getFileReader$3(OrcFileOperator.scala:83)
	at scala.collection.Iterator$$anon$10.next(Iterator.scala:459)
	at scala.collection.TraversableOnce.collectFirst(TraversableOnce.scala:148)
	at scala.collection.TraversableOnce.collectFirst$(TraversableOnce.scala:135)
	at scala.collection.AbstractIterator.collectFirst(Iterator.scala:1429)
	at org.apache.spark.sql.hive.orc.OrcFileOperator$.getFileReader(OrcFileOperator.scala:87)
	at org.apache.spark.sql.hive.orc.OrcFileOperator$.$anonfun$readSchema$1(OrcFileOperator.scala:96)
	at scala.collection.Iterator$$anon$10.next(Iterator.scala:459)
	at scala.collection.TraversableOnce.collectFirst(TraversableOnce.scala:148)
	at scala.collection.TraversableOnce.collectFirst$(TraversableOnce.scala:135)
	at scala.collection.AbstractIterator.collectFirst(Iterator.scala:1429)
	at org.apache.spark.sql.hive.orc.OrcFileOperator$.readSchema(OrcFileOperator.scala:96)
	at org.apache.spark.sql.hive.orc.OrcFileFormat.$anonfun$buildReader$2(OrcFileFormat.scala:163)
	at org.apache.spark.sql.execution.datasources.FileFormat$$anon$1.apply(FileFormat.scala:147)
	at org.apache.spark.sql.execution.datasources.FileFormat$$anon$1.apply(FileFormat.scala:132)
	at org.apache.spark.sql.execution.datasources.FileScanRDD$$anon$1.org$apache$spark$sql$execution$datasources$FileScanRDD$$anon$$readCurrentFile(FileScanRDD.scala:119)
	at org.apache.spark.sql.execution.datasources.FileScanRDD$$anon$1.nextIterator(FileScanRDD.scala:172)
	at org.apache.spark.sql.execution.datasources.FileScanRDD$$anon$1.hasNext(FileScanRDD.scala:96)
	at scala.collection.Iterator$$anon$10.hasNext(Iterator.scala:458)
	at scala.collection.Iterator$$anon$10.hasNext(Iterator.scala:458)
	at scala.collection.Iterator$$anon$10.hasNext(Iterator.scala:458)
	at org.apache.spark.util.Utils$.getIteratorSize(Utils.scala:1832)
	at org.apache.spark.rdd.RDD.$anonfun$count$1(RDD.scala:1184)
	at org.apache.spark.rdd.RDD.$anonfun$count$1$adapted(RDD.scala:1184)
	at org.apache.spark.SparkContext.$anonfun$runJob$5(SparkContext.scala:2120)
	at org.apache.spark.scheduler.ResultTask.runTask(ResultTask.scala:90)
	at org.apache.spark.scheduler.Task.run(Task.scala:127)
	at org.apache.spark.executor.Executor$TaskRunner.$anonfun$run$3(Executor.scala:449)
	at org.apache.spark.util.Utils$.tryWithSafeFinally(Utils.scala:1377)
	at org.apache.spark.executor.Executor$TaskRunner.run(Executor.scala:452)
	at java.util.concurrent.ThreadPoolExecutor.runWorker(ThreadPoolExecutor.java:1149)
	at java.util.concurrent.ThreadPoolExecutor$Worker.run(ThreadPoolExecutor.java:624)
	at java.lang.Thread.run(Thread.java:748)
Caused by: java.io.IOException: Malformed ORC file file:/home/jenkins/workspace/NewSparkPullRequestBuilder/target/tmp/spark-caf0c18a-8c93-4fc1-9edb-f3cd34996370/third/part-00000-e37356b3-1a9d-4bba-99db-26714f0a1e9b-c000.json. Invalid postscript.
	at org.apache.hadoop.hive.ql.io.orc.ReaderImpl.ensureOrcFooter(ReaderImpl.java:250)
	at org.apache.hadoop.hive.ql.io.orc.ReaderImpl.extractMetaInfoFromFooter(ReaderImpl.java:375)
	at org.apache.hadoop.hive.ql.io.orc.ReaderImpl.<init>(ReaderImpl.java:316)
	at org.apache.hadoop.hive.ql.io.orc.OrcFile.createReader(OrcFile.java:187)
	at org.apache.spark.sql.hive.orc.OrcFileOperator$.$anonfun$getFileReader$3(OrcFileOperator.scala:76)
	... 32 more
11:56:03.793 WARN org.apache.spark.scheduler.TaskSetManager: Lost task 0.0 in stage 11282.0 (TID 20910, localhost, executor driver): org.apache.spark.SparkException: Could not read footer for file: file:/home/jenkins/workspace/NewSparkPullRequestBuilder/target/tmp/spark-caf0c18a-8c93-4fc1-9edb-f3cd34996370/third/part-00000-e37356b3-1a9d-4bba-99db-26714f0a1e9b-c000.json
	at org.apache.spark.sql.hive.orc.OrcFileOperator$.$anonfun$getFileReader$3(OrcFileOperator.scala:83)
	at scala.collection.Iterator$$anon$10.next(Iterator.scala:459)
	at scala.collection.TraversableOnce.collectFirst(TraversableOnce.scala:148)
	at scala.collection.TraversableOnce.collectFirst$(TraversableOnce.scala:135)
	at scala.collection.AbstractIterator.collectFirst(Iterator.scala:1429)
	at org.apache.spark.sql.hive.orc.OrcFileOperator$.getFileReader(OrcFileOperator.scala:87)
	at org.apache.spark.sql.hive.orc.OrcFileOperator$.$anonfun$readSchema$1(OrcFileOperator.scala:96)
	at scala.collection.Iterator$$anon$10.next(Iterator.scala:459)
	at scala.collection.TraversableOnce.collectFirst(TraversableOnce.scala:148)
	at scala.collection.TraversableOnce.collectFirst$(TraversableOnce.scala:135)
	at scala.collection.AbstractIterator.collectFirst(Iterator.scala:1429)
	at org.apache.spark.sql.hive.orc.OrcFileOperator$.readSchema(OrcFileOperator.scala:96)
	at org.apache.spark.sql.hive.orc.OrcFileFormat.$anonfun$buildReader$2(OrcFileFormat.scala:163)
	at org.apache.spark.sql.execution.datasources.FileFormat$$anon$1.apply(FileFormat.scala:147)
	at org.apache.spark.sql.execution.datasources.FileFormat$$anon$1.apply(FileFormat.scala:132)
	at org.apache.spark.sql.execution.datasources.FileScanRDD$$anon$1.org$apache$spark$sql$execution$datasources$FileScanRDD$$anon$$readCurrentFile(FileScanRDD.scala:119)
	at org.apache.spark.sql.execution.datasources.FileScanRDD$$anon$1.nextIterator(FileScanRDD.scala:172)
	at org.apache.spark.sql.execution.datasources.FileScanRDD$$anon$1.hasNext(FileScanRDD.scala:96)
	at scala.collection.Iterator$$anon$10.hasNext(Iterator.scala:458)
	at scala.collection.Iterator$$anon$10.hasNext(Iterator.scala:458)
	at scala.collection.Iterator$$anon$10.hasNext(Iterator.scala:458)
	at org.apache.spark.util.Utils$.getIteratorSize(Utils.scala:1832)
	at org.apache.spark.rdd.RDD.$anonfun$count$1(RDD.scala:1184)
	at org.apache.spark.rdd.RDD.$anonfun$count$1$adapted(RDD.scala:1184)
	at org.apache.spark.SparkContext.$anonfun$runJob$5(SparkContext.scala:2120)
	at org.apache.spark.scheduler.ResultTask.runTask(ResultTask.scala:90)
	at org.apache.spark.scheduler.Task.run(Task.scala:127)
	at org.apache.spark.executor.Executor$TaskRunner.$anonfun$run$3(Executor.scala:449)
	at org.apache.spark.util.Utils$.tryWithSafeFinally(Utils.scala:1377)
	at org.apache.spark.executor.Executor$TaskRunner.run(Executor.scala:452)
	at java.util.concurrent.ThreadPoolExecutor.runWorker(ThreadPoolExecutor.java:1149)
	at java.util.concurrent.ThreadPoolExecutor$Worker.run(ThreadPoolExecutor.java:624)
	at java.lang.Thread.run(Thread.java:748)
Caused by: java.io.IOException: Malformed ORC file file:/home/jenkins/workspace/NewSparkPullRequestBuilder/target/tmp/spark-caf0c18a-8c93-4fc1-9edb-f3cd34996370/third/part-00000-e37356b3-1a9d-4bba-99db-26714f0a1e9b-c000.json. Invalid postscript.
	at org.apache.hadoop.hive.ql.io.orc.ReaderImpl.ensureOrcFooter(ReaderImpl.java:250)
	at org.apache.hadoop.hive.ql.io.orc.ReaderImpl.extractMetaInfoFromFooter(ReaderImpl.java:375)
	at org.apache.hadoop.hive.ql.io.orc.ReaderImpl.<init>(ReaderImpl.java:316)
	at org.apache.hadoop.hive.ql.io.orc.OrcFile.createReader(OrcFile.java:187)
	at org.apache.spark.sql.hive.orc.OrcFileOperator$.$anonfun$getFileReader$3(OrcFileOperator.scala:76)
	... 32 more

11:56:03.794 ERROR org.apache.spark.scheduler.TaskSetManager: Task 0 in stage 11282.0 failed 1 times; aborting job
11:56:05.020 ERROR org.apache.spark.executor.Executor: Exception in task 0.0 in stage 11287.0 (TID 20915)
org.apache.spark.SparkException: Could not read footer for file: file:/home/jenkins/workspace/NewSparkPullRequestBuilder/target/tmp/spark-e827b8c8-a664-4176-9361-3b7c665fa91c/first/part-00000-db670277-9907-43ec-b04b-c2207204408c-c000.json
	at org.apache.spark.sql.hive.orc.OrcFileOperator$.$anonfun$getFileReader$3(OrcFileOperator.scala:83)
	at scala.collection.Iterator$$anon$10.next(Iterator.scala:459)
	at scala.collection.TraversableOnce.collectFirst(TraversableOnce.scala:148)
	at scala.collection.TraversableOnce.collectFirst$(TraversableOnce.scala:135)
	at scala.collection.AbstractIterator.collectFirst(Iterator.scala:1429)
	at org.apache.spark.sql.hive.orc.OrcFileOperator$.getFileReader(OrcFileOperator.scala:87)
	at org.apache.spark.sql.hive.orc.OrcFileOperator$.$anonfun$readSchema$1(OrcFileOperator.scala:96)
	at scala.collection.Iterator$$anon$10.next(Iterator.scala:459)
	at scala.collection.TraversableOnce.collectFirst(TraversableOnce.scala:148)
	at scala.collection.TraversableOnce.collectFirst$(TraversableOnce.scala:135)
	at scala.collection.AbstractIterator.collectFirst(Iterator.scala:1429)
	at org.apache.spark.sql.hive.orc.OrcFileOperator$.readSchema(OrcFileOperator.scala:96)
	at org.apache.spark.sql.hive.orc.OrcFileFormat.$anonfun$buildReader$2(OrcFileFormat.scala:163)
	at org.apache.spark.sql.execution.datasources.FileFormat$$anon$1.apply(FileFormat.scala:147)
	at org.apache.spark.sql.execution.datasources.FileFormat$$anon$1.apply(FileFormat.scala:132)
	at org.apache.spark.sql.execution.datasources.FileScanRDD$$anon$1.org$apache$spark$sql$execution$datasources$FileScanRDD$$anon$$readCurrentFile(FileScanRDD.scala:119)
	at org.apache.spark.sql.execution.datasources.FileScanRDD$$anon$1.nextIterator(FileScanRDD.scala:172)
	at org.apache.spark.sql.execution.datasources.FileScanRDD$$anon$1.hasNext(FileScanRDD.scala:96)
	at scala.collection.Iterator$$anon$10.hasNext(Iterator.scala:458)
	at org.apache.spark.sql.catalyst.expressions.GeneratedClass$GeneratedIteratorForCodegenStage1.agg_doAggregateWithoutKey_0$(generated.java:33)
	at org.apache.spark.sql.catalyst.expressions.GeneratedClass$GeneratedIteratorForCodegenStage1.processNext(generated.java:60)
	at org.apache.spark.sql.execution.BufferedRowIterator.hasNext(BufferedRowIterator.java:43)
	at org.apache.spark.sql.execution.WholeStageCodegenExec$$anon$1.hasNext(WholeStageCodegenExec.scala:723)
	at scala.collection.Iterator$$anon$10.hasNext(Iterator.scala:458)
	at org.apache.spark.shuffle.sort.BypassMergeSortShuffleWriter.write(BypassMergeSortShuffleWriter.java:135)
	at org.apache.spark.shuffle.ShuffleWriteProcessor.write(ShuffleWriteProcessor.scala:59)
	at org.apache.spark.scheduler.ShuffleMapTask.runTask(ShuffleMapTask.scala:94)
	at org.apache.spark.scheduler.ShuffleMapTask.runTask(ShuffleMapTask.scala:52)
	at org.apache.spark.scheduler.Task.run(Task.scala:127)
	at org.apache.spark.executor.Executor$TaskRunner.$anonfun$run$3(Executor.scala:449)
	at org.apache.spark.util.Utils$.tryWithSafeFinally(Utils.scala:1377)
	at org.apache.spark.executor.Executor$TaskRunner.run(Executor.scala:452)
	at java.util.concurrent.ThreadPoolExecutor.runWorker(ThreadPoolExecutor.java:1149)
	at java.util.concurrent.ThreadPoolExecutor$Worker.run(ThreadPoolExecutor.java:624)
	at java.lang.Thread.run(Thread.java:748)
Caused by: java.io.IOException: Malformed ORC file file:/home/jenkins/workspace/NewSparkPullRequestBuilder/target/tmp/spark-e827b8c8-a664-4176-9361-3b7c665fa91c/first/part-00000-db670277-9907-43ec-b04b-c2207204408c-c000.json. Invalid postscript.
	at org.apache.hadoop.hive.ql.io.orc.ReaderImpl.ensureOrcFooter(ReaderImpl.java:250)
	at org.apache.hadoop.hive.ql.io.orc.ReaderImpl.extractMetaInfoFromFooter(ReaderImpl.java:375)
	at org.apache.hadoop.hive.ql.io.orc.ReaderImpl.<init>(ReaderImpl.java:316)
	at org.apache.hadoop.hive.ql.io.orc.OrcFile.createReader(OrcFile.java:187)
	at org.apache.spark.sql.hive.orc.OrcFileOperator$.$anonfun$getFileReader$3(OrcFileOperator.scala:76)
	... 34 more
11:56:05.029 WARN org.apache.spark.scheduler.TaskSetManager: Lost task 0.0 in stage 11287.0 (TID 20915, localhost, executor driver): org.apache.spark.SparkException: Could not read footer for file: file:/home/jenkins/workspace/NewSparkPullRequestBuilder/target/tmp/spark-e827b8c8-a664-4176-9361-3b7c665fa91c/first/part-00000-db670277-9907-43ec-b04b-c2207204408c-c000.json
	at org.apache.spark.sql.hive.orc.OrcFileOperator$.$anonfun$getFileReader$3(OrcFileOperator.scala:83)
	at scala.collection.Iterator$$anon$10.next(Iterator.scala:459)
	at scala.collection.TraversableOnce.collectFirst(TraversableOnce.scala:148)
	at scala.collection.TraversableOnce.collectFirst$(TraversableOnce.scala:135)
	at scala.collection.AbstractIterator.collectFirst(Iterator.scala:1429)
	at org.apache.spark.sql.hive.orc.OrcFileOperator$.getFileReader(OrcFileOperator.scala:87)
	at org.apache.spark.sql.hive.orc.OrcFileOperator$.$anonfun$readSchema$1(OrcFileOperator.scala:96)
	at scala.collection.Iterator$$anon$10.next(Iterator.scala:459)
	at scala.collection.TraversableOnce.collectFirst(TraversableOnce.scala:148)
	at scala.collection.TraversableOnce.collectFirst$(TraversableOnce.scala:135)
	at scala.collection.AbstractIterator.collectFirst(Iterator.scala:1429)
	at org.apache.spark.sql.hive.orc.OrcFileOperator$.readSchema(OrcFileOperator.scala:96)
	at org.apache.spark.sql.hive.orc.OrcFileFormat.$anonfun$buildReader$2(OrcFileFormat.scala:163)
	at org.apache.spark.sql.execution.datasources.FileFormat$$anon$1.apply(FileFormat.scala:147)
	at org.apache.spark.sql.execution.datasources.FileFormat$$anon$1.apply(FileFormat.scala:132)
	at org.apache.spark.sql.execution.datasources.FileScanRDD$$anon$1.org$apache$spark$sql$execution$datasources$FileScanRDD$$anon$$readCurrentFile(FileScanRDD.scala:119)
	at org.apache.spark.sql.execution.datasources.FileScanRDD$$anon$1.nextIterator(FileScanRDD.scala:172)
	at org.apache.spark.sql.execution.datasources.FileScanRDD$$anon$1.hasNext(FileScanRDD.scala:96)
	at scala.collection.Iterator$$anon$10.hasNext(Iterator.scala:458)
	at org.apache.spark.sql.catalyst.expressions.GeneratedClass$GeneratedIteratorForCodegenStage1.agg_doAggregateWithoutKey_0$(generated.java:33)
	at org.apache.spark.sql.catalyst.expressions.GeneratedClass$GeneratedIteratorForCodegenStage1.processNext(generated.java:60)
	at org.apache.spark.sql.execution.BufferedRowIterator.hasNext(BufferedRowIterator.java:43)
	at org.apache.spark.sql.execution.WholeStageCodegenExec$$anon$1.hasNext(WholeStageCodegenExec.scala:723)
	at scala.collection.Iterator$$anon$10.hasNext(Iterator.scala:458)
	at org.apache.spark.shuffle.sort.BypassMergeSortShuffleWriter.write(BypassMergeSortShuffleWriter.java:135)
	at org.apache.spark.shuffle.ShuffleWriteProcessor.write(ShuffleWriteProcessor.scala:59)
	at org.apache.spark.scheduler.ShuffleMapTask.runTask(ShuffleMapTask.scala:94)
	at org.apache.spark.scheduler.ShuffleMapTask.runTask(ShuffleMapTask.scala:52)
	at org.apache.spark.scheduler.Task.run(Task.scala:127)
	at org.apache.spark.executor.Executor$TaskRunner.$anonfun$run$3(Executor.scala:449)
	at org.apache.spark.util.Utils$.tryWithSafeFinally(Utils.scala:1377)
	at org.apache.spark.executor.Executor$TaskRunner.run(Executor.scala:452)
	at java.util.concurrent.ThreadPoolExecutor.runWorker(ThreadPoolExecutor.java:1149)
	at java.util.concurrent.ThreadPoolExecutor$Worker.run(ThreadPoolExecutor.java:624)
	at java.lang.Thread.run(Thread.java:748)
Caused by: java.io.IOException: Malformed ORC file file:/home/jenkins/workspace/NewSparkPullRequestBuilder/target/tmp/spark-e827b8c8-a664-4176-9361-3b7c665fa91c/first/part-00000-db670277-9907-43ec-b04b-c2207204408c-c000.json. Invalid postscript.
	at org.apache.hadoop.hive.ql.io.orc.ReaderImpl.ensureOrcFooter(ReaderImpl.java:250)
	at org.apache.hadoop.hive.ql.io.orc.ReaderImpl.extractMetaInfoFromFooter(ReaderImpl.java:375)
	at org.apache.hadoop.hive.ql.io.orc.ReaderImpl.<init>(ReaderImpl.java:316)
	at org.apache.hadoop.hive.ql.io.orc.OrcFile.createReader(OrcFile.java:187)
	at org.apache.spark.sql.hive.orc.OrcFileOperator$.$anonfun$getFileReader$3(OrcFileOperator.scala:76)
	... 34 more

11:56:05.029 ERROR org.apache.spark.scheduler.TaskSetManager: Task 0 in stage 11287.0 failed 1 times; aborting job
[info] - Enabling/disabling ignoreCorruptFiles (8 seconds, 127 milliseconds)
[info] - SPARK-27160 Predicate pushdown correctness on DecimalType for ORC (1 second, 468 milliseconds)
[info] - SPARK-8501: Avoids discovery schema from empty ORC files (1 second, 158 milliseconds)
[info] - Verify the ORC conversion parameter: CONVERT_METASTORE_ORC (1 second, 999 milliseconds)
[info] - converted ORC table supports resolving mixed case field (1 second, 543 milliseconds)
[info] - SPARK-20728 Make ORCFileFormat configurable between sql/hive and sql/core (395 milliseconds)
[info] - SPARK-22267 Spark SQL incorrectly reads ORC files when column order is different (1 second, 542 milliseconds)
[info] - SPARK-19809 NullPointerException on zero-size ORC file (583 milliseconds)
11:56:13.789 WARN org.apache.hadoop.hive.metastore.HiveMetaStore: Location: file:/home/jenkins/workspace/NewSparkPullRequestBuilder/target/tmp/warehouse-392d6bfc-906b-45b6-b643-39cdb16c2e2d/spark_23340 specified for non-external table:spark_23340
[info] - SPARK-23340 Empty float/double array columns raise EOFException (1 second, 134 milliseconds)
[info] - SPARK-26437 Can not query decimal type when value is 0 !!! CANCELED !!! (37 milliseconds)
[info]   org.apache.spark.sql.hive.HiveUtils.isHive23 was false bad test: This bug fixed by HIVE-13083(Hive 2.0.1) (HiveOrcQuerySuite.scala:223)
[info]   org.scalatest.exceptions.TestCanceledException:
[info]   at org.scalatest.Assertions.newTestCanceledException(Assertions.scala:531)
[info]   at org.scalatest.Assertions.newTestCanceledException$(Assertions.scala:530)
[info]   at org.scalatest.FunSuite.newTestCanceledException(FunSuite.scala:1560)
[info]   at org.scalatest.Assertions$AssertionsHelper.macroAssume(Assertions.scala:516)
[info]   at org.apache.spark.sql.hive.orc.HiveOrcQuerySuite.$anonfun$new$44(HiveOrcQuerySuite.scala:223)
[info]   at scala.runtime.java8.JFunction0$mcV$sp.apply(JFunction0$mcV$sp.java:23)
[info]   at org.scalatest.OutcomeOf.outcomeOf(OutcomeOf.scala:85)
[info]   at org.scalatest.OutcomeOf.outcomeOf$(OutcomeOf.scala:83)
[info]   at org.scalatest.OutcomeOf$.outcomeOf(OutcomeOf.scala:104)
[info]   at org.scalatest.Transformer.apply(Transformer.scala:22)
[info]   at org.scalatest.Transformer.apply(Transformer.scala:20)
[info]   at org.scalatest.FunSuiteLike$$anon$1.apply(FunSuiteLike.scala:186)
[info]   at org.apache.spark.SparkFunSuite.withFixture(SparkFunSuite.scala:149)
[info]   at org.scalatest.FunSuiteLike.invokeWithFixture$1(FunSuiteLike.scala:184)
[info]   at org.scalatest.FunSuiteLike.$anonfun$runTest$1(FunSuiteLike.scala:196)
[info]   at org.scalatest.SuperEngine.runTestImpl(Engine.scala:289)
[info]   at org.scalatest.FunSuiteLike.runTest(FunSuiteLike.scala:196)
[info]   at org.scalatest.FunSuiteLike.runTest$(FunSuiteLike.scala:178)
[info]   at org.apache.spark.SparkFunSuite.org$scalatest$BeforeAndAfterEach$$super$runTest(SparkFunSuite.scala:56)
[info]   at org.scalatest.BeforeAndAfterEach.runTest(BeforeAndAfterEach.scala:221)
[info]   at org.scalatest.BeforeAndAfterEach.runTest$(BeforeAndAfterEach.scala:214)
[info]   at org.apache.spark.SparkFunSuite.runTest(SparkFunSuite.scala:56)
[info]   at org.scalatest.FunSuiteLike.$anonfun$runTests$1(FunSuiteLike.scala:229)
[info]   at org.scalatest.SuperEngine.$anonfun$runTestsInBranch$1(Engine.scala:396)
[info]   at scala.collection.immutable.List.foreach(List.scala:392)
[info]   at org.scalatest.SuperEngine.traverseSubNodes$1(Engine.scala:384)
[info]   at org.scalatest.SuperEngine.runTestsInBranch(Engine.scala:379)
[info]   at org.scalatest.SuperEngine.runTestsImpl(Engine.scala:461)
[info]   at org.scalatest.FunSuiteLike.runTests(FunSuiteLike.scala:229)
[info]   at org.scalatest.FunSuiteLike.runTests$(FunSuiteLike.scala:228)
[info]   at org.scalatest.FunSuite.runTests(FunSuite.scala:1560)
[info]   at org.scalatest.Suite.run(Suite.scala:1147)
[info]   at org.scalatest.Suite.run$(Suite.scala:1129)
[info]   at org.scalatest.FunSuite.org$scalatest$FunSuiteLike$$super$run(FunSuite.scala:1560)
[info]   at org.scalatest.FunSuiteLike.$anonfun$run$1(FunSuiteLike.scala:233)
[info]   at org.scalatest.SuperEngine.runImpl(Engine.scala:521)
[info]   at org.scalatest.FunSuiteLike.run(FunSuiteLike.scala:233)
[info]   at org.scalatest.FunSuiteLike.run$(FunSuiteLike.scala:232)
[info]   at org.apache.spark.SparkFunSuite.org$scalatest$BeforeAndAfterAll$$super$run(SparkFunSuite.scala:56)
[info]   at org.scalatest.BeforeAndAfterAll.liftedTree1$1(BeforeAndAfterAll.scala:213)
[info]   at org.scalatest.BeforeAndAfterAll.run(BeforeAndAfterAll.scala:210)
[info]   at org.scalatest.BeforeAndAfterAll.run$(BeforeAndAfterAll.scala:208)
[info]   at org.apache.spark.SparkFunSuite.run(SparkFunSuite.scala:56)
[info]   at org.scalatest.tools.Framework.org$scalatest$tools$Framework$$runSuite(Framework.scala:314)
[info]   at org.scalatest.tools.Framework$ScalaTestTask.execute(Framework.scala:507)
[info]   at sbt.ForkMain$Run$2.call(ForkMain.java:296)
[info]   at sbt.ForkMain$Run$2.call(ForkMain.java:286)
[info]   at java.util.concurrent.FutureTask.run(FutureTask.java:266)
[info]   at java.util.concurrent.ThreadPoolExecutor.runWorker(ThreadPoolExecutor.java:1149)
[info]   at java.util.concurrent.ThreadPoolExecutor$Worker.run(ThreadPoolExecutor.java:624)
[info]   at java.lang.Thread.run(Thread.java:748)
[info] HiveOrcPartitionDiscoverySuite:
[info] - read partitioned table - normal case (2 seconds, 59 milliseconds)
[info] - read partitioned table - with nulls (1 second, 970 milliseconds)
[info] - SPARK-27162: handle pathfilter configuration correctly (2 seconds, 10 milliseconds)
[info] PruneFileSourcePartitionsSuite:
[info] - PruneFileSourcePartitions should not change the output of LogicalRelation (243 milliseconds)
[info] - SPARK-20986 Reset table's statistics after PruneFileSourcePartitions rule (1 second, 379 milliseconds)
[info] - SPARK-26576 Broadcast hint not applied to partitioned table (927 milliseconds)
[info] HiveOrcFilterSuite:
[info] - filter pushdown - integer (981 milliseconds)
[info] - filter pushdown - long (973 milliseconds)
[info] - filter pushdown - float (755 milliseconds)
[info] - filter pushdown - double (765 milliseconds)
[info] - filter pushdown - string (1 second, 17 milliseconds)
[info] - filter pushdown - boolean (988 milliseconds)
[info] - filter pushdown - decimal (856 milliseconds)
[info] - filter pushdown - timestamp (791 milliseconds)
[info] - filter pushdown - combinations with logical operators (486 milliseconds)
[info] - no filter pushdown - non-supported types (1 second, 522 milliseconds)
[info] - SPARK-12218 and SPARK-25699 Converting conjunctions into ORC SearchArguments (2 milliseconds)
[info] - SPARK-27699 Converting disjunctions into ORC SearchArguments (0 milliseconds)
[info] ParquetHiveCompatibilitySuite:
11:56:34.743 WARN org.apache.spark.sql.execution.command.DropTableCommand: org.apache.spark.sql.AnalysisException: Path does not exist: file:/home/jenkins/workspace/NewSparkPullRequestBuilder/target/tmp/spark-8a081abe-8104-4aed-9242-60becf77d6ce;
org.apache.spark.sql.AnalysisException: Path does not exist: file:/home/jenkins/workspace/NewSparkPullRequestBuilder/target/tmp/spark-8a081abe-8104-4aed-9242-60becf77d6ce;
	at org.apache.spark.sql.execution.datasources.DataSource$.$anonfun$checkAndGlobPathIfNecessary$1(DataSource.scala:735)
	at scala.collection.TraversableLike.$anonfun$flatMap$1(TraversableLike.scala:244)
	at scala.collection.immutable.List.foreach(List.scala:392)
	at scala.collection.TraversableLike.flatMap(TraversableLike.scala:244)
	at scala.collection.TraversableLike.flatMap$(TraversableLike.scala:241)
	at scala.collection.immutable.List.flatMap(List.scala:355)
	at org.apache.spark.sql.execution.datasources.DataSource$.checkAndGlobPathIfNecessary(DataSource.scala:722)
	at org.apache.spark.sql.execution.datasources.DataSource.checkAndGlobPathIfNecessary(DataSource.scala:569)
	at org.apache.spark.sql.execution.datasources.DataSource.resolveRelation(DataSource.scala:381)
	at org.apache.spark.sql.hive.HiveMetastoreCatalog.$anonfun$convertToLogicalRelation$5(HiveMetastoreCatalog.scala:245)
	at scala.Option.getOrElse(Option.scala:138)
	at org.apache.spark.sql.hive.HiveMetastoreCatalog.$anonfun$convertToLogicalRelation$4(HiveMetastoreCatalog.scala:235)
	at org.apache.spark.sql.hive.HiveMetastoreCatalog.withTableCreationLock(HiveMetastoreCatalog.scala:58)
	at org.apache.spark.sql.hive.HiveMetastoreCatalog.convertToLogicalRelation(HiveMetastoreCatalog.scala:228)
	at org.apache.spark.sql.hive.HiveMetastoreCatalog.convert(HiveMetastoreCatalog.scala:137)
	at org.apache.spark.sql.hive.RelationConversions$$anonfun$apply$4.applyOrElse(HiveStrategies.scala:198)
	at org.apache.spark.sql.hive.RelationConversions$$anonfun$apply$4.applyOrElse(HiveStrategies.scala:186)
	at org.apache.spark.sql.catalyst.plans.logical.AnalysisHelper.$anonfun$resolveOperatorsDown$2(AnalysisHelper.scala:108)
	at org.apache.spark.sql.catalyst.trees.CurrentOrigin$.withOrigin(TreeNode.scala:72)
	at org.apache.spark.sql.catalyst.plans.logical.AnalysisHelper.$anonfun$resolveOperatorsDown$1(AnalysisHelper.scala:108)
	at org.apache.spark.sql.catalyst.plans.logical.AnalysisHelper$.allowInvokingTransformsInAnalyzer(AnalysisHelper.scala:194)
	at org.apache.spark.sql.catalyst.plans.logical.AnalysisHelper.resolveOperatorsDown(AnalysisHelper.scala:106)
	at org.apache.spark.sql.catalyst.plans.logical.AnalysisHelper.resolveOperatorsDown$(AnalysisHelper.scala:104)
	at org.apache.spark.sql.catalyst.plans.logical.LogicalPlan.resolveOperatorsDown(LogicalPlan.scala:29)
	at org.apache.spark.sql.catalyst.plans.logical.AnalysisHelper.$anonfun$resolveOperatorsDown$4(AnalysisHelper.scala:113)
	at org.apache.spark.sql.catalyst.trees.TreeNode.$anonfun$mapChildren$1(TreeNode.scala:372)
	at org.apache.spark.sql.catalyst.trees.TreeNode.mapProductIterator(TreeNode.scala:210)
	at org.apache.spark.sql.catalyst.trees.TreeNode.mapChildren(TreeNode.scala:370)
	at org.apache.spark.sql.catalyst.trees.TreeNode.mapChildren(TreeNode.scala:323)
	at org.apache.spark.sql.catalyst.plans.logical.AnalysisHelper.$anonfun$resolveOperatorsDown$1(AnalysisHelper.scala:113)
	at org.apache.spark.sql.catalyst.plans.logical.AnalysisHelper$.allowInvokingTransformsInAnalyzer(AnalysisHelper.scala:194)
	at org.apache.spark.sql.catalyst.plans.logical.AnalysisHelper.resolveOperatorsDown(AnalysisHelper.scala:106)
	at org.apache.spark.sql.catalyst.plans.logical.AnalysisHelper.resolveOperatorsDown$(AnalysisHelper.scala:104)
	at org.apache.spark.sql.catalyst.plans.logical.LogicalPlan.resolveOperatorsDown(LogicalPlan.scala:29)
	at org.apache.spark.sql.catalyst.plans.logical.AnalysisHelper.resolveOperators(AnalysisHelper.scala:73)
	at org.apache.spark.sql.catalyst.plans.logical.AnalysisHelper.resolveOperators$(AnalysisHelper.scala:72)
	at org.apache.spark.sql.catalyst.plans.logical.LogicalPlan.resolveOperators(LogicalPlan.scala:29)
	at org.apache.spark.sql.hive.RelationConversions.apply(HiveStrategies.scala:186)
	at org.apache.spark.sql.hive.RelationConversions.apply(HiveStrategies.scala:170)
	at org.apache.spark.sql.catalyst.rules.RuleExecutor.$anonfun$execute$2(RuleExecutor.scala:130)
	at scala.collection.IndexedSeqOptimized.foldLeft(IndexedSeqOptimized.scala:60)
	at scala.collection.IndexedSeqOptimized.foldLeft$(IndexedSeqOptimized.scala:68)
	at scala.collection.mutable.ArrayBuffer.foldLeft(ArrayBuffer.scala:49)
	at org.apache.spark.sql.catalyst.rules.RuleExecutor.$anonfun$execute$1(RuleExecutor.scala:127)
	at org.apache.spark.sql.catalyst.rules.RuleExecutor.$anonfun$execute$1$adapted(RuleExecutor.scala:119)
	at scala.collection.immutable.List.foreach(List.scala:392)
	at org.apache.spark.sql.catalyst.rules.RuleExecutor.execute(RuleExecutor.scala:119)
	at org.apache.spark.sql.catalyst.analysis.Analyzer.org$apache$spark$sql$catalyst$analysis$Analyzer$$executeSameContext(Analyzer.scala:142)
	at org.apache.spark.sql.catalyst.analysis.Analyzer.execute(Analyzer.scala:136)
	at org.apache.spark.sql.catalyst.analysis.Analyzer.execute(Analyzer.scala:103)
	at org.apache.spark.sql.catalyst.rules.RuleExecutor.$anonfun$executeAndTrack$1(RuleExecutor.scala:98)
	at org.apache.spark.sql.catalyst.QueryPlanningTracker$.withTracker(QueryPlanningTracker.scala:88)
	at org.apache.spark.sql.catalyst.rules.RuleExecutor.executeAndTrack(RuleExecutor.scala:98)
	at org.apache.spark.sql.catalyst.analysis.Analyzer.$anonfun$executeAndCheck$1(Analyzer.scala:120)
	at org.apache.spark.sql.catalyst.plans.logical.AnalysisHelper$.markInAnalyzer(AnalysisHelper.scala:201)
	at org.apache.spark.sql.catalyst.analysis.Analyzer.executeAndCheck(Analyzer.scala:119)
	at org.apache.spark.sql.hive.test.TestHiveQueryExecution.analyzed$lzycompute(TestHive.scala:606)
	at org.apache.spark.sql.hive.test.TestHiveQueryExecution.analyzed(TestHive.scala:589)
	at org.apache.spark.sql.execution.QueryExecution.assertAnalyzed(QueryExecution.scala:53)
	at org.apache.spark.sql.Dataset$.ofRows(Dataset.scala:86)
	at org.apache.spark.sql.SparkSession.table(SparkSession.scala:635)
	at org.apache.spark.sql.execution.command.DropTableCommand.run(ddl.scala:213)
	at org.apache.spark.sql.execution.command.ExecutedCommandExec.sideEffectResult$lzycompute(commands.scala:70)
	at org.apache.spark.sql.execution.command.ExecutedCommandExec.sideEffectResult(commands.scala:68)
	at org.apache.spark.sql.execution.command.ExecutedCommandExec.executeCollect(commands.scala:79)
	at org.apache.spark.sql.Dataset.$anonfun$logicalPlan$1(Dataset.scala:213)
	at org.apache.spark.sql.Dataset.$anonfun$withAction$1(Dataset.scala:3431)
	at org.apache.spark.sql.execution.SQLExecution$.$anonfun$withNewExecutionId$4(SQLExecution.scala:100)
	at org.apache.spark.sql.execution.SQLExecution$.withSQLConfPropagated(SQLExecution.scala:160)
	at org.apache.spark.sql.execution.SQLExecution$.withNewExecutionId(SQLExecution.scala:87)
	at org.apache.spark.sql.Dataset.withAction(Dataset.scala:3427)
	at org.apache.spark.sql.Dataset.<init>(Dataset.scala:213)
	at org.apache.spark.sql.Dataset$.ofRows(Dataset.scala:87)
	at org.apache.spark.sql.hive.test.TestHiveSparkSession.sql(TestHive.scala:238)
	at org.apache.spark.sql.test.SQLTestUtilsBase.$anonfun$withTable$2(SQLTestUtils.scala:291)
	at scala.collection.IndexedSeqOptimized.foreach(IndexedSeqOptimized.scala:36)
	at scala.collection.IndexedSeqOptimized.foreach$(IndexedSeqOptimized.scala:33)
	at scala.collection.mutable.WrappedArray.foreach(WrappedArray.scala:39)
	at org.apache.spark.sql.test.SQLTestUtilsBase.$anonfun$withTable$1(SQLTestUtils.scala:290)
	at org.apache.spark.util.Utils$.tryWithSafeFinally(Utils.scala:1386)
	at org.apache.spark.sql.test.SQLTestUtilsBase.withTable(SQLTestUtils.scala:290)
	at org.apache.spark.sql.test.SQLTestUtilsBase.withTable$(SQLTestUtils.scala:288)
	at org.apache.spark.sql.execution.datasources.parquet.ParquetCompatibilityTest.withTable(ParquetCompatibilityTest.scala:35)
	at org.apache.spark.sql.hive.ParquetHiveCompatibilitySuite.testParquetHiveCompatibility(ParquetHiveCompatibilitySuite.scala:47)
	at org.apache.spark.sql.hive.ParquetHiveCompatibilitySuite.$anonfun$new$1(ParquetHiveCompatibilitySuite.scala:94)
	at scala.runtime.java8.JFunction0$mcV$sp.apply(JFunction0$mcV$sp.java:23)
	at org.scalatest.OutcomeOf.outcomeOf(OutcomeOf.scala:85)
	at org.scalatest.OutcomeOf.outcomeOf$(OutcomeOf.scala:83)
	at org.scalatest.OutcomeOf$.outcomeOf(OutcomeOf.scala:104)
	at org.scalatest.Transformer.apply(Transformer.scala:22)
	at org.scalatest.Transformer.apply(Transformer.scala:20)
	at org.scalatest.FunSuiteLike$$anon$1.apply(FunSuiteLike.scala:186)
	at org.apache.spark.SparkFunSuite.withFixture(SparkFunSuite.scala:149)
	at org.scalatest.FunSuiteLike.invokeWithFixture$1(FunSuiteLike.scala:184)
	at org.scalatest.FunSuiteLike.$anonfun$runTest$1(FunSuiteLike.scala:196)
	at org.scalatest.SuperEngine.runTestImpl(Engine.scala:289)
	at org.scalatest.FunSuiteLike.runTest(FunSuiteLike.scala:196)
	at org.scalatest.FunSuiteLike.runTest$(FunSuiteLike.scala:178)
	at org.apache.spark.SparkFunSuite.org$scalatest$BeforeAndAfterEach$$super$runTest(SparkFunSuite.scala:56)
	at org.scalatest.BeforeAndAfterEach.runTest(BeforeAndAfterEach.scala:221)
	at org.scalatest.BeforeAndAfterEach.runTest$(BeforeAndAfterEach.scala:214)
	at org.apache.spark.SparkFunSuite.runTest(SparkFunSuite.scala:56)
	at org.scalatest.FunSuiteLike.$anonfun$runTests$1(FunSuiteLike.scala:229)
	at org.scalatest.SuperEngine.$anonfun$runTestsInBranch$1(Engine.scala:396)
	at scala.collection.immutable.List.foreach(List.scala:392)
	at org.scalatest.SuperEngine.traverseSubNodes$1(Engine.scala:384)
	at org.scalatest.SuperEngine.runTestsInBranch(Engine.scala:379)
	at org.scalatest.SuperEngine.runTestsImpl(Engine.scala:461)
	at org.scalatest.FunSuiteLike.runTests(FunSuiteLike.scala:229)
	at org.scalatest.FunSuiteLike.runTests$(FunSuiteLike.scala:228)
	at org.scalatest.FunSuite.runTests(FunSuite.scala:1560)
	at org.scalatest.Suite.run(Suite.scala:1147)
	at org.scalatest.Suite.run$(Suite.scala:1129)
	at org.scalatest.FunSuite.org$scalatest$FunSuiteLike$$super$run(FunSuite.scala:1560)
	at org.scalatest.FunSuiteLike.$anonfun$run$1(FunSuiteLike.scala:233)
	at org.scalatest.SuperEngine.runImpl(Engine.scala:521)
	at org.scalatest.FunSuiteLike.run(FunSuiteLike.scala:233)
	at org.scalatest.FunSuiteLike.run$(FunSuiteLike.scala:232)
	at org.apache.spark.SparkFunSuite.org$scalatest$BeforeAndAfterAll$$super$run(SparkFunSuite.scala:56)
	at org.scalatest.BeforeAndAfterAll.liftedTree1$1(BeforeAndAfterAll.scala:213)
	at org.scalatest.BeforeAndAfterAll.run(BeforeAndAfterAll.scala:210)
	at org.scalatest.BeforeAndAfterAll.run$(BeforeAndAfterAll.scala:208)
	at org.apache.spark.SparkFunSuite.run(SparkFunSuite.scala:56)
	at org.scalatest.tools.Framework.org$scalatest$tools$Framework$$runSuite(Framework.scala:314)
	at org.scalatest.tools.Framework$ScalaTestTask.execute(Framework.scala:507)
	at sbt.ForkMain$Run$2.call(ForkMain.java:296)
	at sbt.ForkMain$Run$2.call(ForkMain.java:286)
	at java.util.concurrent.FutureTask.run(FutureTask.java:266)
	at java.util.concurrent.ThreadPoolExecutor.runWorker(ThreadPoolExecutor.java:1149)
	at java.util.concurrent.ThreadPoolExecutor$Worker.run(ThreadPoolExecutor.java:624)
	at java.lang.Thread.run(Thread.java:748)
[info] - simple primitives (1 second, 335 milliseconds)
11:56:36.212 WARN org.apache.spark.sql.execution.command.DropTableCommand: org.apache.spark.sql.AnalysisException: Path does not exist: file:/home/jenkins/workspace/NewSparkPullRequestBuilder/target/tmp/spark-0e26c8a8-f0b7-4b41-9036-5a79b87fb318;
org.apache.spark.sql.AnalysisException: Path does not exist: file:/home/jenkins/workspace/NewSparkPullRequestBuilder/target/tmp/spark-0e26c8a8-f0b7-4b41-9036-5a79b87fb318;
	at org.apache.spark.sql.execution.datasources.DataSource$.$anonfun$checkAndGlobPathIfNecessary$1(DataSource.scala:735)
	at scala.collection.TraversableLike.$anonfun$flatMap$1(TraversableLike.scala:244)
	at scala.collection.immutable.List.foreach(List.scala:392)
	at scala.collection.TraversableLike.flatMap(TraversableLike.scala:244)
	at scala.collection.TraversableLike.flatMap$(TraversableLike.scala:241)
	at scala.collection.immutable.List.flatMap(List.scala:355)
	at org.apache.spark.sql.execution.datasources.DataSource$.checkAndGlobPathIfNecessary(DataSource.scala:722)
	at org.apache.spark.sql.execution.datasources.DataSource.checkAndGlobPathIfNecessary(DataSource.scala:569)
	at org.apache.spark.sql.execution.datasources.DataSource.resolveRelation(DataSource.scala:381)
	at org.apache.spark.sql.hive.HiveMetastoreCatalog.$anonfun$convertToLogicalRelation$5(HiveMetastoreCatalog.scala:245)
	at scala.Option.getOrElse(Option.scala:138)
	at org.apache.spark.sql.hive.HiveMetastoreCatalog.$anonfun$convertToLogicalRelation$4(HiveMetastoreCatalog.scala:235)
	at org.apache.spark.sql.hive.HiveMetastoreCatalog.withTableCreationLock(HiveMetastoreCatalog.scala:58)
	at org.apache.spark.sql.hive.HiveMetastoreCatalog.convertToLogicalRelation(HiveMetastoreCatalog.scala:228)
	at org.apache.spark.sql.hive.HiveMetastoreCatalog.convert(HiveMetastoreCatalog.scala:137)
	at org.apache.spark.sql.hive.RelationConversions$$anonfun$apply$4.applyOrElse(HiveStrategies.scala:198)
	at org.apache.spark.sql.hive.RelationConversions$$anonfun$apply$4.applyOrElse(HiveStrategies.scala:186)
	at org.apache.spark.sql.catalyst.plans.logical.AnalysisHelper.$anonfun$resolveOperatorsDown$2(AnalysisHelper.scala:108)
	at org.apache.spark.sql.catalyst.trees.CurrentOrigin$.withOrigin(TreeNode.scala:72)
	at org.apache.spark.sql.catalyst.plans.logical.AnalysisHelper.$anonfun$resolveOperatorsDown$1(AnalysisHelper.scala:108)
	at org.apache.spark.sql.catalyst.plans.logical.AnalysisHelper$.allowInvokingTransformsInAnalyzer(AnalysisHelper.scala:194)
	at org.apache.spark.sql.catalyst.plans.logical.AnalysisHelper.resolveOperatorsDown(AnalysisHelper.scala:106)
	at org.apache.spark.sql.catalyst.plans.logical.AnalysisHelper.resolveOperatorsDown$(AnalysisHelper.scala:104)
	at org.apache.spark.sql.catalyst.plans.logical.LogicalPlan.resolveOperatorsDown(LogicalPlan.scala:29)
	at org.apache.spark.sql.catalyst.plans.logical.AnalysisHelper.$anonfun$resolveOperatorsDown$4(AnalysisHelper.scala:113)
	at org.apache.spark.sql.catalyst.trees.TreeNode.$anonfun$mapChildren$1(TreeNode.scala:372)
	at org.apache.spark.sql.catalyst.trees.TreeNode.mapProductIterator(TreeNode.scala:210)
	at org.apache.spark.sql.catalyst.trees.TreeNode.mapChildren(TreeNode.scala:370)
	at org.apache.spark.sql.catalyst.trees.TreeNode.mapChildren(TreeNode.scala:323)
	at org.apache.spark.sql.catalyst.plans.logical.AnalysisHelper.$anonfun$resolveOperatorsDown$1(AnalysisHelper.scala:113)
	at org.apache.spark.sql.catalyst.plans.logical.AnalysisHelper$.allowInvokingTransformsInAnalyzer(AnalysisHelper.scala:194)
	at org.apache.spark.sql.catalyst.plans.logical.AnalysisHelper.resolveOperatorsDown(AnalysisHelper.scala:106)
	at org.apache.spark.sql.catalyst.plans.logical.AnalysisHelper.resolveOperatorsDown$(AnalysisHelper.scala:104)
	at org.apache.spark.sql.catalyst.plans.logical.LogicalPlan.resolveOperatorsDown(LogicalPlan.scala:29)
	at org.apache.spark.sql.catalyst.plans.logical.AnalysisHelper.resolveOperators(AnalysisHelper.scala:73)
	at org.apache.spark.sql.catalyst.plans.logical.AnalysisHelper.resolveOperators$(AnalysisHelper.scala:72)
	at org.apache.spark.sql.catalyst.plans.logical.LogicalPlan.resolveOperators(LogicalPlan.scala:29)
	at org.apache.spark.sql.hive.RelationConversions.apply(HiveStrategies.scala:186)
	at org.apache.spark.sql.hive.RelationConversions.apply(HiveStrategies.scala:170)
	at org.apache.spark.sql.catalyst.rules.RuleExecutor.$anonfun$execute$2(RuleExecutor.scala:130)
	at scala.collection.IndexedSeqOptimized.foldLeft(IndexedSeqOptimized.scala:60)
	at scala.collection.IndexedSeqOptimized.foldLeft$(IndexedSeqOptimized.scala:68)
	at scala.collection.mutable.ArrayBuffer.foldLeft(ArrayBuffer.scala:49)
	at org.apache.spark.sql.catalyst.rules.RuleExecutor.$anonfun$execute$1(RuleExecutor.scala:127)
	at org.apache.spark.sql.catalyst.rules.RuleExecutor.$anonfun$execute$1$adapted(RuleExecutor.scala:119)
	at scala.collection.immutable.List.foreach(List.scala:392)
	at org.apache.spark.sql.catalyst.rules.RuleExecutor.execute(RuleExecutor.scala:119)
	at org.apache.spark.sql.catalyst.analysis.Analyzer.org$apache$spark$sql$catalyst$analysis$Analyzer$$executeSameContext(Analyzer.scala:142)
	at org.apache.spark.sql.catalyst.analysis.Analyzer.execute(Analyzer.scala:136)
	at org.apache.spark.sql.catalyst.analysis.Analyzer.execute(Analyzer.scala:103)
	at org.apache.spark.sql.catalyst.rules.RuleExecutor.$anonfun$executeAndTrack$1(RuleExecutor.scala:98)
	at org.apache.spark.sql.catalyst.QueryPlanningTracker$.withTracker(QueryPlanningTracker.scala:88)
	at org.apache.spark.sql.catalyst.rules.RuleExecutor.executeAndTrack(RuleExecutor.scala:98)
	at org.apache.spark.sql.catalyst.analysis.Analyzer.$anonfun$executeAndCheck$1(Analyzer.scala:120)
	at org.apache.spark.sql.catalyst.plans.logical.AnalysisHelper$.markInAnalyzer(AnalysisHelper.scala:201)
	at org.apache.spark.sql.catalyst.analysis.Analyzer.executeAndCheck(Analyzer.scala:119)
	at org.apache.spark.sql.hive.test.TestHiveQueryExecution.analyzed$lzycompute(TestHive.scala:606)
	at org.apache.spark.sql.hive.test.TestHiveQueryExecution.analyzed(TestHive.scala:589)
	at org.apache.spark.sql.execution.QueryExecution.assertAnalyzed(QueryExecution.scala:53)
	at org.apache.spark.sql.Dataset$.ofRows(Dataset.scala:86)
	at org.apache.spark.sql.SparkSession.table(SparkSession.scala:635)
	at org.apache.spark.sql.execution.command.DropTableCommand.run(ddl.scala:213)
	at org.apache.spark.sql.execution.command.ExecutedCommandExec.sideEffectResult$lzycompute(commands.scala:70)
	at org.apache.spark.sql.execution.command.ExecutedCommandExec.sideEffectResult(commands.scala:68)
	at org.apache.spark.sql.execution.command.ExecutedCommandExec.executeCollect(commands.scala:79)
	at org.apache.spark.sql.Dataset.$anonfun$logicalPlan$1(Dataset.scala:213)
	at org.apache.spark.sql.Dataset.$anonfun$withAction$1(Dataset.scala:3431)
	at org.apache.spark.sql.execution.SQLExecution$.$anonfun$withNewExecutionId$4(SQLExecution.scala:100)
	at org.apache.spark.sql.execution.SQLExecution$.withSQLConfPropagated(SQLExecution.scala:160)
	at org.apache.spark.sql.execution.SQLExecution$.withNewExecutionId(SQLExecution.scala:87)
	at org.apache.spark.sql.Dataset.withAction(Dataset.scala:3427)
	at org.apache.spark.sql.Dataset.<init>(Dataset.scala:213)
	at org.apache.spark.sql.Dataset$.ofRows(Dataset.scala:87)
	at org.apache.spark.sql.hive.test.TestHiveSparkSession.sql(TestHive.scala:238)
	at org.apache.spark.sql.test.SQLTestUtilsBase.$anonfun$withTable$2(SQLTestUtils.scala:291)
	at scala.collection.IndexedSeqOptimized.foreach(IndexedSeqOptimized.scala:36)
	at scala.collection.IndexedSeqOptimized.foreach$(IndexedSeqOptimized.scala:33)
	at scala.collection.mutable.WrappedArray.foreach(WrappedArray.scala:39)
	at org.apache.spark.sql.test.SQLTestUtilsBase.$anonfun$withTable$1(SQLTestUtils.scala:290)
	at org.apache.spark.util.Utils$.tryWithSafeFinally(Utils.scala:1386)
	at org.apache.spark.sql.test.SQLTestUtilsBase.withTable(SQLTestUtils.scala:290)
	at org.apache.spark.sql.test.SQLTestUtilsBase.withTable$(SQLTestUtils.scala:288)
	at org.apache.spark.sql.execution.datasources.parquet.ParquetCompatibilityTest.withTable(ParquetCompatibilityTest.scala:35)
	at org.apache.spark.sql.hive.ParquetHiveCompatibilitySuite.testParquetHiveCompatibility(ParquetHiveCompatibilitySuite.scala:47)
	at org.apache.spark.sql.hive.ParquetHiveCompatibilitySuite.$anonfun$new$2(ParquetHiveCompatibilitySuite.scala:98)
	at scala.runtime.java8.JFunction0$mcV$sp.apply(JFunction0$mcV$sp.java:23)
	at org.scalatest.OutcomeOf.outcomeOf(OutcomeOf.scala:85)
	at org.scalatest.OutcomeOf.outcomeOf$(OutcomeOf.scala:83)
	at org.scalatest.OutcomeOf$.outcomeOf(OutcomeOf.scala:104)
	at org.scalatest.Transformer.apply(Transformer.scala:22)
	at org.scalatest.Transformer.apply(Transformer.scala:20)
	at org.scalatest.FunSuiteLike$$anon$1.apply(FunSuiteLike.scala:186)
	at org.apache.spark.SparkFunSuite.withFixture(SparkFunSuite.scala:149)
	at org.scalatest.FunSuiteLike.invokeWithFixture$1(FunSuiteLike.scala:184)
	at org.scalatest.FunSuiteLike.$anonfun$runTest$1(FunSuiteLike.scala:196)
	at org.scalatest.SuperEngine.runTestImpl(Engine.scala:289)
	at org.scalatest.FunSuiteLike.runTest(FunSuiteLike.scala:196)
	at org.scalatest.FunSuiteLike.runTest$(FunSuiteLike.scala:178)
	at org.apache.spark.SparkFunSuite.org$scalatest$BeforeAndAfterEach$$super$runTest(SparkFunSuite.scala:56)
	at org.scalatest.BeforeAndAfterEach.runTest(BeforeAndAfterEach.scala:221)
	at org.scalatest.BeforeAndAfterEach.runTest$(BeforeAndAfterEach.scala:214)
	at org.apache.spark.SparkFunSuite.runTest(SparkFunSuite.scala:56)
	at org.scalatest.FunSuiteLike.$anonfun$runTests$1(FunSuiteLike.scala:229)
	at org.scalatest.SuperEngine.$anonfun$runTestsInBranch$1(Engine.scala:396)
	at scala.collection.immutable.List.foreach(List.scala:392)
	at org.scalatest.SuperEngine.traverseSubNodes$1(Engine.scala:384)
	at org.scalatest.SuperEngine.runTestsInBranch(Engine.scala:379)
	at org.scalatest.SuperEngine.runTestsImpl(Engine.scala:461)
	at org.scalatest.FunSuiteLike.runTests(FunSuiteLike.scala:229)
	at org.scalatest.FunSuiteLike.runTests$(FunSuiteLike.scala:228)
	at org.scalatest.FunSuite.runTests(FunSuite.scala:1560)
	at org.scalatest.Suite.run(Suite.scala:1147)
	at org.scalatest.Suite.run$(Suite.scala:1129)
	at org.scalatest.FunSuite.org$scalatest$FunSuiteLike$$super$run(FunSuite.scala:1560)
	at org.scalatest.FunSuiteLike.$anonfun$run$1(FunSuiteLike.scala:233)
	at org.scalatest.SuperEngine.runImpl(Engine.scala:521)
	at org.scalatest.FunSuiteLike.run(FunSuiteLike.scala:233)
	at org.scalatest.FunSuiteLike.run$(FunSuiteLike.scala:232)
	at org.apache.spark.SparkFunSuite.org$scalatest$BeforeAndAfterAll$$super$run(SparkFunSuite.scala:56)
	at org.scalatest.BeforeAndAfterAll.liftedTree1$1(BeforeAndAfterAll.scala:213)
	at org.scalatest.BeforeAndAfterAll.run(BeforeAndAfterAll.scala:210)
	at org.scalatest.BeforeAndAfterAll.run$(BeforeAndAfterAll.scala:208)
	at org.apache.spark.SparkFunSuite.run(SparkFunSuite.scala:56)
	at org.scalatest.tools.Framework.org$scalatest$tools$Framework$$runSuite(Framework.scala:314)
	at org.scalatest.tools.Framework$ScalaTestTask.execute(Framework.scala:507)
	at sbt.ForkMain$Run$2.call(ForkMain.java:296)
	at sbt.ForkMain$Run$2.call(ForkMain.java:286)
	at java.util.concurrent.FutureTask.run(FutureTask.java:266)
	at java.util.concurrent.ThreadPoolExecutor.runWorker(ThreadPoolExecutor.java:1149)
	at java.util.concurrent.ThreadPoolExecutor$Worker.run(ThreadPoolExecutor.java:624)
	at java.lang.Thread.run(Thread.java:748)
[info] - SPARK-10177 timestamp (1 second, 405 milliseconds)
11:56:37.441 WARN org.apache.spark.sql.execution.command.DropTableCommand: org.apache.spark.sql.AnalysisException: Path does not exist: file:/home/jenkins/workspace/NewSparkPullRequestBuilder/target/tmp/spark-d7146c36-579c-4a37-a80e-92b1e02588c0;
org.apache.spark.sql.AnalysisException: Path does not exist: file:/home/jenkins/workspace/NewSparkPullRequestBuilder/target/tmp/spark-d7146c36-579c-4a37-a80e-92b1e02588c0;
	at org.apache.spark.sql.execution.datasources.DataSource$.$anonfun$checkAndGlobPathIfNecessary$1(DataSource.scala:735)
	at scala.collection.TraversableLike.$anonfun$flatMap$1(TraversableLike.scala:244)
	at scala.collection.immutable.List.foreach(List.scala:392)
	at scala.collection.TraversableLike.flatMap(TraversableLike.scala:244)
	at scala.collection.TraversableLike.flatMap$(TraversableLike.scala:241)
	at scala.collection.immutable.List.flatMap(List.scala:355)
	at org.apache.spark.sql.execution.datasources.DataSource$.checkAndGlobPathIfNecessary(DataSource.scala:722)
	at org.apache.spark.sql.execution.datasources.DataSource.checkAndGlobPathIfNecessary(DataSource.scala:569)
	at org.apache.spark.sql.execution.datasources.DataSource.resolveRelation(DataSource.scala:381)
	at org.apache.spark.sql.hive.HiveMetastoreCatalog.$anonfun$convertToLogicalRelation$5(HiveMetastoreCatalog.scala:245)
	at scala.Option.getOrElse(Option.scala:138)
	at org.apache.spark.sql.hive.HiveMetastoreCatalog.$anonfun$convertToLogicalRelation$4(HiveMetastoreCatalog.scala:235)
	at org.apache.spark.sql.hive.HiveMetastoreCatalog.withTableCreationLock(HiveMetastoreCatalog.scala:58)
	at org.apache.spark.sql.hive.HiveMetastoreCatalog.convertToLogicalRelation(HiveMetastoreCatalog.scala:228)
	at org.apache.spark.sql.hive.HiveMetastoreCatalog.convert(HiveMetastoreCatalog.scala:137)
	at org.apache.spark.sql.hive.RelationConversions$$anonfun$apply$4.applyOrElse(HiveStrategies.scala:198)
	at org.apache.spark.sql.hive.RelationConversions$$anonfun$apply$4.applyOrElse(HiveStrategies.scala:186)
	at org.apache.spark.sql.catalyst.plans.logical.AnalysisHelper.$anonfun$resolveOperatorsDown$2(AnalysisHelper.scala:108)
	at org.apache.spark.sql.catalyst.trees.CurrentOrigin$.withOrigin(TreeNode.scala:72)
	at org.apache.spark.sql.catalyst.plans.logical.AnalysisHelper.$anonfun$resolveOperatorsDown$1(AnalysisHelper.scala:108)
	at org.apache.spark.sql.catalyst.plans.logical.AnalysisHelper$.allowInvokingTransformsInAnalyzer(AnalysisHelper.scala:194)
	at org.apache.spark.sql.catalyst.plans.logical.AnalysisHelper.resolveOperatorsDown(AnalysisHelper.scala:106)
	at org.apache.spark.sql.catalyst.plans.logical.AnalysisHelper.resolveOperatorsDown$(AnalysisHelper.scala:104)
	at org.apache.spark.sql.catalyst.plans.logical.LogicalPlan.resolveOperatorsDown(LogicalPlan.scala:29)
	at org.apache.spark.sql.catalyst.plans.logical.AnalysisHelper.$anonfun$resolveOperatorsDown$4(AnalysisHelper.scala:113)
	at org.apache.spark.sql.catalyst.trees.TreeNode.$anonfun$mapChildren$1(TreeNode.scala:372)
	at org.apache.spark.sql.catalyst.trees.TreeNode.mapProductIterator(TreeNode.scala:210)
	at org.apache.spark.sql.catalyst.trees.TreeNode.mapChildren(TreeNode.scala:370)
	at org.apache.spark.sql.catalyst.trees.TreeNode.mapChildren(TreeNode.scala:323)
	at org.apache.spark.sql.catalyst.plans.logical.AnalysisHelper.$anonfun$resolveOperatorsDown$1(AnalysisHelper.scala:113)
	at org.apache.spark.sql.catalyst.plans.logical.AnalysisHelper$.allowInvokingTransformsInAnalyzer(AnalysisHelper.scala:194)
	at org.apache.spark.sql.catalyst.plans.logical.AnalysisHelper.resolveOperatorsDown(AnalysisHelper.scala:106)
	at org.apache.spark.sql.catalyst.plans.logical.AnalysisHelper.resolveOperatorsDown$(AnalysisHelper.scala:104)
	at org.apache.spark.sql.catalyst.plans.logical.LogicalPlan.resolveOperatorsDown(LogicalPlan.scala:29)
	at org.apache.spark.sql.catalyst.plans.logical.AnalysisHelper.resolveOperators(AnalysisHelper.scala:73)
	at org.apache.spark.sql.catalyst.plans.logical.AnalysisHelper.resolveOperators$(AnalysisHelper.scala:72)
	at org.apache.spark.sql.catalyst.plans.logical.LogicalPlan.resolveOperators(LogicalPlan.scala:29)
	at org.apache.spark.sql.hive.RelationConversions.apply(HiveStrategies.scala:186)
	at org.apache.spark.sql.hive.RelationConversions.apply(HiveStrategies.scala:170)
	at org.apache.spark.sql.catalyst.rules.RuleExecutor.$anonfun$execute$2(RuleExecutor.scala:130)
	at scala.collection.IndexedSeqOptimized.foldLeft(IndexedSeqOptimized.scala:60)
	at scala.collection.IndexedSeqOptimized.foldLeft$(IndexedSeqOptimized.scala:68)
	at scala.collection.mutable.ArrayBuffer.foldLeft(ArrayBuffer.scala:49)
	at org.apache.spark.sql.catalyst.rules.RuleExecutor.$anonfun$execute$1(RuleExecutor.scala:127)
	at org.apache.spark.sql.catalyst.rules.RuleExecutor.$anonfun$execute$1$adapted(RuleExecutor.scala:119)
	at scala.collection.immutable.List.foreach(List.scala:392)
	at org.apache.spark.sql.catalyst.rules.RuleExecutor.execute(RuleExecutor.scala:119)
	at org.apache.spark.sql.catalyst.analysis.Analyzer.org$apache$spark$sql$catalyst$analysis$Analyzer$$executeSameContext(Analyzer.scala:142)
	at org.apache.spark.sql.catalyst.analysis.Analyzer.execute(Analyzer.scala:136)
	at org.apache.spark.sql.catalyst.analysis.Analyzer.execute(Analyzer.scala:103)
	at org.apache.spark.sql.catalyst.rules.RuleExecutor.$anonfun$executeAndTrack$1(RuleExecutor.scala:98)
	at org.apache.spark.sql.catalyst.QueryPlanningTracker$.withTracker(QueryPlanningTracker.scala:88)
	at org.apache.spark.sql.catalyst.rules.RuleExecutor.executeAndTrack(RuleExecutor.scala:98)
	at org.apache.spark.sql.catalyst.analysis.Analyzer.$anonfun$executeAndCheck$1(Analyzer.scala:120)
	at org.apache.spark.sql.catalyst.plans.logical.AnalysisHelper$.markInAnalyzer(AnalysisHelper.scala:201)
	at org.apache.spark.sql.catalyst.analysis.Analyzer.executeAndCheck(Analyzer.scala:119)
	at org.apache.spark.sql.hive.test.TestHiveQueryExecution.analyzed$lzycompute(TestHive.scala:606)
	at org.apache.spark.sql.hive.test.TestHiveQueryExecution.analyzed(TestHive.scala:589)
	at org.apache.spark.sql.execution.QueryExecution.assertAnalyzed(QueryExecution.scala:53)
	at org.apache.spark.sql.Dataset$.ofRows(Dataset.scala:86)
	at org.apache.spark.sql.SparkSession.table(SparkSession.scala:635)
	at org.apache.spark.sql.execution.command.DropTableCommand.run(ddl.scala:213)
	at org.apache.spark.sql.execution.command.ExecutedCommandExec.sideEffectResult$lzycompute(commands.scala:70)
	at org.apache.spark.sql.execution.command.ExecutedCommandExec.sideEffectResult(commands.scala:68)
	at org.apache.spark.sql.execution.command.ExecutedCommandExec.executeCollect(commands.scala:79)
	at org.apache.spark.sql.Dataset.$anonfun$logicalPlan$1(Dataset.scala:213)
	at org.apache.spark.sql.Dataset.$anonfun$withAction$1(Dataset.scala:3431)
	at org.apache.spark.sql.execution.SQLExecution$.$anonfun$withNewExecutionId$4(SQLExecution.scala:100)
	at org.apache.spark.sql.execution.SQLExecution$.withSQLConfPropagated(SQLExecution.scala:160)
	at org.apache.spark.sql.execution.SQLExecution$.withNewExecutionId(SQLExecution.scala:87)
	at org.apache.spark.sql.Dataset.withAction(Dataset.scala:3427)
	at org.apache.spark.sql.Dataset.<init>(Dataset.scala:213)
	at org.apache.spark.sql.Dataset$.ofRows(Dataset.scala:87)
	at org.apache.spark.sql.hive.test.TestHiveSparkSession.sql(TestHive.scala:238)
	at org.apache.spark.sql.test.SQLTestUtilsBase.$anonfun$withTable$2(SQLTestUtils.scala:291)
	at scala.collection.IndexedSeqOptimized.foreach(IndexedSeqOptimized.scala:36)
	at scala.collection.IndexedSeqOptimized.foreach$(IndexedSeqOptimized.scala:33)
	at scala.collection.mutable.WrappedArray.foreach(WrappedArray.scala:39)
	at org.apache.spark.sql.test.SQLTestUtilsBase.$anonfun$withTable$1(SQLTestUtils.scala:290)
	at org.apache.spark.util.Utils$.tryWithSafeFinally(Utils.scala:1386)
	at org.apache.spark.sql.test.SQLTestUtilsBase.withTable(SQLTestUtils.scala:290)
	at org.apache.spark.sql.test.SQLTestUtilsBase.withTable$(SQLTestUtils.scala:288)
	at org.apache.spark.sql.execution.datasources.parquet.ParquetCompatibilityTest.withTable(ParquetCompatibilityTest.scala:35)
	at org.apache.spark.sql.hive.ParquetHiveCompatibilitySuite.testParquetHiveCompatibility(ParquetHiveCompatibilitySuite.scala:47)
	at org.apache.spark.sql.hive.ParquetHiveCompatibilitySuite.$anonfun$new$3(ParquetHiveCompatibilitySuite.scala:111)
	at scala.runtime.java8.JFunction0$mcV$sp.apply(JFunction0$mcV$sp.java:23)
	at org.scalatest.OutcomeOf.outcomeOf(OutcomeOf.scala:85)
	at org.scalatest.OutcomeOf.outcomeOf$(OutcomeOf.scala:83)
	at org.scalatest.OutcomeOf$.outcomeOf(OutcomeOf.scala:104)
	at org.scalatest.Transformer.apply(Transformer.scala:22)
	at org.scalatest.Transformer.apply(Transformer.scala:20)
	at org.scalatest.FunSuiteLike$$anon$1.apply(FunSuiteLike.scala:186)
	at org.apache.spark.SparkFunSuite.withFixture(SparkFunSuite.scala:149)
	at org.scalatest.FunSuiteLike.invokeWithFixture$1(FunSuiteLike.scala:184)
	at org.scalatest.FunSuiteLike.$anonfun$runTest$1(FunSuiteLike.scala:196)
	at org.scalatest.SuperEngine.runTestImpl(Engine.scala:289)
	at org.scalatest.FunSuiteLike.runTest(FunSuiteLike.scala:196)
	at org.scalatest.FunSuiteLike.runTest$(FunSuiteLike.scala:178)
	at org.apache.spark.SparkFunSuite.org$scalatest$BeforeAndAfterEach$$super$runTest(SparkFunSuite.scala:56)
	at org.scalatest.BeforeAndAfterEach.runTest(BeforeAndAfterEach.scala:221)
	at org.scalatest.BeforeAndAfterEach.runTest$(BeforeAndAfterEach.scala:214)
	at org.apache.spark.SparkFunSuite.runTest(SparkFunSuite.scala:56)
	at org.scalatest.FunSuiteLike.$anonfun$runTests$1(FunSuiteLike.scala:229)
	at org.scalatest.SuperEngine.$anonfun$runTestsInBranch$1(Engine.scala:396)
	at scala.collection.immutable.List.foreach(List.scala:392)
	at org.scalatest.SuperEngine.traverseSubNodes$1(Engine.scala:384)
	at org.scalatest.SuperEngine.runTestsInBranch(Engine.scala:379)
	at org.scalatest.SuperEngine.runTestsImpl(Engine.scala:461)
	at org.scalatest.FunSuiteLike.runTests(FunSuiteLike.scala:229)
	at org.scalatest.FunSuiteLike.runTests$(FunSuiteLike.scala:228)
	at org.scalatest.FunSuite.runTests(FunSuite.scala:1560)
	at org.scalatest.Suite.run(Suite.scala:1147)
	at org.scalatest.Suite.run$(Suite.scala:1129)
	at org.scalatest.FunSuite.org$scalatest$FunSuiteLike$$super$run(FunSuite.scala:1560)
	at org.scalatest.FunSuiteLike.$anonfun$run$1(FunSuiteLike.scala:233)
	at org.scalatest.SuperEngine.runImpl(Engine.scala:521)
	at org.scalatest.FunSuiteLike.run(FunSuiteLike.scala:233)
	at org.scalatest.FunSuiteLike.run$(FunSuiteLike.scala:232)
	at org.apache.spark.SparkFunSuite.org$scalatest$BeforeAndAfterAll$$super$run(SparkFunSuite.scala:56)
	at org.scalatest.BeforeAndAfterAll.liftedTree1$1(BeforeAndAfterAll.scala:213)
	at org.scalatest.BeforeAndAfterAll.run(BeforeAndAfterAll.scala:210)
	at org.scalatest.BeforeAndAfterAll.run$(BeforeAndAfterAll.scala:208)
	at org.apache.spark.SparkFunSuite.run(SparkFunSuite.scala:56)
	at org.scalatest.tools.Framework.org$scalatest$tools$Framework$$runSuite(Framework.scala:314)
	at org.scalatest.tools.Framework$ScalaTestTask.execute(Framework.scala:507)
	at sbt.ForkMain$Run$2.call(ForkMain.java:296)
	at sbt.ForkMain$Run$2.call(ForkMain.java:286)
	at java.util.concurrent.FutureTask.run(FutureTask.java:266)
	at java.util.concurrent.ThreadPoolExecutor.runWorker(ThreadPoolExecutor.java:1149)
	at java.util.concurrent.ThreadPoolExecutor$Worker.run(ThreadPoolExecutor.java:624)
	at java.lang.Thread.run(Thread.java:748)
[info] - array (1 second, 225 milliseconds)
11:56:38.732 WARN org.apache.spark.sql.execution.command.DropTableCommand: org.apache.spark.sql.AnalysisException: Path does not exist: file:/home/jenkins/workspace/NewSparkPullRequestBuilder/target/tmp/spark-66c3b65b-91d2-4728-9cd4-db964cdadbba;
org.apache.spark.sql.AnalysisException: Path does not exist: file:/home/jenkins/workspace/NewSparkPullRequestBuilder/target/tmp/spark-66c3b65b-91d2-4728-9cd4-db964cdadbba;
	at org.apache.spark.sql.execution.datasources.DataSource$.$anonfun$checkAndGlobPathIfNecessary$1(DataSource.scala:735)
	at scala.collection.TraversableLike.$anonfun$flatMap$1(TraversableLike.scala:244)
	at scala.collection.immutable.List.foreach(List.scala:392)
	at scala.collection.TraversableLike.flatMap(TraversableLike.scala:244)
	at scala.collection.TraversableLike.flatMap$(TraversableLike.scala:241)
	at scala.collection.immutable.List.flatMap(List.scala:355)
	at org.apache.spark.sql.execution.datasources.DataSource$.checkAndGlobPathIfNecessary(DataSource.scala:722)
	at org.apache.spark.sql.execution.datasources.DataSource.checkAndGlobPathIfNecessary(DataSource.scala:569)
	at org.apache.spark.sql.execution.datasources.DataSource.resolveRelation(DataSource.scala:381)
	at org.apache.spark.sql.hive.HiveMetastoreCatalog.$anonfun$convertToLogicalRelation$5(HiveMetastoreCatalog.scala:245)
	at scala.Option.getOrElse(Option.scala:138)
	at org.apache.spark.sql.hive.HiveMetastoreCatalog.$anonfun$convertToLogicalRelation$4(HiveMetastoreCatalog.scala:235)
	at org.apache.spark.sql.hive.HiveMetastoreCatalog.withTableCreationLock(HiveMetastoreCatalog.scala:58)
	at org.apache.spark.sql.hive.HiveMetastoreCatalog.convertToLogicalRelation(HiveMetastoreCatalog.scala:228)
	at org.apache.spark.sql.hive.HiveMetastoreCatalog.convert(HiveMetastoreCatalog.scala:137)
	at org.apache.spark.sql.hive.RelationConversions$$anonfun$apply$4.applyOrElse(HiveStrategies.scala:198)
	at org.apache.spark.sql.hive.RelationConversions$$anonfun$apply$4.applyOrElse(HiveStrategies.scala:186)
	at org.apache.spark.sql.catalyst.plans.logical.AnalysisHelper.$anonfun$resolveOperatorsDown$2(AnalysisHelper.scala:108)
	at org.apache.spark.sql.catalyst.trees.CurrentOrigin$.withOrigin(TreeNode.scala:72)
	at org.apache.spark.sql.catalyst.plans.logical.AnalysisHelper.$anonfun$resolveOperatorsDown$1(AnalysisHelper.scala:108)
	at org.apache.spark.sql.catalyst.plans.logical.AnalysisHelper$.allowInvokingTransformsInAnalyzer(AnalysisHelper.scala:194)
	at org.apache.spark.sql.catalyst.plans.logical.AnalysisHelper.resolveOperatorsDown(AnalysisHelper.scala:106)
	at org.apache.spark.sql.catalyst.plans.logical.AnalysisHelper.resolveOperatorsDown$(AnalysisHelper.scala:104)
	at org.apache.spark.sql.catalyst.plans.logical.LogicalPlan.resolveOperatorsDown(LogicalPlan.scala:29)
	at org.apache.spark.sql.catalyst.plans.logical.AnalysisHelper.$anonfun$resolveOperatorsDown$4(AnalysisHelper.scala:113)
	at org.apache.spark.sql.catalyst.trees.TreeNode.$anonfun$mapChildren$1(TreeNode.scala:372)
	at org.apache.spark.sql.catalyst.trees.TreeNode.mapProductIterator(TreeNode.scala:210)
	at org.apache.spark.sql.catalyst.trees.TreeNode.mapChildren(TreeNode.scala:370)
	at org.apache.spark.sql.catalyst.trees.TreeNode.mapChildren(TreeNode.scala:323)
	at org.apache.spark.sql.catalyst.plans.logical.AnalysisHelper.$anonfun$resolveOperatorsDown$1(AnalysisHelper.scala:113)
	at org.apache.spark.sql.catalyst.plans.logical.AnalysisHelper$.allowInvokingTransformsInAnalyzer(AnalysisHelper.scala:194)
	at org.apache.spark.sql.catalyst.plans.logical.AnalysisHelper.resolveOperatorsDown(AnalysisHelper.scala:106)
	at org.apache.spark.sql.catalyst.plans.logical.AnalysisHelper.resolveOperatorsDown$(AnalysisHelper.scala:104)
	at org.apache.spark.sql.catalyst.plans.logical.LogicalPlan.resolveOperatorsDown(LogicalPlan.scala:29)
	at org.apache.spark.sql.catalyst.plans.logical.AnalysisHelper.resolveOperators(AnalysisHelper.scala:73)
	at org.apache.spark.sql.catalyst.plans.logical.AnalysisHelper.resolveOperators$(AnalysisHelper.scala:72)
	at org.apache.spark.sql.catalyst.plans.logical.LogicalPlan.resolveOperators(LogicalPlan.scala:29)
	at org.apache.spark.sql.hive.RelationConversions.apply(HiveStrategies.scala:186)
	at org.apache.spark.sql.hive.RelationConversions.apply(HiveStrategies.scala:170)
	at org.apache.spark.sql.catalyst.rules.RuleExecutor.$anonfun$execute$2(RuleExecutor.scala:130)
	at scala.collection.IndexedSeqOptimized.foldLeft(IndexedSeqOptimized.scala:60)
	at scala.collection.IndexedSeqOptimized.foldLeft$(IndexedSeqOptimized.scala:68)
	at scala.collection.mutable.ArrayBuffer.foldLeft(ArrayBuffer.scala:49)
	at org.apache.spark.sql.catalyst.rules.RuleExecutor.$anonfun$execute$1(RuleExecutor.scala:127)
	at org.apache.spark.sql.catalyst.rules.RuleExecutor.$anonfun$execute$1$adapted(RuleExecutor.scala:119)
	at scala.collection.immutable.List.foreach(List.scala:392)
	at org.apache.spark.sql.catalyst.rules.RuleExecutor.execute(RuleExecutor.scala:119)
	at org.apache.spark.sql.catalyst.analysis.Analyzer.org$apache$spark$sql$catalyst$analysis$Analyzer$$executeSameContext(Analyzer.scala:142)
	at org.apache.spark.sql.catalyst.analysis.Analyzer.execute(Analyzer.scala:136)
	at org.apache.spark.sql.catalyst.analysis.Analyzer.execute(Analyzer.scala:103)
	at org.apache.spark.sql.catalyst.rules.RuleExecutor.$anonfun$executeAndTrack$1(RuleExecutor.scala:98)
	at org.apache.spark.sql.catalyst.QueryPlanningTracker$.withTracker(QueryPlanningTracker.scala:88)
	at org.apache.spark.sql.catalyst.rules.RuleExecutor.executeAndTrack(RuleExecutor.scala:98)
	at org.apache.spark.sql.catalyst.analysis.Analyzer.$anonfun$executeAndCheck$1(Analyzer.scala:120)
	at org.apache.spark.sql.catalyst.plans.logical.AnalysisHelper$.markInAnalyzer(AnalysisHelper.scala:201)
	at org.apache.spark.sql.catalyst.analysis.Analyzer.executeAndCheck(Analyzer.scala:119)
	at org.apache.spark.sql.hive.test.TestHiveQueryExecution.analyzed$lzycompute(TestHive.scala:606)
	at org.apache.spark.sql.hive.test.TestHiveQueryExecution.analyzed(TestHive.scala:589)
	at org.apache.spark.sql.execution.QueryExecution.assertAnalyzed(QueryExecution.scala:53)
	at org.apache.spark.sql.Dataset$.ofRows(Dataset.scala:86)
	at org.apache.spark.sql.SparkSession.table(SparkSession.scala:635)
	at org.apache.spark.sql.execution.command.DropTableCommand.run(ddl.scala:213)
	at org.apache.spark.sql.execution.command.ExecutedCommandExec.sideEffectResult$lzycompute(commands.scala:70)
	at org.apache.spark.sql.execution.command.ExecutedCommandExec.sideEffectResult(commands.scala:68)
	at org.apache.spark.sql.execution.command.ExecutedCommandExec.executeCollect(commands.scala:79)
	at org.apache.spark.sql.Dataset.$anonfun$logicalPlan$1(Dataset.scala:213)
	at org.apache.spark.sql.Dataset.$anonfun$withAction$1(Dataset.scala:3431)
	at org.apache.spark.sql.execution.SQLExecution$.$anonfun$withNewExecutionId$4(SQLExecution.scala:100)
	at org.apache.spark.sql.execution.SQLExecution$.withSQLConfPropagated(SQLExecution.scala:160)
	at org.apache.spark.sql.execution.SQLExecution$.withNewExecutionId(SQLExecution.scala:87)
	at org.apache.spark.sql.Dataset.withAction(Dataset.scala:3427)
	at org.apache.spark.sql.Dataset.<init>(Dataset.scala:213)
	at org.apache.spark.sql.Dataset$.ofRows(Dataset.scala:87)
	at org.apache.spark.sql.hive.test.TestHiveSparkSession.sql(TestHive.scala:238)
	at org.apache.spark.sql.test.SQLTestUtilsBase.$anonfun$withTable$2(SQLTestUtils.scala:291)
	at scala.collection.IndexedSeqOptimized.foreach(IndexedSeqOptimized.scala:36)
	at scala.collection.IndexedSeqOptimized.foreach$(IndexedSeqOptimized.scala:33)
	at scala.collection.mutable.WrappedArray.foreach(WrappedArray.scala:39)
	at org.apache.spark.sql.test.SQLTestUtilsBase.$anonfun$withTable$1(SQLTestUtils.scala:290)
	at org.apache.spark.util.Utils$.tryWithSafeFinally(Utils.scala:1386)
	at org.apache.spark.sql.test.SQLTestUtilsBase.withTable(SQLTestUtils.scala:290)
	at org.apache.spark.sql.test.SQLTestUtilsBase.withTable$(SQLTestUtils.scala:288)
	at org.apache.spark.sql.execution.datasources.parquet.ParquetCompatibilityTest.withTable(ParquetCompatibilityTest.scala:35)
	at org.apache.spark.sql.hive.ParquetHiveCompatibilitySuite.testParquetHiveCompatibility(ParquetHiveCompatibilitySuite.scala:47)
	at org.apache.spark.sql.hive.ParquetHiveCompatibilitySuite.$anonfun$new$4(ParquetHiveCompatibilitySuite.scala:120)
	at scala.runtime.java8.JFunction0$mcV$sp.apply(JFunction0$mcV$sp.java:23)
	at org.scalatest.OutcomeOf.outcomeOf(OutcomeOf.scala:85)
	at org.scalatest.OutcomeOf.outcomeOf$(OutcomeOf.scala:83)
	at org.scalatest.OutcomeOf$.outcomeOf(OutcomeOf.scala:104)
	at org.scalatest.Transformer.apply(Transformer.scala:22)
	at org.scalatest.Transformer.apply(Transformer.scala:20)
	at org.scalatest.FunSuiteLike$$anon$1.apply(FunSuiteLike.scala:186)
	at org.apache.spark.SparkFunSuite.withFixture(SparkFunSuite.scala:149)
	at org.scalatest.FunSuiteLike.invokeWithFixture$1(FunSuiteLike.scala:184)
	at org.scalatest.FunSuiteLike.$anonfun$runTest$1(FunSuiteLike.scala:196)
	at org.scalatest.SuperEngine.runTestImpl(Engine.scala:289)
	at org.scalatest.FunSuiteLike.runTest(FunSuiteLike.scala:196)
	at org.scalatest.FunSuiteLike.runTest$(FunSuiteLike.scala:178)
	at org.apache.spark.SparkFunSuite.org$scalatest$BeforeAndAfterEach$$super$runTest(SparkFunSuite.scala:56)
	at org.scalatest.BeforeAndAfterEach.runTest(BeforeAndAfterEach.scala:221)
	at org.scalatest.BeforeAndAfterEach.runTest$(BeforeAndAfterEach.scala:214)
	at org.apache.spark.SparkFunSuite.runTest(SparkFunSuite.scala:56)
	at org.scalatest.FunSuiteLike.$anonfun$runTests$1(FunSuiteLike.scala:229)
	at org.scalatest.SuperEngine.$anonfun$runTestsInBranch$1(Engine.scala:396)
	at scala.collection.immutable.List.foreach(List.scala:392)
	at org.scalatest.SuperEngine.traverseSubNodes$1(Engine.scala:384)
	at org.scalatest.SuperEngine.runTestsInBranch(Engine.scala:379)
	at org.scalatest.SuperEngine.runTestsImpl(Engine.scala:461)
	at org.scalatest.FunSuiteLike.runTests(FunSuiteLike.scala:229)
	at org.scalatest.FunSuiteLike.runTests$(FunSuiteLike.scala:228)
	at org.scalatest.FunSuite.runTests(FunSuite.scala:1560)
	at org.scalatest.Suite.run(Suite.scala:1147)
	at org.scalatest.Suite.run$(Suite.scala:1129)
	at org.scalatest.FunSuite.org$scalatest$FunSuiteLike$$super$run(FunSuite.scala:1560)
	at org.scalatest.FunSuiteLike.$anonfun$run$1(FunSuiteLike.scala:233)
	at org.scalatest.SuperEngine.runImpl(Engine.scala:521)
	at org.scalatest.FunSuiteLike.run(FunSuiteLike.scala:233)
	at org.scalatest.FunSuiteLike.run$(FunSuiteLike.scala:232)
	at org.apache.spark.SparkFunSuite.org$scalatest$BeforeAndAfterAll$$super$run(SparkFunSuite.scala:56)
	at org.scalatest.BeforeAndAfterAll.liftedTree1$1(BeforeAndAfterAll.scala:213)
	at org.scalatest.BeforeAndAfterAll.run(BeforeAndAfterAll.scala:210)
	at org.scalatest.BeforeAndAfterAll.run$(BeforeAndAfterAll.scala:208)
	at org.apache.spark.SparkFunSuite.run(SparkFunSuite.scala:56)
	at org.scalatest.tools.Framework.org$scalatest$tools$Framework$$runSuite(Framework.scala:314)
	at org.scalatest.tools.Framework$ScalaTestTask.execute(Framework.scala:507)
	at sbt.ForkMain$Run$2.call(ForkMain.java:296)
	at sbt.ForkMain$Run$2.call(ForkMain.java:286)
	at java.util.concurrent.FutureTask.run(FutureTask.java:266)
	at java.util.concurrent.ThreadPoolExecutor.runWorker(ThreadPoolExecutor.java:1149)
	at java.util.concurrent.ThreadPoolExecutor$Worker.run(ThreadPoolExecutor.java:624)
	at java.lang.Thread.run(Thread.java:748)
[info] - map (1 second, 291 milliseconds)
[info] - map entries with null keys !!! IGNORED !!!
11:56:40.007 WARN org.apache.spark.sql.execution.command.DropTableCommand: org.apache.spark.sql.AnalysisException: Path does not exist: file:/home/jenkins/workspace/NewSparkPullRequestBuilder/target/tmp/spark-64e1b859-414f-4b47-b377-062271f06bff;
org.apache.spark.sql.AnalysisException: Path does not exist: file:/home/jenkins/workspace/NewSparkPullRequestBuilder/target/tmp/spark-64e1b859-414f-4b47-b377-062271f06bff;
	at org.apache.spark.sql.execution.datasources.DataSource$.$anonfun$checkAndGlobPathIfNecessary$1(DataSource.scala:735)
	at scala.collection.TraversableLike.$anonfun$flatMap$1(TraversableLike.scala:244)
	at scala.collection.immutable.List.foreach(List.scala:392)
	at scala.collection.TraversableLike.flatMap(TraversableLike.scala:244)
	at scala.collection.TraversableLike.flatMap$(TraversableLike.scala:241)
	at scala.collection.immutable.List.flatMap(List.scala:355)
	at org.apache.spark.sql.execution.datasources.DataSource$.checkAndGlobPathIfNecessary(DataSource.scala:722)
	at org.apache.spark.sql.execution.datasources.DataSource.checkAndGlobPathIfNecessary(DataSource.scala:569)
	at org.apache.spark.sql.execution.datasources.DataSource.resolveRelation(DataSource.scala:381)
	at org.apache.spark.sql.hive.HiveMetastoreCatalog.$anonfun$convertToLogicalRelation$5(HiveMetastoreCatalog.scala:245)
	at scala.Option.getOrElse(Option.scala:138)
	at org.apache.spark.sql.hive.HiveMetastoreCatalog.$anonfun$convertToLogicalRelation$4(HiveMetastoreCatalog.scala:235)
	at org.apache.spark.sql.hive.HiveMetastoreCatalog.withTableCreationLock(HiveMetastoreCatalog.scala:58)
	at org.apache.spark.sql.hive.HiveMetastoreCatalog.convertToLogicalRelation(HiveMetastoreCatalog.scala:228)
	at org.apache.spark.sql.hive.HiveMetastoreCatalog.convert(HiveMetastoreCatalog.scala:137)
	at org.apache.spark.sql.hive.RelationConversions$$anonfun$apply$4.applyOrElse(HiveStrategies.scala:198)
	at org.apache.spark.sql.hive.RelationConversions$$anonfun$apply$4.applyOrElse(HiveStrategies.scala:186)
	at org.apache.spark.sql.catalyst.plans.logical.AnalysisHelper.$anonfun$resolveOperatorsDown$2(AnalysisHelper.scala:108)
	at org.apache.spark.sql.catalyst.trees.CurrentOrigin$.withOrigin(TreeNode.scala:72)
	at org.apache.spark.sql.catalyst.plans.logical.AnalysisHelper.$anonfun$resolveOperatorsDown$1(AnalysisHelper.scala:108)
	at org.apache.spark.sql.catalyst.plans.logical.AnalysisHelper$.allowInvokingTransformsInAnalyzer(AnalysisHelper.scala:194)
	at org.apache.spark.sql.catalyst.plans.logical.AnalysisHelper.resolveOperatorsDown(AnalysisHelper.scala:106)
	at org.apache.spark.sql.catalyst.plans.logical.AnalysisHelper.resolveOperatorsDown$(AnalysisHelper.scala:104)
	at org.apache.spark.sql.catalyst.plans.logical.LogicalPlan.resolveOperatorsDown(LogicalPlan.scala:29)
	at org.apache.spark.sql.catalyst.plans.logical.AnalysisHelper.$anonfun$resolveOperatorsDown$4(AnalysisHelper.scala:113)
	at org.apache.spark.sql.catalyst.trees.TreeNode.$anonfun$mapChildren$1(TreeNode.scala:372)
	at org.apache.spark.sql.catalyst.trees.TreeNode.mapProductIterator(TreeNode.scala:210)
	at org.apache.spark.sql.catalyst.trees.TreeNode.mapChildren(TreeNode.scala:370)
	at org.apache.spark.sql.catalyst.trees.TreeNode.mapChildren(TreeNode.scala:323)
	at org.apache.spark.sql.catalyst.plans.logical.AnalysisHelper.$anonfun$resolveOperatorsDown$1(AnalysisHelper.scala:113)
	at org.apache.spark.sql.catalyst.plans.logical.AnalysisHelper$.allowInvokingTransformsInAnalyzer(AnalysisHelper.scala:194)
	at org.apache.spark.sql.catalyst.plans.logical.AnalysisHelper.resolveOperatorsDown(AnalysisHelper.scala:106)
	at org.apache.spark.sql.catalyst.plans.logical.AnalysisHelper.resolveOperatorsDown$(AnalysisHelper.scala:104)
	at org.apache.spark.sql.catalyst.plans.logical.LogicalPlan.resolveOperatorsDown(LogicalPlan.scala:29)
	at org.apache.spark.sql.catalyst.plans.logical.AnalysisHelper.resolveOperators(AnalysisHelper.scala:73)
	at org.apache.spark.sql.catalyst.plans.logical.AnalysisHelper.resolveOperators$(AnalysisHelper.scala:72)
	at org.apache.spark.sql.catalyst.plans.logical.LogicalPlan.resolveOperators(LogicalPlan.scala:29)
	at org.apache.spark.sql.hive.RelationConversions.apply(HiveStrategies.scala:186)
	at org.apache.spark.sql.hive.RelationConversions.apply(HiveStrategies.scala:170)
	at org.apache.spark.sql.catalyst.rules.RuleExecutor.$anonfun$execute$2(RuleExecutor.scala:130)
	at scala.collection.IndexedSeqOptimized.foldLeft(IndexedSeqOptimized.scala:60)
	at scala.collection.IndexedSeqOptimized.foldLeft$(IndexedSeqOptimized.scala:68)
	at scala.collection.mutable.ArrayBuffer.foldLeft(ArrayBuffer.scala:49)
	at org.apache.spark.sql.catalyst.rules.RuleExecutor.$anonfun$execute$1(RuleExecutor.scala:127)
	at org.apache.spark.sql.catalyst.rules.RuleExecutor.$anonfun$execute$1$adapted(RuleExecutor.scala:119)
	at scala.collection.immutable.List.foreach(List.scala:392)
	at org.apache.spark.sql.catalyst.rules.RuleExecutor.execute(RuleExecutor.scala:119)
	at org.apache.spark.sql.catalyst.analysis.Analyzer.org$apache$spark$sql$catalyst$analysis$Analyzer$$executeSameContext(Analyzer.scala:142)
	at org.apache.spark.sql.catalyst.analysis.Analyzer.execute(Analyzer.scala:136)
	at org.apache.spark.sql.catalyst.analysis.Analyzer.execute(Analyzer.scala:103)
	at org.apache.spark.sql.catalyst.rules.RuleExecutor.$anonfun$executeAndTrack$1(RuleExecutor.scala:98)
	at org.apache.spark.sql.catalyst.QueryPlanningTracker$.withTracker(QueryPlanningTracker.scala:88)
	at org.apache.spark.sql.catalyst.rules.RuleExecutor.executeAndTrack(RuleExecutor.scala:98)
	at org.apache.spark.sql.catalyst.analysis.Analyzer.$anonfun$executeAndCheck$1(Analyzer.scala:120)
	at org.apache.spark.sql.catalyst.plans.logical.AnalysisHelper$.markInAnalyzer(AnalysisHelper.scala:201)
	at org.apache.spark.sql.catalyst.analysis.Analyzer.executeAndCheck(Analyzer.scala:119)
	at org.apache.spark.sql.hive.test.TestHiveQueryExecution.analyzed$lzycompute(TestHive.scala:606)
	at org.apache.spark.sql.hive.test.TestHiveQueryExecution.analyzed(TestHive.scala:589)
	at org.apache.spark.sql.execution.QueryExecution.assertAnalyzed(QueryExecution.scala:53)
	at org.apache.spark.sql.Dataset$.ofRows(Dataset.scala:86)
	at org.apache.spark.sql.SparkSession.table(SparkSession.scala:635)
	at org.apache.spark.sql.execution.command.DropTableCommand.run(ddl.scala:213)
	at org.apache.spark.sql.execution.command.ExecutedCommandExec.sideEffectResult$lzycompute(commands.scala:70)
	at org.apache.spark.sql.execution.command.ExecutedCommandExec.sideEffectResult(commands.scala:68)
	at org.apache.spark.sql.execution.command.ExecutedCommandExec.executeCollect(commands.scala:79)
	at org.apache.spark.sql.Dataset.$anonfun$logicalPlan$1(Dataset.scala:213)
	at org.apache.spark.sql.Dataset.$anonfun$withAction$1(Dataset.scala:3431)
	at org.apache.spark.sql.execution.SQLExecution$.$anonfun$withNewExecutionId$4(SQLExecution.scala:100)
	at org.apache.spark.sql.execution.SQLExecution$.withSQLConfPropagated(SQLExecution.scala:160)
	at org.apache.spark.sql.execution.SQLExecution$.withNewExecutionId(SQLExecution.scala:87)
	at org.apache.spark.sql.Dataset.withAction(Dataset.scala:3427)
	at org.apache.spark.sql.Dataset.<init>(Dataset.scala:213)
	at org.apache.spark.sql.Dataset$.ofRows(Dataset.scala:87)
	at org.apache.spark.sql.hive.test.TestHiveSparkSession.sql(TestHive.scala:238)
	at org.apache.spark.sql.test.SQLTestUtilsBase.$anonfun$withTable$2(SQLTestUtils.scala:291)
	at scala.collection.IndexedSeqOptimized.foreach(IndexedSeqOptimized.scala:36)
	at scala.collection.IndexedSeqOptimized.foreach$(IndexedSeqOptimized.scala:33)
	at scala.collection.mutable.WrappedArray.foreach(WrappedArray.scala:39)
	at org.apache.spark.sql.test.SQLTestUtilsBase.$anonfun$withTable$1(SQLTestUtils.scala:290)
	at org.apache.spark.util.Utils$.tryWithSafeFinally(Utils.scala:1386)
	at org.apache.spark.sql.test.SQLTestUtilsBase.withTable(SQLTestUtils.scala:290)
	at org.apache.spark.sql.test.SQLTestUtilsBase.withTable$(SQLTestUtils.scala:288)
	at org.apache.spark.sql.execution.datasources.parquet.ParquetCompatibilityTest.withTable(ParquetCompatibilityTest.scala:35)
	at org.apache.spark.sql.hive.ParquetHiveCompatibilitySuite.testParquetHiveCompatibility(ParquetHiveCompatibilitySuite.scala:47)
	at org.apache.spark.sql.hive.ParquetHiveCompatibilitySuite.$anonfun$new$6(ParquetHiveCompatibilitySuite.scala:136)
	at scala.runtime.java8.JFunction0$mcV$sp.apply(JFunction0$mcV$sp.java:23)
	at org.scalatest.OutcomeOf.outcomeOf(OutcomeOf.scala:85)
	at org.scalatest.OutcomeOf.outcomeOf$(OutcomeOf.scala:83)
	at org.scalatest.OutcomeOf$.outcomeOf(OutcomeOf.scala:104)
	at org.scalatest.Transformer.apply(Transformer.scala:22)
	at org.scalatest.Transformer.apply(Transformer.scala:20)
	at org.scalatest.FunSuiteLike$$anon$1.apply(FunSuiteLike.scala:186)
	at org.apache.spark.SparkFunSuite.withFixture(SparkFunSuite.scala:149)
	at org.scalatest.FunSuiteLike.invokeWithFixture$1(FunSuiteLike.scala:184)
	at org.scalatest.FunSuiteLike.$anonfun$runTest$1(FunSuiteLike.scala:196)
	at org.scalatest.SuperEngine.runTestImpl(Engine.scala:289)
	at org.scalatest.FunSuiteLike.runTest(FunSuiteLike.scala:196)
	at org.scalatest.FunSuiteLike.runTest$(FunSuiteLike.scala:178)
	at org.apache.spark.SparkFunSuite.org$scalatest$BeforeAndAfterEach$$super$runTest(SparkFunSuite.scala:56)
	at org.scalatest.BeforeAndAfterEach.runTest(BeforeAndAfterEach.scala:221)
	at org.scalatest.BeforeAndAfterEach.runTest$(BeforeAndAfterEach.scala:214)
	at org.apache.spark.SparkFunSuite.runTest(SparkFunSuite.scala:56)
	at org.scalatest.FunSuiteLike.$anonfun$runTests$1(FunSuiteLike.scala:229)
	at org.scalatest.SuperEngine.$anonfun$runTestsInBranch$1(Engine.scala:396)
	at scala.collection.immutable.List.foreach(List.scala:392)
	at org.scalatest.SuperEngine.traverseSubNodes$1(Engine.scala:384)
	at org.scalatest.SuperEngine.runTestsInBranch(Engine.scala:379)
	at org.scalatest.SuperEngine.runTestsImpl(Engine.scala:461)
	at org.scalatest.FunSuiteLike.runTests(FunSuiteLike.scala:229)
	at org.scalatest.FunSuiteLike.runTests$(FunSuiteLike.scala:228)
	at org.scalatest.FunSuite.runTests(FunSuite.scala:1560)
	at org.scalatest.Suite.run(Suite.scala:1147)
	at org.scalatest.Suite.run$(Suite.scala:1129)
	at org.scalatest.FunSuite.org$scalatest$FunSuiteLike$$super$run(FunSuite.scala:1560)
	at org.scalatest.FunSuiteLike.$anonfun$run$1(FunSuiteLike.scala:233)
	at org.scalatest.SuperEngine.runImpl(Engine.scala:521)
	at org.scalatest.FunSuiteLike.run(FunSuiteLike.scala:233)
	at org.scalatest.FunSuiteLike.run$(FunSuiteLike.scala:232)
	at org.apache.spark.SparkFunSuite.org$scalatest$BeforeAndAfterAll$$super$run(SparkFunSuite.scala:56)
	at org.scalatest.BeforeAndAfterAll.liftedTree1$1(BeforeAndAfterAll.scala:213)
	at org.scalatest.BeforeAndAfterAll.run(BeforeAndAfterAll.scala:210)
	at org.scalatest.BeforeAndAfterAll.run$(BeforeAndAfterAll.scala:208)
	at org.apache.spark.SparkFunSuite.run(SparkFunSuite.scala:56)
	at org.scalatest.tools.Framework.org$scalatest$tools$Framework$$runSuite(Framework.scala:314)
	at org.scalatest.tools.Framework$ScalaTestTask.execute(Framework.scala:507)
	at sbt.ForkMain$Run$2.call(ForkMain.java:296)
	at sbt.ForkMain$Run$2.call(ForkMain.java:286)
	at java.util.concurrent.FutureTask.run(FutureTask.java:266)
	at java.util.concurrent.ThreadPoolExecutor.runWorker(ThreadPoolExecutor.java:1149)
	at java.util.concurrent.ThreadPoolExecutor$Worker.run(ThreadPoolExecutor.java:624)
	at java.lang.Thread.run(Thread.java:748)
[info] - struct (1 second, 278 milliseconds)
11:56:42.878 WARN org.apache.spark.sql.execution.command.DropTableCommand: org.apache.spark.sql.AnalysisException: Path does not exist: file:/home/jenkins/workspace/NewSparkPullRequestBuilder/target/tmp/spark-1161d215-7c8a-460b-bd58-a20e03ed2a14;
org.apache.spark.sql.AnalysisException: Path does not exist: file:/home/jenkins/workspace/NewSparkPullRequestBuilder/target/tmp/spark-1161d215-7c8a-460b-bd58-a20e03ed2a14;
	at org.apache.spark.sql.execution.datasources.DataSource$.$anonfun$checkAndGlobPathIfNecessary$1(DataSource.scala:735)
	at scala.collection.TraversableLike.$anonfun$flatMap$1(TraversableLike.scala:244)
	at scala.collection.immutable.List.foreach(List.scala:392)
	at scala.collection.TraversableLike.flatMap(TraversableLike.scala:244)
	at scala.collection.TraversableLike.flatMap$(TraversableLike.scala:241)
	at scala.collection.immutable.List.flatMap(List.scala:355)
	at org.apache.spark.sql.execution.datasources.DataSource$.checkAndGlobPathIfNecessary(DataSource.scala:722)
	at org.apache.spark.sql.execution.datasources.DataSource.checkAndGlobPathIfNecessary(DataSource.scala:569)
	at org.apache.spark.sql.execution.datasources.DataSource.resolveRelation(DataSource.scala:381)
	at org.apache.spark.sql.hive.HiveMetastoreCatalog.$anonfun$convertToLogicalRelation$5(HiveMetastoreCatalog.scala:245)
	at scala.Option.getOrElse(Option.scala:138)
	at org.apache.spark.sql.hive.HiveMetastoreCatalog.$anonfun$convertToLogicalRelation$4(HiveMetastoreCatalog.scala:235)
	at org.apache.spark.sql.hive.HiveMetastoreCatalog.withTableCreationLock(HiveMetastoreCatalog.scala:58)
	at org.apache.spark.sql.hive.HiveMetastoreCatalog.convertToLogicalRelation(HiveMetastoreCatalog.scala:228)
	at org.apache.spark.sql.hive.HiveMetastoreCatalog.convert(HiveMetastoreCatalog.scala:137)
	at org.apache.spark.sql.hive.RelationConversions$$anonfun$apply$4.applyOrElse(HiveStrategies.scala:198)
	at org.apache.spark.sql.hive.RelationConversions$$anonfun$apply$4.applyOrElse(HiveStrategies.scala:186)
	at org.apache.spark.sql.catalyst.plans.logical.AnalysisHelper.$anonfun$resolveOperatorsDown$2(AnalysisHelper.scala:108)
	at org.apache.spark.sql.catalyst.trees.CurrentOrigin$.withOrigin(TreeNode.scala:72)
	at org.apache.spark.sql.catalyst.plans.logical.AnalysisHelper.$anonfun$resolveOperatorsDown$1(AnalysisHelper.scala:108)
	at org.apache.spark.sql.catalyst.plans.logical.AnalysisHelper$.allowInvokingTransformsInAnalyzer(AnalysisHelper.scala:194)
	at org.apache.spark.sql.catalyst.plans.logical.AnalysisHelper.resolveOperatorsDown(AnalysisHelper.scala:106)
	at org.apache.spark.sql.catalyst.plans.logical.AnalysisHelper.resolveOperatorsDown$(AnalysisHelper.scala:104)
	at org.apache.spark.sql.catalyst.plans.logical.LogicalPlan.resolveOperatorsDown(LogicalPlan.scala:29)
	at org.apache.spark.sql.catalyst.plans.logical.AnalysisHelper.$anonfun$resolveOperatorsDown$4(AnalysisHelper.scala:113)
	at org.apache.spark.sql.catalyst.trees.TreeNode.$anonfun$mapChildren$1(TreeNode.scala:372)
	at org.apache.spark.sql.catalyst.trees.TreeNode.mapProductIterator(TreeNode.scala:210)
	at org.apache.spark.sql.catalyst.trees.TreeNode.mapChildren(TreeNode.scala:370)
	at org.apache.spark.sql.catalyst.trees.TreeNode.mapChildren(TreeNode.scala:323)
	at org.apache.spark.sql.catalyst.plans.logical.AnalysisHelper.$anonfun$resolveOperatorsDown$1(AnalysisHelper.scala:113)
	at org.apache.spark.sql.catalyst.plans.logical.AnalysisHelper$.allowInvokingTransformsInAnalyzer(AnalysisHelper.scala:194)
	at org.apache.spark.sql.catalyst.plans.logical.AnalysisHelper.resolveOperatorsDown(AnalysisHelper.scala:106)
	at org.apache.spark.sql.catalyst.plans.logical.AnalysisHelper.resolveOperatorsDown$(AnalysisHelper.scala:104)
	at org.apache.spark.sql.catalyst.plans.logical.LogicalPlan.resolveOperatorsDown(LogicalPlan.scala:29)
	at org.apache.spark.sql.catalyst.plans.logical.AnalysisHelper.resolveOperators(AnalysisHelper.scala:73)
	at org.apache.spark.sql.catalyst.plans.logical.AnalysisHelper.resolveOperators$(AnalysisHelper.scala:72)
	at org.apache.spark.sql.catalyst.plans.logical.LogicalPlan.resolveOperators(LogicalPlan.scala:29)
	at org.apache.spark.sql.hive.RelationConversions.apply(HiveStrategies.scala:186)
	at org.apache.spark.sql.hive.RelationConversions.apply(HiveStrategies.scala:170)
	at org.apache.spark.sql.catalyst.rules.RuleExecutor.$anonfun$execute$2(RuleExecutor.scala:130)
	at scala.collection.IndexedSeqOptimized.foldLeft(IndexedSeqOptimized.scala:60)
	at scala.collection.IndexedSeqOptimized.foldLeft$(IndexedSeqOptimized.scala:68)
	at scala.collection.mutable.ArrayBuffer.foldLeft(ArrayBuffer.scala:49)
	at org.apache.spark.sql.catalyst.rules.RuleExecutor.$anonfun$execute$1(RuleExecutor.scala:127)
	at org.apache.spark.sql.catalyst.rules.RuleExecutor.$anonfun$execute$1$adapted(RuleExecutor.scala:119)
	at scala.collection.immutable.List.foreach(List.scala:392)
	at org.apache.spark.sql.catalyst.rules.RuleExecutor.execute(RuleExecutor.scala:119)
	at org.apache.spark.sql.catalyst.analysis.Analyzer.org$apache$spark$sql$catalyst$analysis$Analyzer$$executeSameContext(Analyzer.scala:142)
	at org.apache.spark.sql.catalyst.analysis.Analyzer.execute(Analyzer.scala:136)
	at org.apache.spark.sql.catalyst.analysis.Analyzer.execute(Analyzer.scala:103)
	at org.apache.spark.sql.catalyst.rules.RuleExecutor.$anonfun$executeAndTrack$1(RuleExecutor.scala:98)
	at org.apache.spark.sql.catalyst.QueryPlanningTracker$.withTracker(QueryPlanningTracker.scala:88)
	at org.apache.spark.sql.catalyst.rules.RuleExecutor.executeAndTrack(RuleExecutor.scala:98)
	at org.apache.spark.sql.catalyst.analysis.Analyzer.$anonfun$executeAndCheck$1(Analyzer.scala:120)
	at org.apache.spark.sql.catalyst.plans.logical.AnalysisHelper$.markInAnalyzer(AnalysisHelper.scala:201)
	at org.apache.spark.sql.catalyst.analysis.Analyzer.executeAndCheck(Analyzer.scala:119)
	at org.apache.spark.sql.hive.test.TestHiveQueryExecution.analyzed$lzycompute(TestHive.scala:606)
	at org.apache.spark.sql.hive.test.TestHiveQueryExecution.analyzed(TestHive.scala:589)
	at org.apache.spark.sql.execution.QueryExecution.assertAnalyzed(QueryExecution.scala:53)
	at org.apache.spark.sql.Dataset$.ofRows(Dataset.scala:86)
	at org.apache.spark.sql.SparkSession.table(SparkSession.scala:635)
	at org.apache.spark.sql.execution.command.DropTableCommand.run(ddl.scala:213)
	at org.apache.spark.sql.execution.command.ExecutedCommandExec.sideEffectResult$lzycompute(commands.scala:70)
	at org.apache.spark.sql.execution.command.ExecutedCommandExec.sideEffectResult(commands.scala:68)
	at org.apache.spark.sql.execution.command.ExecutedCommandExec.executeCollect(commands.scala:79)
	at org.apache.spark.sql.Dataset.$anonfun$logicalPlan$1(Dataset.scala:213)
	at org.apache.spark.sql.Dataset.$anonfun$withAction$1(Dataset.scala:3431)
	at org.apache.spark.sql.execution.SQLExecution$.$anonfun$withNewExecutionId$4(SQLExecution.scala:100)
	at org.apache.spark.sql.execution.SQLExecution$.withSQLConfPropagated(SQLExecution.scala:160)
	at org.apache.spark.sql.execution.SQLExecution$.withNewExecutionId(SQLExecution.scala:87)
	at org.apache.spark.sql.Dataset.withAction(Dataset.scala:3427)
	at org.apache.spark.sql.Dataset.<init>(Dataset.scala:213)
	at org.apache.spark.sql.Dataset$.ofRows(Dataset.scala:87)
	at org.apache.spark.sql.hive.test.TestHiveSparkSession.sql(TestHive.scala:238)
	at org.apache.spark.sql.test.SQLTestUtilsBase.$anonfun$withTable$2(SQLTestUtils.scala:291)
	at scala.collection.IndexedSeqOptimized.foreach(IndexedSeqOptimized.scala:36)
	at scala.collection.IndexedSeqOptimized.foreach$(IndexedSeqOptimized.scala:33)
	at scala.collection.mutable.WrappedArray.foreach(WrappedArray.scala:39)
	at org.apache.spark.sql.test.SQLTestUtilsBase.$anonfun$withTable$1(SQLTestUtils.scala:290)
	at org.apache.spark.util.Utils$.tryWithSafeFinally(Utils.scala:1386)
	at org.apache.spark.sql.test.SQLTestUtilsBase.withTable(SQLTestUtils.scala:290)
	at org.apache.spark.sql.test.SQLTestUtilsBase.withTable$(SQLTestUtils.scala:288)
	at org.apache.spark.sql.execution.datasources.parquet.ParquetCompatibilityTest.withTable(ParquetCompatibilityTest.scala:35)
	at org.apache.spark.sql.hive.ParquetHiveCompatibilitySuite.testParquetHiveCompatibility(ParquetHiveCompatibilitySuite.scala:47)
	at org.apache.spark.sql.hive.ParquetHiveCompatibilitySuite.$anonfun$new$7(ParquetHiveCompatibilitySuite.scala:142)
	at scala.runtime.java8.JFunction0$mcV$sp.apply(JFunction0$mcV$sp.java:23)
	at org.scalatest.OutcomeOf.outcomeOf(OutcomeOf.scala:85)
	at org.scalatest.OutcomeOf.outcomeOf$(OutcomeOf.scala:83)
	at org.scalatest.OutcomeOf$.outcomeOf(OutcomeOf.scala:104)
	at org.scalatest.Transformer.apply(Transformer.scala:22)
	at org.scalatest.Transformer.apply(Transformer.scala:20)
	at org.scalatest.FunSuiteLike$$anon$1.apply(FunSuiteLike.scala:186)
	at org.apache.spark.SparkFunSuite.withFixture(SparkFunSuite.scala:149)
	at org.scalatest.FunSuiteLike.invokeWithFixture$1(FunSuiteLike.scala:184)
	at org.scalatest.FunSuiteLike.$anonfun$runTest$1(FunSuiteLike.scala:196)
	at org.scalatest.SuperEngine.runTestImpl(Engine.scala:289)
	at org.scalatest.FunSuiteLike.runTest(FunSuiteLike.scala:196)
	at org.scalatest.FunSuiteLike.runTest$(FunSuiteLike.scala:178)
	at org.apache.spark.SparkFunSuite.org$scalatest$BeforeAndAfterEach$$super$runTest(SparkFunSuite.scala:56)
	at org.scalatest.BeforeAndAfterEach.runTest(BeforeAndAfterEach.scala:221)
	at org.scalatest.BeforeAndAfterEach.runTest$(BeforeAndAfterEach.scala:214)
	at org.apache.spark.SparkFunSuite.runTest(SparkFunSuite.scala:56)
	at org.scalatest.FunSuiteLike.$anonfun$runTests$1(FunSuiteLike.scala:229)
	at org.scalatest.SuperEngine.$anonfun$runTestsInBranch$1(Engine.scala:396)
	at scala.collection.immutable.List.foreach(List.scala:392)
	at org.scalatest.SuperEngine.traverseSubNodes$1(Engine.scala:384)
	at org.scalatest.SuperEngine.runTestsInBranch(Engine.scala:379)
	at org.scalatest.SuperEngine.runTestsImpl(Engine.scala:461)
	at org.scalatest.FunSuiteLike.runTests(FunSuiteLike.scala:229)
	at org.scalatest.FunSuiteLike.runTests$(FunSuiteLike.scala:228)
	at org.scalatest.FunSuite.runTests(FunSuite.scala:1560)
	at org.scalatest.Suite.run(Suite.scala:1147)
	at org.scalatest.Suite.run$(Suite.scala:1129)
	at org.scalatest.FunSuite.org$scalatest$FunSuiteLike$$super$run(FunSuite.scala:1560)
	at org.scalatest.FunSuiteLike.$anonfun$run$1(FunSuiteLike.scala:233)
	at org.scalatest.SuperEngine.runImpl(Engine.scala:521)
	at org.scalatest.FunSuiteLike.run(FunSuiteLike.scala:233)
	at org.scalatest.FunSuiteLike.run$(FunSuiteLike.scala:232)
	at org.apache.spark.SparkFunSuite.org$scalatest$BeforeAndAfterAll$$super$run(SparkFunSuite.scala:56)
	at org.scalatest.BeforeAndAfterAll.liftedTree1$1(BeforeAndAfterAll.scala:213)
	at org.scalatest.BeforeAndAfterAll.run(BeforeAndAfterAll.scala:210)
	at org.scalatest.BeforeAndAfterAll.run$(BeforeAndAfterAll.scala:208)
	at org.apache.spark.SparkFunSuite.run(SparkFunSuite.scala:56)
	at org.scalatest.tools.Framework.org$scalatest$tools$Framework$$runSuite(Framework.scala:314)
	at org.scalatest.tools.Framework$ScalaTestTask.execute(Framework.scala:507)
	at sbt.ForkMain$Run$2.call(ForkMain.java:296)
	at sbt.ForkMain$Run$2.call(ForkMain.java:286)
	at java.util.concurrent.FutureTask.run(FutureTask.java:266)
	at java.util.concurrent.ThreadPoolExecutor.runWorker(ThreadPoolExecutor.java:1149)
	at java.util.concurrent.ThreadPoolExecutor$Worker.run(ThreadPoolExecutor.java:624)
	at java.lang.Thread.run(Thread.java:748)
[info] - SPARK-16344: array of struct with a single field named 'array_element' (2 seconds, 869 milliseconds)
[info] Test run started
[info] Test org.apache.spark.sql.hive.JavaDataFrameSuite.testUDAF started
[info] Test org.apache.spark.sql.hive.JavaDataFrameSuite.saveTableAndQueryIt started
[info] Test run finished: 0 failed, 0 ignored, 2 total, 4.755s
[info] Test run started
[info] Test org.apache.spark.sql.hive.JavaMetastoreDataSourcesSuite.saveExternalTableAndQueryIt started
11:56:48.353 WARN org.apache.spark.sql.hive.test.TestHiveExternalCatalog: Couldn't find corresponding Hive SerDe for data source provider org.apache.spark.sql.json. Persisting data source table `default`.`javasavedtable` into Hive metastore in Spark SQL specific format, which is NOT compatible with Hive.
11:56:48.698 WARN org.apache.spark.sql.hive.test.TestHiveExternalCatalog: Couldn't find corresponding Hive SerDe for data source provider org.apache.spark.sql.json. Persisting data source table `default`.`externaltable` into Hive metastore in Spark SQL specific format, which is NOT compatible with Hive.
[info] Test org.apache.spark.sql.hive.JavaMetastoreDataSourcesSuite.saveTableAndQueryIt started
11:56:49.452 WARN org.apache.spark.sql.hive.test.TestHiveExternalCatalog: Couldn't find corresponding Hive SerDe for data source provider org.apache.spark.sql.json. Persisting data source table `default`.`javasavedtable` into Hive metastore in Spark SQL specific format, which is NOT compatible with Hive.
[info] Test org.apache.spark.sql.hive.JavaMetastoreDataSourcesSuite.saveExternalTableWithSchemaAndQueryIt started
11:56:50.108 WARN org.apache.spark.sql.hive.test.TestHiveExternalCatalog: Couldn't find corresponding Hive SerDe for data source provider org.apache.spark.sql.json. Persisting data source table `default`.`javasavedtable` into Hive metastore in Spark SQL specific format, which is NOT compatible with Hive.
11:56:50.347 WARN org.apache.spark.sql.hive.test.TestHiveExternalCatalog: Couldn't find corresponding Hive SerDe for data source provider org.apache.spark.sql.json. Persisting data source table `default`.`externaltable` into Hive metastore in Spark SQL specific format, which is NOT compatible with Hive.
[info] Test run finished: 0 failed, 0 ignored, 3 total, 2.818s
[info] ScalaTest
[info] Run completed in 2 hours, 21 minutes, 44 seconds.
[info] Total number of tests run: 2540
[info] Suites: completed 102, aborted 0
[info] Tests: succeeded 2540, failed 0, canceled 1, ignored 593, pending 0
[info] All tests passed.
[info] Passed: Total 2545, Failed 0, Errors 0, Passed 2545, Ignored 593, Canceled 1
[error] (hive-thriftserver/test:test) sbt.TestsFailedException: Tests unsuccessful
[error] Total time: 8579 s, completed Aug 16, 2019 11:57:20 AM
[error] running /home/jenkins/workspace/NewSparkPullRequestBuilder/build/sbt -Phadoop-2.7 -Pkubernetes -Phadoop-cloud -Phive -Phive-thriftserver -Pyarn -Pspark-ganglia-lgpl -Pkinesis-asl -Pmesos -Dtest.exclude.tags=org.apache.spark.tags.ExtendedHiveTest,org.apache.spark.tags.ExtendedYarnTest test ; received return code 1
Attempting to post to Github...
 > Post successful.
Build step 'Execute shell' marked build as failure
Archiving artifacts
Recording test results
Finished: FAILURE