FailedConsole Output

Skipping 19,358 KB.. Full Log
.scala:147)
	at org.apache.spark.sql.execution.datasources.FileFormat$$anon$1.apply(FileFormat.scala:132)
	at org.apache.spark.sql.execution.datasources.FileScanRDD$$anon$1.org$apache$spark$sql$execution$datasources$FileScanRDD$$anon$$readCurrentFile(FileScanRDD.scala:116)
	at org.apache.spark.sql.execution.datasources.FileScanRDD$$anon$1.nextIterator(FileScanRDD.scala:169)
	at org.apache.spark.sql.execution.datasources.FileScanRDD$$anon$1.hasNext(FileScanRDD.scala:93)
	at scala.collection.Iterator$$anon$10.hasNext(Iterator.scala:458)
	at scala.collection.Iterator$$anon$10.hasNext(Iterator.scala:458)
	at scala.collection.Iterator$$anon$10.hasNext(Iterator.scala:458)
	at org.apache.spark.util.Utils$.getIteratorSize(Utils.scala:1832)
	at org.apache.spark.rdd.RDD.$anonfun$count$1(RDD.scala:1227)
	at org.apache.spark.rdd.RDD.$anonfun$count$1$adapted(RDD.scala:1227)
	at org.apache.spark.SparkContext.$anonfun$runJob$5(SparkContext.scala:2144)
	at org.apache.spark.scheduler.ResultTask.runTask(ResultTask.scala:90)
	at org.apache.spark.scheduler.Task.run(Task.scala:127)
	at org.apache.spark.executor.Executor$TaskRunner.$anonfun$run$3(Executor.scala:425)
	at org.apache.spark.util.Utils$.tryWithSafeFinally(Utils.scala:1377)
	at org.apache.spark.executor.Executor$TaskRunner.run(Executor.scala:428)
	at java.util.concurrent.ThreadPoolExecutor.runWorker(ThreadPoolExecutor.java:1149)
	at java.util.concurrent.ThreadPoolExecutor$Worker.run(ThreadPoolExecutor.java:624)
	at java.lang.Thread.run(Thread.java:748)
Caused by: java.io.IOException: Malformed ORC file file:/home/jenkins/workspace/NewSparkPullRequestBuilder/target/tmp/spark-30958364-1b8f-48f5-a274-2d991062f586/third/part-00000-37fedab8-561c-4ddb-88d7-ff85f504536d-c000.json. Invalid postscript.
	at org.apache.hadoop.hive.ql.io.orc.ReaderImpl.ensureOrcFooter(ReaderImpl.java:250)
	at org.apache.hadoop.hive.ql.io.orc.ReaderImpl.extractMetaInfoFromFooter(ReaderImpl.java:375)
	at org.apache.hadoop.hive.ql.io.orc.ReaderImpl.<init>(ReaderImpl.java:316)
	at org.apache.hadoop.hive.ql.io.orc.OrcFile.createReader(OrcFile.java:187)
	at org.apache.spark.sql.hive.orc.OrcFileOperator$.$anonfun$getFileReader$3(OrcFileOperator.scala:76)
	... 32 more
08:24:44.780 WARN org.apache.spark.scheduler.TaskSetManager: Lost task 0.0 in stage 11841.0 (TID 21683, amp-jenkins-worker-05.amp, executor driver): org.apache.spark.SparkException: Could not read footer for file: file:/home/jenkins/workspace/NewSparkPullRequestBuilder/target/tmp/spark-30958364-1b8f-48f5-a274-2d991062f586/third/part-00000-37fedab8-561c-4ddb-88d7-ff85f504536d-c000.json
	at org.apache.spark.sql.hive.orc.OrcFileOperator$.$anonfun$getFileReader$3(OrcFileOperator.scala:83)
	at scala.collection.Iterator$$anon$10.next(Iterator.scala:459)
	at scala.collection.TraversableOnce.collectFirst(TraversableOnce.scala:148)
	at scala.collection.TraversableOnce.collectFirst$(TraversableOnce.scala:135)
	at scala.collection.AbstractIterator.collectFirst(Iterator.scala:1429)
	at org.apache.spark.sql.hive.orc.OrcFileOperator$.getFileReader(OrcFileOperator.scala:87)
	at org.apache.spark.sql.hive.orc.OrcFileOperator$.$anonfun$readSchema$1(OrcFileOperator.scala:96)
	at scala.collection.Iterator$$anon$10.next(Iterator.scala:459)
	at scala.collection.TraversableOnce.collectFirst(TraversableOnce.scala:148)
	at scala.collection.TraversableOnce.collectFirst$(TraversableOnce.scala:135)
	at scala.collection.AbstractIterator.collectFirst(Iterator.scala:1429)
	at org.apache.spark.sql.hive.orc.OrcFileOperator$.readSchema(OrcFileOperator.scala:96)
	at org.apache.spark.sql.hive.orc.OrcFileFormat.$anonfun$buildReader$2(OrcFileFormat.scala:163)
	at org.apache.spark.sql.execution.datasources.FileFormat$$anon$1.apply(FileFormat.scala:147)
	at org.apache.spark.sql.execution.datasources.FileFormat$$anon$1.apply(FileFormat.scala:132)
	at org.apache.spark.sql.execution.datasources.FileScanRDD$$anon$1.org$apache$spark$sql$execution$datasources$FileScanRDD$$anon$$readCurrentFile(FileScanRDD.scala:116)
	at org.apache.spark.sql.execution.datasources.FileScanRDD$$anon$1.nextIterator(FileScanRDD.scala:169)
	at org.apache.spark.sql.execution.datasources.FileScanRDD$$anon$1.hasNext(FileScanRDD.scala:93)
	at scala.collection.Iterator$$anon$10.hasNext(Iterator.scala:458)
	at scala.collection.Iterator$$anon$10.hasNext(Iterator.scala:458)
	at scala.collection.Iterator$$anon$10.hasNext(Iterator.scala:458)
	at org.apache.spark.util.Utils$.getIteratorSize(Utils.scala:1832)
	at org.apache.spark.rdd.RDD.$anonfun$count$1(RDD.scala:1227)
	at org.apache.spark.rdd.RDD.$anonfun$count$1$adapted(RDD.scala:1227)
	at org.apache.spark.SparkContext.$anonfun$runJob$5(SparkContext.scala:2144)
	at org.apache.spark.scheduler.ResultTask.runTask(ResultTask.scala:90)
	at org.apache.spark.scheduler.Task.run(Task.scala:127)
	at org.apache.spark.executor.Executor$TaskRunner.$anonfun$run$3(Executor.scala:425)
	at org.apache.spark.util.Utils$.tryWithSafeFinally(Utils.scala:1377)
	at org.apache.spark.executor.Executor$TaskRunner.run(Executor.scala:428)
	at java.util.concurrent.ThreadPoolExecutor.runWorker(ThreadPoolExecutor.java:1149)
	at java.util.concurrent.ThreadPoolExecutor$Worker.run(ThreadPoolExecutor.java:624)
	at java.lang.Thread.run(Thread.java:748)
Caused by: java.io.IOException: Malformed ORC file file:/home/jenkins/workspace/NewSparkPullRequestBuilder/target/tmp/spark-30958364-1b8f-48f5-a274-2d991062f586/third/part-00000-37fedab8-561c-4ddb-88d7-ff85f504536d-c000.json. Invalid postscript.
	at org.apache.hadoop.hive.ql.io.orc.ReaderImpl.ensureOrcFooter(ReaderImpl.java:250)
	at org.apache.hadoop.hive.ql.io.orc.ReaderImpl.extractMetaInfoFromFooter(ReaderImpl.java:375)
	at org.apache.hadoop.hive.ql.io.orc.ReaderImpl.<init>(ReaderImpl.java:316)
	at org.apache.hadoop.hive.ql.io.orc.OrcFile.createReader(OrcFile.java:187)
	at org.apache.spark.sql.hive.orc.OrcFileOperator$.$anonfun$getFileReader$3(OrcFileOperator.scala:76)
	... 32 more

08:24:44.781 ERROR org.apache.spark.scheduler.TaskSetManager: Task 0 in stage 11841.0 failed 1 times; aborting job
08:24:45.729 ERROR org.apache.spark.executor.Executor: Exception in task 0.0 in stage 11845.0 (TID 21687)
org.apache.spark.SparkException: Could not read footer for file: file:/home/jenkins/workspace/NewSparkPullRequestBuilder/target/tmp/spark-27a3485c-03c2-4939-9d53-2ed5d14cf06f/third/part-00000-5d95768a-f687-4e32-bfc4-5067b72b0737-c000.json
	at org.apache.spark.sql.hive.orc.OrcFileOperator$.$anonfun$getFileReader$3(OrcFileOperator.scala:83)
	at scala.collection.Iterator$$anon$10.next(Iterator.scala:459)
	at scala.collection.TraversableOnce.collectFirst(TraversableOnce.scala:148)
	at scala.collection.TraversableOnce.collectFirst$(TraversableOnce.scala:135)
	at scala.collection.AbstractIterator.collectFirst(Iterator.scala:1429)
	at org.apache.spark.sql.hive.orc.OrcFileOperator$.getFileReader(OrcFileOperator.scala:87)
	at org.apache.spark.sql.hive.orc.OrcFileOperator$.$anonfun$readSchema$1(OrcFileOperator.scala:96)
	at scala.collection.Iterator$$anon$10.next(Iterator.scala:459)
	at scala.collection.TraversableOnce.collectFirst(TraversableOnce.scala:148)
	at scala.collection.TraversableOnce.collectFirst$(TraversableOnce.scala:135)
	at scala.collection.AbstractIterator.collectFirst(Iterator.scala:1429)
	at org.apache.spark.sql.hive.orc.OrcFileOperator$.readSchema(OrcFileOperator.scala:96)
	at org.apache.spark.sql.hive.orc.OrcFileFormat.$anonfun$buildReader$2(OrcFileFormat.scala:163)
	at org.apache.spark.sql.execution.datasources.FileFormat$$anon$1.apply(FileFormat.scala:147)
	at org.apache.spark.sql.execution.datasources.FileFormat$$anon$1.apply(FileFormat.scala:132)
	at org.apache.spark.sql.execution.datasources.FileScanRDD$$anon$1.org$apache$spark$sql$execution$datasources$FileScanRDD$$anon$$readCurrentFile(FileScanRDD.scala:116)
	at org.apache.spark.sql.execution.datasources.FileScanRDD$$anon$1.nextIterator(FileScanRDD.scala:169)
	at org.apache.spark.sql.execution.datasources.FileScanRDD$$anon$1.hasNext(FileScanRDD.scala:93)
	at scala.collection.Iterator$$anon$10.hasNext(Iterator.scala:458)
	at scala.collection.Iterator$$anon$10.hasNext(Iterator.scala:458)
	at scala.collection.Iterator$$anon$10.hasNext(Iterator.scala:458)
	at org.apache.spark.util.Utils$.getIteratorSize(Utils.scala:1832)
	at org.apache.spark.rdd.RDD.$anonfun$count$1(RDD.scala:1227)
	at org.apache.spark.rdd.RDD.$anonfun$count$1$adapted(RDD.scala:1227)
	at org.apache.spark.SparkContext.$anonfun$runJob$5(SparkContext.scala:2144)
	at org.apache.spark.scheduler.ResultTask.runTask(ResultTask.scala:90)
	at org.apache.spark.scheduler.Task.run(Task.scala:127)
	at org.apache.spark.executor.Executor$TaskRunner.$anonfun$run$3(Executor.scala:425)
	at org.apache.spark.util.Utils$.tryWithSafeFinally(Utils.scala:1377)
	at org.apache.spark.executor.Executor$TaskRunner.run(Executor.scala:428)
	at java.util.concurrent.ThreadPoolExecutor.runWorker(ThreadPoolExecutor.java:1149)
	at java.util.concurrent.ThreadPoolExecutor$Worker.run(ThreadPoolExecutor.java:624)
	at java.lang.Thread.run(Thread.java:748)
Caused by: java.io.IOException: Malformed ORC file file:/home/jenkins/workspace/NewSparkPullRequestBuilder/target/tmp/spark-27a3485c-03c2-4939-9d53-2ed5d14cf06f/third/part-00000-5d95768a-f687-4e32-bfc4-5067b72b0737-c000.json. Invalid postscript.
	at org.apache.hadoop.hive.ql.io.orc.ReaderImpl.ensureOrcFooter(ReaderImpl.java:250)
	at org.apache.hadoop.hive.ql.io.orc.ReaderImpl.extractMetaInfoFromFooter(ReaderImpl.java:375)
	at org.apache.hadoop.hive.ql.io.orc.ReaderImpl.<init>(ReaderImpl.java:316)
	at org.apache.hadoop.hive.ql.io.orc.OrcFile.createReader(OrcFile.java:187)
	at org.apache.spark.sql.hive.orc.OrcFileOperator$.$anonfun$getFileReader$3(OrcFileOperator.scala:76)
	... 32 more
08:24:45.732 WARN org.apache.spark.scheduler.TaskSetManager: Lost task 0.0 in stage 11845.0 (TID 21687, amp-jenkins-worker-05.amp, executor driver): org.apache.spark.SparkException: Could not read footer for file: file:/home/jenkins/workspace/NewSparkPullRequestBuilder/target/tmp/spark-27a3485c-03c2-4939-9d53-2ed5d14cf06f/third/part-00000-5d95768a-f687-4e32-bfc4-5067b72b0737-c000.json
	at org.apache.spark.sql.hive.orc.OrcFileOperator$.$anonfun$getFileReader$3(OrcFileOperator.scala:83)
	at scala.collection.Iterator$$anon$10.next(Iterator.scala:459)
	at scala.collection.TraversableOnce.collectFirst(TraversableOnce.scala:148)
	at scala.collection.TraversableOnce.collectFirst$(TraversableOnce.scala:135)
	at scala.collection.AbstractIterator.collectFirst(Iterator.scala:1429)
	at org.apache.spark.sql.hive.orc.OrcFileOperator$.getFileReader(OrcFileOperator.scala:87)
	at org.apache.spark.sql.hive.orc.OrcFileOperator$.$anonfun$readSchema$1(OrcFileOperator.scala:96)
	at scala.collection.Iterator$$anon$10.next(Iterator.scala:459)
	at scala.collection.TraversableOnce.collectFirst(TraversableOnce.scala:148)
	at scala.collection.TraversableOnce.collectFirst$(TraversableOnce.scala:135)
	at scala.collection.AbstractIterator.collectFirst(Iterator.scala:1429)
	at org.apache.spark.sql.hive.orc.OrcFileOperator$.readSchema(OrcFileOperator.scala:96)
	at org.apache.spark.sql.hive.orc.OrcFileFormat.$anonfun$buildReader$2(OrcFileFormat.scala:163)
	at org.apache.spark.sql.execution.datasources.FileFormat$$anon$1.apply(FileFormat.scala:147)
	at org.apache.spark.sql.execution.datasources.FileFormat$$anon$1.apply(FileFormat.scala:132)
	at org.apache.spark.sql.execution.datasources.FileScanRDD$$anon$1.org$apache$spark$sql$execution$datasources$FileScanRDD$$anon$$readCurrentFile(FileScanRDD.scala:116)
	at org.apache.spark.sql.execution.datasources.FileScanRDD$$anon$1.nextIterator(FileScanRDD.scala:169)
	at org.apache.spark.sql.execution.datasources.FileScanRDD$$anon$1.hasNext(FileScanRDD.scala:93)
	at scala.collection.Iterator$$anon$10.hasNext(Iterator.scala:458)
	at scala.collection.Iterator$$anon$10.hasNext(Iterator.scala:458)
	at scala.collection.Iterator$$anon$10.hasNext(Iterator.scala:458)
	at org.apache.spark.util.Utils$.getIteratorSize(Utils.scala:1832)
	at org.apache.spark.rdd.RDD.$anonfun$count$1(RDD.scala:1227)
	at org.apache.spark.rdd.RDD.$anonfun$count$1$adapted(RDD.scala:1227)
	at org.apache.spark.SparkContext.$anonfun$runJob$5(SparkContext.scala:2144)
	at org.apache.spark.scheduler.ResultTask.runTask(ResultTask.scala:90)
	at org.apache.spark.scheduler.Task.run(Task.scala:127)
	at org.apache.spark.executor.Executor$TaskRunner.$anonfun$run$3(Executor.scala:425)
	at org.apache.spark.util.Utils$.tryWithSafeFinally(Utils.scala:1377)
	at org.apache.spark.executor.Executor$TaskRunner.run(Executor.scala:428)
	at java.util.concurrent.ThreadPoolExecutor.runWorker(ThreadPoolExecutor.java:1149)
	at java.util.concurrent.ThreadPoolExecutor$Worker.run(ThreadPoolExecutor.java:624)
	at java.lang.Thread.run(Thread.java:748)
Caused by: java.io.IOException: Malformed ORC file file:/home/jenkins/workspace/NewSparkPullRequestBuilder/target/tmp/spark-27a3485c-03c2-4939-9d53-2ed5d14cf06f/third/part-00000-5d95768a-f687-4e32-bfc4-5067b72b0737-c000.json. Invalid postscript.
	at org.apache.hadoop.hive.ql.io.orc.ReaderImpl.ensureOrcFooter(ReaderImpl.java:250)
	at org.apache.hadoop.hive.ql.io.orc.ReaderImpl.extractMetaInfoFromFooter(ReaderImpl.java:375)
	at org.apache.hadoop.hive.ql.io.orc.ReaderImpl.<init>(ReaderImpl.java:316)
	at org.apache.hadoop.hive.ql.io.orc.OrcFile.createReader(OrcFile.java:187)
	at org.apache.spark.sql.hive.orc.OrcFileOperator$.$anonfun$getFileReader$3(OrcFileOperator.scala:76)
	... 32 more

08:24:45.732 ERROR org.apache.spark.scheduler.TaskSetManager: Task 0 in stage 11845.0 failed 1 times; aborting job
08:24:46.997 ERROR org.apache.spark.executor.Executor: Exception in task 0.0 in stage 11850.0 (TID 21692)
org.apache.spark.SparkException: Could not read footer for file: file:/home/jenkins/workspace/NewSparkPullRequestBuilder/target/tmp/spark-6cd96bdb-73b7-49a3-a883-3ddabc84c565/first/part-00000-e168eaf0-6489-4255-ab77-af0371464f65-c000.json
	at org.apache.spark.sql.hive.orc.OrcFileOperator$.$anonfun$getFileReader$3(OrcFileOperator.scala:83)
	at scala.collection.Iterator$$anon$10.next(Iterator.scala:459)
	at scala.collection.TraversableOnce.collectFirst(TraversableOnce.scala:148)
	at scala.collection.TraversableOnce.collectFirst$(TraversableOnce.scala:135)
	at scala.collection.AbstractIterator.collectFirst(Iterator.scala:1429)
	at org.apache.spark.sql.hive.orc.OrcFileOperator$.getFileReader(OrcFileOperator.scala:87)
	at org.apache.spark.sql.hive.orc.OrcFileOperator$.$anonfun$readSchema$1(OrcFileOperator.scala:96)
	at scala.collection.Iterator$$anon$10.next(Iterator.scala:459)
	at scala.collection.TraversableOnce.collectFirst(TraversableOnce.scala:148)
	at scala.collection.TraversableOnce.collectFirst$(TraversableOnce.scala:135)
	at scala.collection.AbstractIterator.collectFirst(Iterator.scala:1429)
	at org.apache.spark.sql.hive.orc.OrcFileOperator$.readSchema(OrcFileOperator.scala:96)
	at org.apache.spark.sql.hive.orc.OrcFileFormat.$anonfun$buildReader$2(OrcFileFormat.scala:163)
	at org.apache.spark.sql.execution.datasources.FileFormat$$anon$1.apply(FileFormat.scala:147)
	at org.apache.spark.sql.execution.datasources.FileFormat$$anon$1.apply(FileFormat.scala:132)
	at org.apache.spark.sql.execution.datasources.FileScanRDD$$anon$1.org$apache$spark$sql$execution$datasources$FileScanRDD$$anon$$readCurrentFile(FileScanRDD.scala:116)
	at org.apache.spark.sql.execution.datasources.FileScanRDD$$anon$1.nextIterator(FileScanRDD.scala:169)
	at org.apache.spark.sql.execution.datasources.FileScanRDD$$anon$1.hasNext(FileScanRDD.scala:93)
	at scala.collection.Iterator$$anon$10.hasNext(Iterator.scala:458)
	at org.apache.spark.sql.catalyst.expressions.GeneratedClass$GeneratedIteratorForCodegenStage1.agg_doAggregateWithoutKey_0$(generated.java:33)
	at org.apache.spark.sql.catalyst.expressions.GeneratedClass$GeneratedIteratorForCodegenStage1.processNext(generated.java:63)
	at org.apache.spark.sql.execution.BufferedRowIterator.hasNext(BufferedRowIterator.java:43)
	at org.apache.spark.sql.execution.WholeStageCodegenExec$$anon$1.hasNext(WholeStageCodegenExec.scala:726)
	at scala.collection.Iterator$$anon$10.hasNext(Iterator.scala:458)
	at org.apache.spark.shuffle.sort.BypassMergeSortShuffleWriter.write(BypassMergeSortShuffleWriter.java:132)
	at org.apache.spark.shuffle.ShuffleWriteProcessor.write(ShuffleWriteProcessor.scala:59)
	at org.apache.spark.scheduler.ShuffleMapTask.runTask(ShuffleMapTask.scala:99)
	at org.apache.spark.scheduler.ShuffleMapTask.runTask(ShuffleMapTask.scala:52)
	at org.apache.spark.scheduler.Task.run(Task.scala:127)
	at org.apache.spark.executor.Executor$TaskRunner.$anonfun$run$3(Executor.scala:425)
	at org.apache.spark.util.Utils$.tryWithSafeFinally(Utils.scala:1377)
	at org.apache.spark.executor.Executor$TaskRunner.run(Executor.scala:428)
	at java.util.concurrent.ThreadPoolExecutor.runWorker(ThreadPoolExecutor.java:1149)
	at java.util.concurrent.ThreadPoolExecutor$Worker.run(ThreadPoolExecutor.java:624)
	at java.lang.Thread.run(Thread.java:748)
Caused by: java.io.IOException: Malformed ORC file file:/home/jenkins/workspace/NewSparkPullRequestBuilder/target/tmp/spark-6cd96bdb-73b7-49a3-a883-3ddabc84c565/first/part-00000-e168eaf0-6489-4255-ab77-af0371464f65-c000.json. Invalid postscript.
	at org.apache.hadoop.hive.ql.io.orc.ReaderImpl.ensureOrcFooter(ReaderImpl.java:250)
	at org.apache.hadoop.hive.ql.io.orc.ReaderImpl.extractMetaInfoFromFooter(ReaderImpl.java:375)
	at org.apache.hadoop.hive.ql.io.orc.ReaderImpl.<init>(ReaderImpl.java:316)
	at org.apache.hadoop.hive.ql.io.orc.OrcFile.createReader(OrcFile.java:187)
	at org.apache.spark.sql.hive.orc.OrcFileOperator$.$anonfun$getFileReader$3(OrcFileOperator.scala:76)
	... 34 more
08:24:47.006 WARN org.apache.spark.scheduler.TaskSetManager: Lost task 0.0 in stage 11850.0 (TID 21692, amp-jenkins-worker-05.amp, executor driver): org.apache.spark.SparkException: Could not read footer for file: file:/home/jenkins/workspace/NewSparkPullRequestBuilder/target/tmp/spark-6cd96bdb-73b7-49a3-a883-3ddabc84c565/first/part-00000-e168eaf0-6489-4255-ab77-af0371464f65-c000.json
	at org.apache.spark.sql.hive.orc.OrcFileOperator$.$anonfun$getFileReader$3(OrcFileOperator.scala:83)
	at scala.collection.Iterator$$anon$10.next(Iterator.scala:459)
	at scala.collection.TraversableOnce.collectFirst(TraversableOnce.scala:148)
	at scala.collection.TraversableOnce.collectFirst$(TraversableOnce.scala:135)
	at scala.collection.AbstractIterator.collectFirst(Iterator.scala:1429)
	at org.apache.spark.sql.hive.orc.OrcFileOperator$.getFileReader(OrcFileOperator.scala:87)
	at org.apache.spark.sql.hive.orc.OrcFileOperator$.$anonfun$readSchema$1(OrcFileOperator.scala:96)
	at scala.collection.Iterator$$anon$10.next(Iterator.scala:459)
	at scala.collection.TraversableOnce.collectFirst(TraversableOnce.scala:148)
	at scala.collection.TraversableOnce.collectFirst$(TraversableOnce.scala:135)
	at scala.collection.AbstractIterator.collectFirst(Iterator.scala:1429)
	at org.apache.spark.sql.hive.orc.OrcFileOperator$.readSchema(OrcFileOperator.scala:96)
	at org.apache.spark.sql.hive.orc.OrcFileFormat.$anonfun$buildReader$2(OrcFileFormat.scala:163)
	at org.apache.spark.sql.execution.datasources.FileFormat$$anon$1.apply(FileFormat.scala:147)
	at org.apache.spark.sql.execution.datasources.FileFormat$$anon$1.apply(FileFormat.scala:132)
	at org.apache.spark.sql.execution.datasources.FileScanRDD$$anon$1.org$apache$spark$sql$execution$datasources$FileScanRDD$$anon$$readCurrentFile(FileScanRDD.scala:116)
	at org.apache.spark.sql.execution.datasources.FileScanRDD$$anon$1.nextIterator(FileScanRDD.scala:169)
	at org.apache.spark.sql.execution.datasources.FileScanRDD$$anon$1.hasNext(FileScanRDD.scala:93)
	at scala.collection.Iterator$$anon$10.hasNext(Iterator.scala:458)
	at org.apache.spark.sql.catalyst.expressions.GeneratedClass$GeneratedIteratorForCodegenStage1.agg_doAggregateWithoutKey_0$(generated.java:33)
	at org.apache.spark.sql.catalyst.expressions.GeneratedClass$GeneratedIteratorForCodegenStage1.processNext(generated.java:63)
	at org.apache.spark.sql.execution.BufferedRowIterator.hasNext(BufferedRowIterator.java:43)
	at org.apache.spark.sql.execution.WholeStageCodegenExec$$anon$1.hasNext(WholeStageCodegenExec.scala:726)
	at scala.collection.Iterator$$anon$10.hasNext(Iterator.scala:458)
	at org.apache.spark.shuffle.sort.BypassMergeSortShuffleWriter.write(BypassMergeSortShuffleWriter.java:132)
	at org.apache.spark.shuffle.ShuffleWriteProcessor.write(ShuffleWriteProcessor.scala:59)
	at org.apache.spark.scheduler.ShuffleMapTask.runTask(ShuffleMapTask.scala:99)
	at org.apache.spark.scheduler.ShuffleMapTask.runTask(ShuffleMapTask.scala:52)
	at org.apache.spark.scheduler.Task.run(Task.scala:127)
	at org.apache.spark.executor.Executor$TaskRunner.$anonfun$run$3(Executor.scala:425)
	at org.apache.spark.util.Utils$.tryWithSafeFinally(Utils.scala:1377)
	at org.apache.spark.executor.Executor$TaskRunner.run(Executor.scala:428)
	at java.util.concurrent.ThreadPoolExecutor.runWorker(ThreadPoolExecutor.java:1149)
	at java.util.concurrent.ThreadPoolExecutor$Worker.run(ThreadPoolExecutor.java:624)
	at java.lang.Thread.run(Thread.java:748)
Caused by: java.io.IOException: Malformed ORC file file:/home/jenkins/workspace/NewSparkPullRequestBuilder/target/tmp/spark-6cd96bdb-73b7-49a3-a883-3ddabc84c565/first/part-00000-e168eaf0-6489-4255-ab77-af0371464f65-c000.json. Invalid postscript.
	at org.apache.hadoop.hive.ql.io.orc.ReaderImpl.ensureOrcFooter(ReaderImpl.java:250)
	at org.apache.hadoop.hive.ql.io.orc.ReaderImpl.extractMetaInfoFromFooter(ReaderImpl.java:375)
	at org.apache.hadoop.hive.ql.io.orc.ReaderImpl.<init>(ReaderImpl.java:316)
	at org.apache.hadoop.hive.ql.io.orc.OrcFile.createReader(OrcFile.java:187)
	at org.apache.spark.sql.hive.orc.OrcFileOperator$.$anonfun$getFileReader$3(OrcFileOperator.scala:76)
	... 34 more

08:24:47.007 ERROR org.apache.spark.scheduler.TaskSetManager: Task 0 in stage 11850.0 failed 1 times; aborting job
[info] - Enabling/disabling ignoreCorruptFiles (6 seconds, 585 milliseconds)
[info] - SPARK-27160 Predicate pushdown correctness on DecimalType for ORC (1 second, 73 milliseconds)
[info] - SPARK-8501: Avoids discovery schema from empty ORC files (896 milliseconds)
[info] - Verify the ORC conversion parameter: CONVERT_METASTORE_ORC (1 second, 944 milliseconds)
[info] - converted ORC table supports resolving mixed case field (1 second, 383 milliseconds)
[info] - SPARK-20728 Make ORCFileFormat configurable between sql/hive and sql/core (377 milliseconds)
[info] - SPARK-22267 Spark SQL incorrectly reads ORC files when column order is different (1 second, 302 milliseconds)
[info] - SPARK-19809 NullPointerException on zero-size ORC file (548 milliseconds)
[info] - SPARK-23340 Empty float/double array columns raise EOFException !!! IGNORED !!!
[info] - SPARK-26437 Can not query decimal type when value is 0 !!! CANCELED !!! (25 milliseconds)
[info]   org.apache.spark.sql.hive.HiveUtils.isHive23 was false bad test: This bug fixed by HIVE-13083(Hive 2.0.1) (HiveOrcQuerySuite.scala:227)
[info]   org.scalatest.exceptions.TestCanceledException:
[info]   at org.scalatest.Assertions.newTestCanceledException(Assertions.scala:533)
[info]   at org.scalatest.Assertions.newTestCanceledException$(Assertions.scala:532)
[info]   at org.scalatest.FunSuite.newTestCanceledException(FunSuite.scala:1560)
[info]   at org.scalatest.Assertions$AssertionsHelper.macroAssume(Assertions.scala:518)
[info]   at org.apache.spark.sql.hive.orc.HiveOrcQuerySuite.$anonfun$new$44(HiveOrcQuerySuite.scala:227)
[info]   at scala.runtime.java8.JFunction0$mcV$sp.apply(JFunction0$mcV$sp.java:23)
[info]   at org.scalatest.OutcomeOf.outcomeOf(OutcomeOf.scala:85)
[info]   at org.scalatest.OutcomeOf.outcomeOf$(OutcomeOf.scala:83)
[info]   at org.scalatest.OutcomeOf$.outcomeOf(OutcomeOf.scala:104)
[info]   at org.scalatest.Transformer.apply(Transformer.scala:22)
[info]   at org.scalatest.Transformer.apply(Transformer.scala:20)
[info]   at org.scalatest.FunSuiteLike$$anon$1.apply(FunSuiteLike.scala:186)
[info]   at org.apache.spark.SparkFunSuite.withFixture(SparkFunSuite.scala:149)
[info]   at org.scalatest.FunSuiteLike.invokeWithFixture$1(FunSuiteLike.scala:184)
[info]   at org.scalatest.FunSuiteLike.$anonfun$runTest$1(FunSuiteLike.scala:196)
[info]   at org.scalatest.SuperEngine.runTestImpl(Engine.scala:286)
[info]   at org.scalatest.FunSuiteLike.runTest(FunSuiteLike.scala:196)
[info]   at org.scalatest.FunSuiteLike.runTest$(FunSuiteLike.scala:178)
[info]   at org.apache.spark.SparkFunSuite.org$scalatest$BeforeAndAfterEach$$super$runTest(SparkFunSuite.scala:56)
[info]   at org.scalatest.BeforeAndAfterEach.runTest(BeforeAndAfterEach.scala:221)
[info]   at org.scalatest.BeforeAndAfterEach.runTest$(BeforeAndAfterEach.scala:214)
[info]   at org.apache.spark.SparkFunSuite.runTest(SparkFunSuite.scala:56)
[info]   at org.scalatest.FunSuiteLike.$anonfun$runTests$1(FunSuiteLike.scala:229)
[info]   at org.scalatest.SuperEngine.$anonfun$runTestsInBranch$1(Engine.scala:393)
[info]   at scala.collection.immutable.List.foreach(List.scala:392)
[info]   at org.scalatest.SuperEngine.traverseSubNodes$1(Engine.scala:381)
[info]   at org.scalatest.SuperEngine.runTestsInBranch(Engine.scala:376)
[info]   at org.scalatest.SuperEngine.runTestsImpl(Engine.scala:458)
[info]   at org.scalatest.FunSuiteLike.runTests(FunSuiteLike.scala:229)
[info]   at org.scalatest.FunSuiteLike.runTests$(FunSuiteLike.scala:228)
[info]   at org.scalatest.FunSuite.runTests(FunSuite.scala:1560)
[info]   at org.scalatest.Suite.run(Suite.scala:1124)
[info]   at org.scalatest.Suite.run$(Suite.scala:1106)
[info]   at org.scalatest.FunSuite.org$scalatest$FunSuiteLike$$super$run(FunSuite.scala:1560)
[info]   at org.scalatest.FunSuiteLike.$anonfun$run$1(FunSuiteLike.scala:233)
[info]   at org.scalatest.SuperEngine.runImpl(Engine.scala:518)
[info]   at org.scalatest.FunSuiteLike.run(FunSuiteLike.scala:233)
[info]   at org.scalatest.FunSuiteLike.run$(FunSuiteLike.scala:232)
[info]   at org.apache.spark.SparkFunSuite.org$scalatest$BeforeAndAfterAll$$super$run(SparkFunSuite.scala:56)
[info]   at org.scalatest.BeforeAndAfterAll.liftedTree1$1(BeforeAndAfterAll.scala:213)
[info]   at org.scalatest.BeforeAndAfterAll.run(BeforeAndAfterAll.scala:210)
[info]   at org.scalatest.BeforeAndAfterAll.run$(BeforeAndAfterAll.scala:208)
[info]   at org.apache.spark.SparkFunSuite.run(SparkFunSuite.scala:56)
[info]   at org.scalatest.tools.Framework.org$scalatest$tools$Framework$$runSuite(Framework.scala:317)
[info]   at org.scalatest.tools.Framework$ScalaTestTask.execute(Framework.scala:510)
[info]   at sbt.ForkMain$Run$2.call(ForkMain.java:296)
[info]   at sbt.ForkMain$Run$2.call(ForkMain.java:286)
[info]   at java.util.concurrent.FutureTask.run(FutureTask.java:266)
[info]   at java.util.concurrent.ThreadPoolExecutor.runWorker(ThreadPoolExecutor.java:1149)
[info]   at java.util.concurrent.ThreadPoolExecutor$Worker.run(ThreadPoolExecutor.java:624)
[info]   at java.lang.Thread.run(Thread.java:748)
08:24:54.646 WARN org.apache.hadoop.hive.metastore.HiveMetaStore: Location: file:/home/jenkins/workspace/NewSparkPullRequestBuilder/target/tmp/warehouse-b25b96d9-d545-494e-8f29-c5daffd5d416/dummy_orc_partitioned specified for non-external table:dummy_orc_partitioned
08:24:55.706 WARN org.apache.hadoop.hive.metastore.HiveMetaStore: Location: file:/home/jenkins/workspace/NewSparkPullRequestBuilder/target/tmp/warehouse-b25b96d9-d545-494e-8f29-c5daffd5d416/dummy_orc_partitioned specified for non-external table:dummy_orc_partitioned
[info] - SPARK-28573 ORC conversation could be applied for partitioned table insertion (2 seconds, 337 milliseconds)
[info] HiveOrcPartitionDiscoverySuite:
[info] - read partitioned table - normal case (1 second, 697 milliseconds)
[info] - read partitioned table - with nulls (1 second, 634 milliseconds)
[info] - SPARK-27162: handle pathfilter configuration correctly (815 milliseconds)
[info] PruneFileSourcePartitionsSuite:
[info] - PruneFileSourcePartitions should not change the output of LogicalRelation (197 milliseconds)
[info] - SPARK-20986 Reset table's statistics after PruneFileSourcePartitions rule (1 second, 165 milliseconds)
[info] - SPARK-26576 Broadcast hint not applied to partitioned table (788 milliseconds)
[info] HiveOrcFilterSuite:
[info] - filter pushdown - integer (712 milliseconds)
[info] - filter pushdown - long (663 milliseconds)
[info] - filter pushdown - float (714 milliseconds)
[info] - filter pushdown - double (765 milliseconds)
[info] - filter pushdown - string (699 milliseconds)
[info] - filter pushdown - boolean (678 milliseconds)
[info] - filter pushdown - decimal (789 milliseconds)
[info] - filter pushdown - timestamp (667 milliseconds)
[info] - filter pushdown - combinations with logical operators (488 milliseconds)
[info] - no filter pushdown - non-supported types (1 second, 520 milliseconds)
[info] - SPARK-12218 and SPARK-25699 Converting conjunctions into ORC SearchArguments (4 milliseconds)
[info] - SPARK-27699 Converting disjunctions into ORC SearchArguments (2 milliseconds)
[info] ParquetHiveCompatibilitySuite:
08:25:12.902 WARN org.apache.spark.sql.execution.command.DropTableCommand: org.apache.spark.sql.AnalysisException: Path does not exist: file:/home/jenkins/workspace/NewSparkPullRequestBuilder/target/tmp/spark-4c3f8cd4-eac5-4b94-82eb-7ad47afac5df;
org.apache.spark.sql.AnalysisException: Path does not exist: file:/home/jenkins/workspace/NewSparkPullRequestBuilder/target/tmp/spark-4c3f8cd4-eac5-4b94-82eb-7ad47afac5df;
	at org.apache.spark.sql.execution.datasources.DataSource$.$anonfun$checkAndGlobPathIfNecessary$1(DataSource.scala:754)
	at scala.collection.TraversableLike.$anonfun$flatMap$1(TraversableLike.scala:245)
	at scala.collection.immutable.List.foreach(List.scala:392)
	at scala.collection.TraversableLike.flatMap(TraversableLike.scala:245)
	at scala.collection.TraversableLike.flatMap$(TraversableLike.scala:242)
	at scala.collection.immutable.List.flatMap(List.scala:355)
	at org.apache.spark.sql.execution.datasources.DataSource$.checkAndGlobPathIfNecessary(DataSource.scala:741)
	at org.apache.spark.sql.execution.datasources.DataSource.checkAndGlobPathIfNecessary(DataSource.scala:570)
	at org.apache.spark.sql.execution.datasources.DataSource.resolveRelation(DataSource.scala:393)
	at org.apache.spark.sql.hive.HiveMetastoreCatalog.$anonfun$convertToLogicalRelation$5(HiveMetastoreCatalog.scala:248)
	at scala.Option.getOrElse(Option.scala:189)
	at org.apache.spark.sql.hive.HiveMetastoreCatalog.$anonfun$convertToLogicalRelation$4(HiveMetastoreCatalog.scala:238)
	at org.apache.spark.sql.hive.HiveMetastoreCatalog.withTableCreationLock(HiveMetastoreCatalog.scala:58)
	at org.apache.spark.sql.hive.HiveMetastoreCatalog.convertToLogicalRelation(HiveMetastoreCatalog.scala:231)
	at org.apache.spark.sql.hive.HiveMetastoreCatalog.convert(HiveMetastoreCatalog.scala:137)
	at org.apache.spark.sql.hive.RelationConversions$$anonfun$apply$4.applyOrElse(HiveStrategies.scala:220)
	at org.apache.spark.sql.hive.RelationConversions$$anonfun$apply$4.applyOrElse(HiveStrategies.scala:207)
	at org.apache.spark.sql.catalyst.plans.logical.AnalysisHelper.$anonfun$resolveOperatorsDown$2(AnalysisHelper.scala:108)
	at org.apache.spark.sql.catalyst.trees.CurrentOrigin$.withOrigin(TreeNode.scala:72)
	at org.apache.spark.sql.catalyst.plans.logical.AnalysisHelper.$anonfun$resolveOperatorsDown$1(AnalysisHelper.scala:108)
	at org.apache.spark.sql.catalyst.plans.logical.AnalysisHelper$.allowInvokingTransformsInAnalyzer(AnalysisHelper.scala:194)
	at org.apache.spark.sql.catalyst.plans.logical.AnalysisHelper.resolveOperatorsDown(AnalysisHelper.scala:106)
	at org.apache.spark.sql.catalyst.plans.logical.AnalysisHelper.resolveOperatorsDown$(AnalysisHelper.scala:104)
	at org.apache.spark.sql.catalyst.plans.logical.LogicalPlan.resolveOperatorsDown(LogicalPlan.scala:29)
	at org.apache.spark.sql.catalyst.plans.logical.AnalysisHelper.$anonfun$resolveOperatorsDown$4(AnalysisHelper.scala:113)
	at org.apache.spark.sql.catalyst.trees.TreeNode.$anonfun$mapChildren$1(TreeNode.scala:376)
	at org.apache.spark.sql.catalyst.trees.TreeNode.mapProductIterator(TreeNode.scala:214)
	at org.apache.spark.sql.catalyst.trees.TreeNode.mapChildren(TreeNode.scala:374)
	at org.apache.spark.sql.catalyst.trees.TreeNode.mapChildren(TreeNode.scala:327)
	at org.apache.spark.sql.catalyst.plans.logical.AnalysisHelper.$anonfun$resolveOperatorsDown$1(AnalysisHelper.scala:113)
	at org.apache.spark.sql.catalyst.plans.logical.AnalysisHelper$.allowInvokingTransformsInAnalyzer(AnalysisHelper.scala:194)
	at org.apache.spark.sql.catalyst.plans.logical.AnalysisHelper.resolveOperatorsDown(AnalysisHelper.scala:106)
	at org.apache.spark.sql.catalyst.plans.logical.AnalysisHelper.resolveOperatorsDown$(AnalysisHelper.scala:104)
	at org.apache.spark.sql.catalyst.plans.logical.LogicalPlan.resolveOperatorsDown(LogicalPlan.scala:29)
	at org.apache.spark.sql.catalyst.plans.logical.AnalysisHelper.resolveOperators(AnalysisHelper.scala:73)
	at org.apache.spark.sql.catalyst.plans.logical.AnalysisHelper.resolveOperators$(AnalysisHelper.scala:72)
	at org.apache.spark.sql.catalyst.plans.logical.LogicalPlan.resolveOperators(LogicalPlan.scala:29)
	at org.apache.spark.sql.hive.RelationConversions.apply(HiveStrategies.scala:207)
	at org.apache.spark.sql.hive.RelationConversions.apply(HiveStrategies.scala:191)
	at org.apache.spark.sql.catalyst.rules.RuleExecutor.$anonfun$execute$2(RuleExecutor.scala:130)
	at scala.collection.IndexedSeqOptimized.foldLeft(IndexedSeqOptimized.scala:60)
	at scala.collection.IndexedSeqOptimized.foldLeft$(IndexedSeqOptimized.scala:68)
	at scala.collection.mutable.ArrayBuffer.foldLeft(ArrayBuffer.scala:49)
	at org.apache.spark.sql.catalyst.rules.RuleExecutor.$anonfun$execute$1(RuleExecutor.scala:127)
	at org.apache.spark.sql.catalyst.rules.RuleExecutor.$anonfun$execute$1$adapted(RuleExecutor.scala:119)
	at scala.collection.immutable.List.foreach(List.scala:392)
	at org.apache.spark.sql.catalyst.rules.RuleExecutor.execute(RuleExecutor.scala:119)
	at org.apache.spark.sql.catalyst.analysis.Analyzer.org$apache$spark$sql$catalyst$analysis$Analyzer$$executeSameContext(Analyzer.scala:168)
	at org.apache.spark.sql.catalyst.analysis.Analyzer.execute(Analyzer.scala:162)
	at org.apache.spark.sql.catalyst.analysis.Analyzer.execute(Analyzer.scala:122)
	at org.apache.spark.sql.catalyst.rules.RuleExecutor.$anonfun$executeAndTrack$1(RuleExecutor.scala:98)
	at org.apache.spark.sql.catalyst.QueryPlanningTracker$.withTracker(QueryPlanningTracker.scala:88)
	at org.apache.spark.sql.catalyst.rules.RuleExecutor.executeAndTrack(RuleExecutor.scala:98)
	at org.apache.spark.sql.catalyst.analysis.Analyzer.$anonfun$executeAndCheck$1(Analyzer.scala:146)
	at org.apache.spark.sql.catalyst.plans.logical.AnalysisHelper$.markInAnalyzer(AnalysisHelper.scala:201)
	at org.apache.spark.sql.catalyst.analysis.Analyzer.executeAndCheck(Analyzer.scala:145)
	at org.apache.spark.sql.hive.test.TestHiveQueryExecution.analyzed$lzycompute(TestHive.scala:606)
	at org.apache.spark.sql.hive.test.TestHiveQueryExecution.analyzed(TestHive.scala:589)
	at org.apache.spark.sql.execution.QueryExecution.assertAnalyzed(QueryExecution.scala:55)
	at org.apache.spark.sql.Dataset$.ofRows(Dataset.scala:87)
	at org.apache.spark.sql.SparkSession.table(SparkSession.scala:589)
	at org.apache.spark.sql.execution.command.DropTableCommand.run(ddl.scala:235)
	at org.apache.spark.sql.execution.command.ExecutedCommandExec.sideEffectResult$lzycompute(commands.scala:71)
	at org.apache.spark.sql.execution.command.ExecutedCommandExec.sideEffectResult(commands.scala:69)
	at org.apache.spark.sql.execution.command.ExecutedCommandExec.executeCollect(commands.scala:80)
	at org.apache.spark.sql.Dataset.$anonfun$logicalPlan$1(Dataset.scala:226)
	at org.apache.spark.sql.Dataset.$anonfun$withAction$1(Dataset.scala:3407)
	at org.apache.spark.sql.execution.SQLExecution$.$anonfun$withNewExecutionId$4(SQLExecution.scala:100)
	at org.apache.spark.sql.execution.SQLExecution$.withSQLConfPropagated(SQLExecution.scala:160)
	at org.apache.spark.sql.execution.SQLExecution$.withNewExecutionId(SQLExecution.scala:87)
	at org.apache.spark.sql.Dataset.withAction(Dataset.scala:3403)
	at org.apache.spark.sql.Dataset.<init>(Dataset.scala:226)
	at org.apache.spark.sql.Dataset$.ofRows(Dataset.scala:88)
	at org.apache.spark.sql.hive.test.TestHiveSparkSession.sql(TestHive.scala:238)
	at org.apache.spark.sql.test.SQLTestUtilsBase.$anonfun$withTable$2(SQLTestUtils.scala:291)
	at scala.collection.IndexedSeqOptimized.foreach(IndexedSeqOptimized.scala:36)
	at scala.collection.IndexedSeqOptimized.foreach$(IndexedSeqOptimized.scala:33)
	at scala.collection.mutable.WrappedArray.foreach(WrappedArray.scala:38)
	at org.apache.spark.sql.test.SQLTestUtilsBase.$anonfun$withTable$1(SQLTestUtils.scala:290)
	at org.apache.spark.util.Utils$.tryWithSafeFinally(Utils.scala:1386)
	at org.apache.spark.sql.test.SQLTestUtilsBase.withTable(SQLTestUtils.scala:290)
	at org.apache.spark.sql.test.SQLTestUtilsBase.withTable$(SQLTestUtils.scala:288)
	at org.apache.spark.sql.execution.datasources.parquet.ParquetCompatibilityTest.withTable(ParquetCompatibilityTest.scala:35)
	at org.apache.spark.sql.hive.ParquetHiveCompatibilitySuite.testParquetHiveCompatibility(ParquetHiveCompatibilitySuite.scala:47)
	at org.apache.spark.sql.hive.ParquetHiveCompatibilitySuite.$anonfun$new$1(ParquetHiveCompatibilitySuite.scala:94)
	at scala.runtime.java8.JFunction0$mcV$sp.apply(JFunction0$mcV$sp.java:23)
	at org.scalatest.OutcomeOf.outcomeOf(OutcomeOf.scala:85)
	at org.scalatest.OutcomeOf.outcomeOf$(OutcomeOf.scala:83)
	at org.scalatest.OutcomeOf$.outcomeOf(OutcomeOf.scala:104)
	at org.scalatest.Transformer.apply(Transformer.scala:22)
	at org.scalatest.Transformer.apply(Transformer.scala:20)
	at org.scalatest.FunSuiteLike$$anon$1.apply(FunSuiteLike.scala:186)
	at org.apache.spark.SparkFunSuite.withFixture(SparkFunSuite.scala:149)
	at org.scalatest.FunSuiteLike.invokeWithFixture$1(FunSuiteLike.scala:184)
	at org.scalatest.FunSuiteLike.$anonfun$runTest$1(FunSuiteLike.scala:196)
	at org.scalatest.SuperEngine.runTestImpl(Engine.scala:286)
	at org.scalatest.FunSuiteLike.runTest(FunSuiteLike.scala:196)
	at org.scalatest.FunSuiteLike.runTest$(FunSuiteLike.scala:178)
	at org.apache.spark.SparkFunSuite.org$scalatest$BeforeAndAfterEach$$super$runTest(SparkFunSuite.scala:56)
	at org.scalatest.BeforeAndAfterEach.runTest(BeforeAndAfterEach.scala:221)
	at org.scalatest.BeforeAndAfterEach.runTest$(BeforeAndAfterEach.scala:214)
	at org.apache.spark.SparkFunSuite.runTest(SparkFunSuite.scala:56)
	at org.scalatest.FunSuiteLike.$anonfun$runTests$1(FunSuiteLike.scala:229)
	at org.scalatest.SuperEngine.$anonfun$runTestsInBranch$1(Engine.scala:393)
	at scala.collection.immutable.List.foreach(List.scala:392)
	at org.scalatest.SuperEngine.traverseSubNodes$1(Engine.scala:381)
	at org.scalatest.SuperEngine.runTestsInBranch(Engine.scala:376)
	at org.scalatest.SuperEngine.runTestsImpl(Engine.scala:458)
	at org.scalatest.FunSuiteLike.runTests(FunSuiteLike.scala:229)
	at org.scalatest.FunSuiteLike.runTests$(FunSuiteLike.scala:228)
	at org.scalatest.FunSuite.runTests(FunSuite.scala:1560)
	at org.scalatest.Suite.run(Suite.scala:1124)
	at org.scalatest.Suite.run$(Suite.scala:1106)
	at org.scalatest.FunSuite.org$scalatest$FunSuiteLike$$super$run(FunSuite.scala:1560)
	at org.scalatest.FunSuiteLike.$anonfun$run$1(FunSuiteLike.scala:233)
	at org.scalatest.SuperEngine.runImpl(Engine.scala:518)
	at org.scalatest.FunSuiteLike.run(FunSuiteLike.scala:233)
	at org.scalatest.FunSuiteLike.run$(FunSuiteLike.scala:232)
	at org.apache.spark.SparkFunSuite.org$scalatest$BeforeAndAfterAll$$super$run(SparkFunSuite.scala:56)
	at org.scalatest.BeforeAndAfterAll.liftedTree1$1(BeforeAndAfterAll.scala:213)
	at org.scalatest.BeforeAndAfterAll.run(BeforeAndAfterAll.scala:210)
	at org.scalatest.BeforeAndAfterAll.run$(BeforeAndAfterAll.scala:208)
	at org.apache.spark.SparkFunSuite.run(SparkFunSuite.scala:56)
	at org.scalatest.tools.Framework.org$scalatest$tools$Framework$$runSuite(Framework.scala:317)
	at org.scalatest.tools.Framework$ScalaTestTask.execute(Framework.scala:510)
	at sbt.ForkMain$Run$2.call(ForkMain.java:296)
	at sbt.ForkMain$Run$2.call(ForkMain.java:286)
	at java.util.concurrent.FutureTask.run(FutureTask.java:266)
	at java.util.concurrent.ThreadPoolExecutor.runWorker(ThreadPoolExecutor.java:1149)
	at java.util.concurrent.ThreadPoolExecutor$Worker.run(ThreadPoolExecutor.java:624)
	at java.lang.Thread.run(Thread.java:748)
[info] - simple primitives (1 second, 450 milliseconds)
08:25:14.152 WARN org.apache.spark.sql.execution.command.DropTableCommand: org.apache.spark.sql.AnalysisException: Path does not exist: file:/home/jenkins/workspace/NewSparkPullRequestBuilder/target/tmp/spark-b5d567f3-cc03-42e6-8076-c8ab13c849a5;
org.apache.spark.sql.AnalysisException: Path does not exist: file:/home/jenkins/workspace/NewSparkPullRequestBuilder/target/tmp/spark-b5d567f3-cc03-42e6-8076-c8ab13c849a5;
	at org.apache.spark.sql.execution.datasources.DataSource$.$anonfun$checkAndGlobPathIfNecessary$1(DataSource.scala:754)
	at scala.collection.TraversableLike.$anonfun$flatMap$1(TraversableLike.scala:245)
	at scala.collection.immutable.List.foreach(List.scala:392)
	at scala.collection.TraversableLike.flatMap(TraversableLike.scala:245)
	at scala.collection.TraversableLike.flatMap$(TraversableLike.scala:242)
	at scala.collection.immutable.List.flatMap(List.scala:355)
	at org.apache.spark.sql.execution.datasources.DataSource$.checkAndGlobPathIfNecessary(DataSource.scala:741)
	at org.apache.spark.sql.execution.datasources.DataSource.checkAndGlobPathIfNecessary(DataSource.scala:570)
	at org.apache.spark.sql.execution.datasources.DataSource.resolveRelation(DataSource.scala:393)
	at org.apache.spark.sql.hive.HiveMetastoreCatalog.$anonfun$convertToLogicalRelation$5(HiveMetastoreCatalog.scala:248)
	at scala.Option.getOrElse(Option.scala:189)
	at org.apache.spark.sql.hive.HiveMetastoreCatalog.$anonfun$convertToLogicalRelation$4(HiveMetastoreCatalog.scala:238)
	at org.apache.spark.sql.hive.HiveMetastoreCatalog.withTableCreationLock(HiveMetastoreCatalog.scala:58)
	at org.apache.spark.sql.hive.HiveMetastoreCatalog.convertToLogicalRelation(HiveMetastoreCatalog.scala:231)
	at org.apache.spark.sql.hive.HiveMetastoreCatalog.convert(HiveMetastoreCatalog.scala:137)
	at org.apache.spark.sql.hive.RelationConversions$$anonfun$apply$4.applyOrElse(HiveStrategies.scala:220)
	at org.apache.spark.sql.hive.RelationConversions$$anonfun$apply$4.applyOrElse(HiveStrategies.scala:207)
	at org.apache.spark.sql.catalyst.plans.logical.AnalysisHelper.$anonfun$resolveOperatorsDown$2(AnalysisHelper.scala:108)
	at org.apache.spark.sql.catalyst.trees.CurrentOrigin$.withOrigin(TreeNode.scala:72)
	at org.apache.spark.sql.catalyst.plans.logical.AnalysisHelper.$anonfun$resolveOperatorsDown$1(AnalysisHelper.scala:108)
	at org.apache.spark.sql.catalyst.plans.logical.AnalysisHelper$.allowInvokingTransformsInAnalyzer(AnalysisHelper.scala:194)
	at org.apache.spark.sql.catalyst.plans.logical.AnalysisHelper.resolveOperatorsDown(AnalysisHelper.scala:106)
	at org.apache.spark.sql.catalyst.plans.logical.AnalysisHelper.resolveOperatorsDown$(AnalysisHelper.scala:104)
	at org.apache.spark.sql.catalyst.plans.logical.LogicalPlan.resolveOperatorsDown(LogicalPlan.scala:29)
	at org.apache.spark.sql.catalyst.plans.logical.AnalysisHelper.$anonfun$resolveOperatorsDown$4(AnalysisHelper.scala:113)
	at org.apache.spark.sql.catalyst.trees.TreeNode.$anonfun$mapChildren$1(TreeNode.scala:376)
	at org.apache.spark.sql.catalyst.trees.TreeNode.mapProductIterator(TreeNode.scala:214)
	at org.apache.spark.sql.catalyst.trees.TreeNode.mapChildren(TreeNode.scala:374)
	at org.apache.spark.sql.catalyst.trees.TreeNode.mapChildren(TreeNode.scala:327)
	at org.apache.spark.sql.catalyst.plans.logical.AnalysisHelper.$anonfun$resolveOperatorsDown$1(AnalysisHelper.scala:113)
	at org.apache.spark.sql.catalyst.plans.logical.AnalysisHelper$.allowInvokingTransformsInAnalyzer(AnalysisHelper.scala:194)
	at org.apache.spark.sql.catalyst.plans.logical.AnalysisHelper.resolveOperatorsDown(AnalysisHelper.scala:106)
	at org.apache.spark.sql.catalyst.plans.logical.AnalysisHelper.resolveOperatorsDown$(AnalysisHelper.scala:104)
	at org.apache.spark.sql.catalyst.plans.logical.LogicalPlan.resolveOperatorsDown(LogicalPlan.scala:29)
	at org.apache.spark.sql.catalyst.plans.logical.AnalysisHelper.resolveOperators(AnalysisHelper.scala:73)
	at org.apache.spark.sql.catalyst.plans.logical.AnalysisHelper.resolveOperators$(AnalysisHelper.scala:72)
	at org.apache.spark.sql.catalyst.plans.logical.LogicalPlan.resolveOperators(LogicalPlan.scala:29)
	at org.apache.spark.sql.hive.RelationConversions.apply(HiveStrategies.scala:207)
	at org.apache.spark.sql.hive.RelationConversions.apply(HiveStrategies.scala:191)
	at org.apache.spark.sql.catalyst.rules.RuleExecutor.$anonfun$execute$2(RuleExecutor.scala:130)
	at scala.collection.IndexedSeqOptimized.foldLeft(IndexedSeqOptimized.scala:60)
	at scala.collection.IndexedSeqOptimized.foldLeft$(IndexedSeqOptimized.scala:68)
	at scala.collection.mutable.ArrayBuffer.foldLeft(ArrayBuffer.scala:49)
	at org.apache.spark.sql.catalyst.rules.RuleExecutor.$anonfun$execute$1(RuleExecutor.scala:127)
	at org.apache.spark.sql.catalyst.rules.RuleExecutor.$anonfun$execute$1$adapted(RuleExecutor.scala:119)
	at scala.collection.immutable.List.foreach(List.scala:392)
	at org.apache.spark.sql.catalyst.rules.RuleExecutor.execute(RuleExecutor.scala:119)
	at org.apache.spark.sql.catalyst.analysis.Analyzer.org$apache$spark$sql$catalyst$analysis$Analyzer$$executeSameContext(Analyzer.scala:168)
	at org.apache.spark.sql.catalyst.analysis.Analyzer.execute(Analyzer.scala:162)
	at org.apache.spark.sql.catalyst.analysis.Analyzer.execute(Analyzer.scala:122)
	at org.apache.spark.sql.catalyst.rules.RuleExecutor.$anonfun$executeAndTrack$1(RuleExecutor.scala:98)
	at org.apache.spark.sql.catalyst.QueryPlanningTracker$.withTracker(QueryPlanningTracker.scala:88)
	at org.apache.spark.sql.catalyst.rules.RuleExecutor.executeAndTrack(RuleExecutor.scala:98)
	at org.apache.spark.sql.catalyst.analysis.Analyzer.$anonfun$executeAndCheck$1(Analyzer.scala:146)
	at org.apache.spark.sql.catalyst.plans.logical.AnalysisHelper$.markInAnalyzer(AnalysisHelper.scala:201)
	at org.apache.spark.sql.catalyst.analysis.Analyzer.executeAndCheck(Analyzer.scala:145)
	at org.apache.spark.sql.hive.test.TestHiveQueryExecution.analyzed$lzycompute(TestHive.scala:606)
	at org.apache.spark.sql.hive.test.TestHiveQueryExecution.analyzed(TestHive.scala:589)
	at org.apache.spark.sql.execution.QueryExecution.assertAnalyzed(QueryExecution.scala:55)
	at org.apache.spark.sql.Dataset$.ofRows(Dataset.scala:87)
	at org.apache.spark.sql.SparkSession.table(SparkSession.scala:589)
	at org.apache.spark.sql.execution.command.DropTableCommand.run(ddl.scala:235)
	at org.apache.spark.sql.execution.command.ExecutedCommandExec.sideEffectResult$lzycompute(commands.scala:71)
	at org.apache.spark.sql.execution.command.ExecutedCommandExec.sideEffectResult(commands.scala:69)
	at org.apache.spark.sql.execution.command.ExecutedCommandExec.executeCollect(commands.scala:80)
	at org.apache.spark.sql.Dataset.$anonfun$logicalPlan$1(Dataset.scala:226)
	at org.apache.spark.sql.Dataset.$anonfun$withAction$1(Dataset.scala:3407)
	at org.apache.spark.sql.execution.SQLExecution$.$anonfun$withNewExecutionId$4(SQLExecution.scala:100)
	at org.apache.spark.sql.execution.SQLExecution$.withSQLConfPropagated(SQLExecution.scala:160)
	at org.apache.spark.sql.execution.SQLExecution$.withNewExecutionId(SQLExecution.scala:87)
	at org.apache.spark.sql.Dataset.withAction(Dataset.scala:3403)
	at org.apache.spark.sql.Dataset.<init>(Dataset.scala:226)
	at org.apache.spark.sql.Dataset$.ofRows(Dataset.scala:88)
	at org.apache.spark.sql.hive.test.TestHiveSparkSession.sql(TestHive.scala:238)
	at org.apache.spark.sql.test.SQLTestUtilsBase.$anonfun$withTable$2(SQLTestUtils.scala:291)
	at scala.collection.IndexedSeqOptimized.foreach(IndexedSeqOptimized.scala:36)
	at scala.collection.IndexedSeqOptimized.foreach$(IndexedSeqOptimized.scala:33)
	at scala.collection.mutable.WrappedArray.foreach(WrappedArray.scala:38)
	at org.apache.spark.sql.test.SQLTestUtilsBase.$anonfun$withTable$1(SQLTestUtils.scala:290)
	at org.apache.spark.util.Utils$.tryWithSafeFinally(Utils.scala:1386)
	at org.apache.spark.sql.test.SQLTestUtilsBase.withTable(SQLTestUtils.scala:290)
	at org.apache.spark.sql.test.SQLTestUtilsBase.withTable$(SQLTestUtils.scala:288)
	at org.apache.spark.sql.execution.datasources.parquet.ParquetCompatibilityTest.withTable(ParquetCompatibilityTest.scala:35)
	at org.apache.spark.sql.hive.ParquetHiveCompatibilitySuite.testParquetHiveCompatibility(ParquetHiveCompatibilitySuite.scala:47)
	at org.apache.spark.sql.hive.ParquetHiveCompatibilitySuite.$anonfun$new$2(ParquetHiveCompatibilitySuite.scala:98)
	at scala.runtime.java8.JFunction0$mcV$sp.apply(JFunction0$mcV$sp.java:23)
	at org.scalatest.OutcomeOf.outcomeOf(OutcomeOf.scala:85)
	at org.scalatest.OutcomeOf.outcomeOf$(OutcomeOf.scala:83)
	at org.scalatest.OutcomeOf$.outcomeOf(OutcomeOf.scala:104)
	at org.scalatest.Transformer.apply(Transformer.scala:22)
	at org.scalatest.Transformer.apply(Transformer.scala:20)
	at org.scalatest.FunSuiteLike$$anon$1.apply(FunSuiteLike.scala:186)
	at org.apache.spark.SparkFunSuite.withFixture(SparkFunSuite.scala:149)
	at org.scalatest.FunSuiteLike.invokeWithFixture$1(FunSuiteLike.scala:184)
	at org.scalatest.FunSuiteLike.$anonfun$runTest$1(FunSuiteLike.scala:196)
	at org.scalatest.SuperEngine.runTestImpl(Engine.scala:286)
	at org.scalatest.FunSuiteLike.runTest(FunSuiteLike.scala:196)
	at org.scalatest.FunSuiteLike.runTest$(FunSuiteLike.scala:178)
	at org.apache.spark.SparkFunSuite.org$scalatest$BeforeAndAfterEach$$super$runTest(SparkFunSuite.scala:56)
	at org.scalatest.BeforeAndAfterEach.runTest(BeforeAndAfterEach.scala:221)
	at org.scalatest.BeforeAndAfterEach.runTest$(BeforeAndAfterEach.scala:214)
	at org.apache.spark.SparkFunSuite.runTest(SparkFunSuite.scala:56)
	at org.scalatest.FunSuiteLike.$anonfun$runTests$1(FunSuiteLike.scala:229)
	at org.scalatest.SuperEngine.$anonfun$runTestsInBranch$1(Engine.scala:393)
	at scala.collection.immutable.List.foreach(List.scala:392)
	at org.scalatest.SuperEngine.traverseSubNodes$1(Engine.scala:381)
	at org.scalatest.SuperEngine.runTestsInBranch(Engine.scala:376)
	at org.scalatest.SuperEngine.runTestsImpl(Engine.scala:458)
	at org.scalatest.FunSuiteLike.runTests(FunSuiteLike.scala:229)
	at org.scalatest.FunSuiteLike.runTests$(FunSuiteLike.scala:228)
	at org.scalatest.FunSuite.runTests(FunSuite.scala:1560)
	at org.scalatest.Suite.run(Suite.scala:1124)
	at org.scalatest.Suite.run$(Suite.scala:1106)
	at org.scalatest.FunSuite.org$scalatest$FunSuiteLike$$super$run(FunSuite.scala:1560)
	at org.scalatest.FunSuiteLike.$anonfun$run$1(FunSuiteLike.scala:233)
	at org.scalatest.SuperEngine.runImpl(Engine.scala:518)
	at org.scalatest.FunSuiteLike.run(FunSuiteLike.scala:233)
	at org.scalatest.FunSuiteLike.run$(FunSuiteLike.scala:232)
	at org.apache.spark.SparkFunSuite.org$scalatest$BeforeAndAfterAll$$super$run(SparkFunSuite.scala:56)
	at org.scalatest.BeforeAndAfterAll.liftedTree1$1(BeforeAndAfterAll.scala:213)
	at org.scalatest.BeforeAndAfterAll.run(BeforeAndAfterAll.scala:210)
	at org.scalatest.BeforeAndAfterAll.run$(BeforeAndAfterAll.scala:208)
	at org.apache.spark.SparkFunSuite.run(SparkFunSuite.scala:56)
	at org.scalatest.tools.Framework.org$scalatest$tools$Framework$$runSuite(Framework.scala:317)
	at org.scalatest.tools.Framework$ScalaTestTask.execute(Framework.scala:510)
	at sbt.ForkMain$Run$2.call(ForkMain.java:296)
	at sbt.ForkMain$Run$2.call(ForkMain.java:286)
	at java.util.concurrent.FutureTask.run(FutureTask.java:266)
	at java.util.concurrent.ThreadPoolExecutor.runWorker(ThreadPoolExecutor.java:1149)
	at java.util.concurrent.ThreadPoolExecutor$Worker.run(ThreadPoolExecutor.java:624)
	at java.lang.Thread.run(Thread.java:748)
[info] - SPARK-10177 timestamp (1 second, 249 milliseconds)
08:25:15.364 WARN org.apache.spark.sql.execution.command.DropTableCommand: org.apache.spark.sql.AnalysisException: Path does not exist: file:/home/jenkins/workspace/NewSparkPullRequestBuilder/target/tmp/spark-23feeb9c-c203-421e-97e5-d34dc52cb66f;
org.apache.spark.sql.AnalysisException: Path does not exist: file:/home/jenkins/workspace/NewSparkPullRequestBuilder/target/tmp/spark-23feeb9c-c203-421e-97e5-d34dc52cb66f;
	at org.apache.spark.sql.execution.datasources.DataSource$.$anonfun$checkAndGlobPathIfNecessary$1(DataSource.scala:754)
	at scala.collection.TraversableLike.$anonfun$flatMap$1(TraversableLike.scala:245)
	at scala.collection.immutable.List.foreach(List.scala:392)
	at scala.collection.TraversableLike.flatMap(TraversableLike.scala:245)
	at scala.collection.TraversableLike.flatMap$(TraversableLike.scala:242)
	at scala.collection.immutable.List.flatMap(List.scala:355)
	at org.apache.spark.sql.execution.datasources.DataSource$.checkAndGlobPathIfNecessary(DataSource.scala:741)
	at org.apache.spark.sql.execution.datasources.DataSource.checkAndGlobPathIfNecessary(DataSource.scala:570)
	at org.apache.spark.sql.execution.datasources.DataSource.resolveRelation(DataSource.scala:393)
	at org.apache.spark.sql.hive.HiveMetastoreCatalog.$anonfun$convertToLogicalRelation$5(HiveMetastoreCatalog.scala:248)
	at scala.Option.getOrElse(Option.scala:189)
	at org.apache.spark.sql.hive.HiveMetastoreCatalog.$anonfun$convertToLogicalRelation$4(HiveMetastoreCatalog.scala:238)
	at org.apache.spark.sql.hive.HiveMetastoreCatalog.withTableCreationLock(HiveMetastoreCatalog.scala:58)
	at org.apache.spark.sql.hive.HiveMetastoreCatalog.convertToLogicalRelation(HiveMetastoreCatalog.scala:231)
	at org.apache.spark.sql.hive.HiveMetastoreCatalog.convert(HiveMetastoreCatalog.scala:137)
	at org.apache.spark.sql.hive.RelationConversions$$anonfun$apply$4.applyOrElse(HiveStrategies.scala:220)
	at org.apache.spark.sql.hive.RelationConversions$$anonfun$apply$4.applyOrElse(HiveStrategies.scala:207)
	at org.apache.spark.sql.catalyst.plans.logical.AnalysisHelper.$anonfun$resolveOperatorsDown$2(AnalysisHelper.scala:108)
	at org.apache.spark.sql.catalyst.trees.CurrentOrigin$.withOrigin(TreeNode.scala:72)
	at org.apache.spark.sql.catalyst.plans.logical.AnalysisHelper.$anonfun$resolveOperatorsDown$1(AnalysisHelper.scala:108)
	at org.apache.spark.sql.catalyst.plans.logical.AnalysisHelper$.allowInvokingTransformsInAnalyzer(AnalysisHelper.scala:194)
	at org.apache.spark.sql.catalyst.plans.logical.AnalysisHelper.resolveOperatorsDown(AnalysisHelper.scala:106)
	at org.apache.spark.sql.catalyst.plans.logical.AnalysisHelper.resolveOperatorsDown$(AnalysisHelper.scala:104)
	at org.apache.spark.sql.catalyst.plans.logical.LogicalPlan.resolveOperatorsDown(LogicalPlan.scala:29)
	at org.apache.spark.sql.catalyst.plans.logical.AnalysisHelper.$anonfun$resolveOperatorsDown$4(AnalysisHelper.scala:113)
	at org.apache.spark.sql.catalyst.trees.TreeNode.$anonfun$mapChildren$1(TreeNode.scala:376)
	at org.apache.spark.sql.catalyst.trees.TreeNode.mapProductIterator(TreeNode.scala:214)
	at org.apache.spark.sql.catalyst.trees.TreeNode.mapChildren(TreeNode.scala:374)
	at org.apache.spark.sql.catalyst.trees.TreeNode.mapChildren(TreeNode.scala:327)
	at org.apache.spark.sql.catalyst.plans.logical.AnalysisHelper.$anonfun$resolveOperatorsDown$1(AnalysisHelper.scala:113)
	at org.apache.spark.sql.catalyst.plans.logical.AnalysisHelper$.allowInvokingTransformsInAnalyzer(AnalysisHelper.scala:194)
	at org.apache.spark.sql.catalyst.plans.logical.AnalysisHelper.resolveOperatorsDown(AnalysisHelper.scala:106)
	at org.apache.spark.sql.catalyst.plans.logical.AnalysisHelper.resolveOperatorsDown$(AnalysisHelper.scala:104)
	at org.apache.spark.sql.catalyst.plans.logical.LogicalPlan.resolveOperatorsDown(LogicalPlan.scala:29)
	at org.apache.spark.sql.catalyst.plans.logical.AnalysisHelper.resolveOperators(AnalysisHelper.scala:73)
	at org.apache.spark.sql.catalyst.plans.logical.AnalysisHelper.resolveOperators$(AnalysisHelper.scala:72)
	at org.apache.spark.sql.catalyst.plans.logical.LogicalPlan.resolveOperators(LogicalPlan.scala:29)
	at org.apache.spark.sql.hive.RelationConversions.apply(HiveStrategies.scala:207)
	at org.apache.spark.sql.hive.RelationConversions.apply(HiveStrategies.scala:191)
	at org.apache.spark.sql.catalyst.rules.RuleExecutor.$anonfun$execute$2(RuleExecutor.scala:130)
	at scala.collection.IndexedSeqOptimized.foldLeft(IndexedSeqOptimized.scala:60)
	at scala.collection.IndexedSeqOptimized.foldLeft$(IndexedSeqOptimized.scala:68)
	at scala.collection.mutable.ArrayBuffer.foldLeft(ArrayBuffer.scala:49)
	at org.apache.spark.sql.catalyst.rules.RuleExecutor.$anonfun$execute$1(RuleExecutor.scala:127)
	at org.apache.spark.sql.catalyst.rules.RuleExecutor.$anonfun$execute$1$adapted(RuleExecutor.scala:119)
	at scala.collection.immutable.List.foreach(List.scala:392)
	at org.apache.spark.sql.catalyst.rules.RuleExecutor.execute(RuleExecutor.scala:119)
	at org.apache.spark.sql.catalyst.analysis.Analyzer.org$apache$spark$sql$catalyst$analysis$Analyzer$$executeSameContext(Analyzer.scala:168)
	at org.apache.spark.sql.catalyst.analysis.Analyzer.execute(Analyzer.scala:162)
	at org.apache.spark.sql.catalyst.analysis.Analyzer.execute(Analyzer.scala:122)
	at org.apache.spark.sql.catalyst.rules.RuleExecutor.$anonfun$executeAndTrack$1(RuleExecutor.scala:98)
	at org.apache.spark.sql.catalyst.QueryPlanningTracker$.withTracker(QueryPlanningTracker.scala:88)
	at org.apache.spark.sql.catalyst.rules.RuleExecutor.executeAndTrack(RuleExecutor.scala:98)
	at org.apache.spark.sql.catalyst.analysis.Analyzer.$anonfun$executeAndCheck$1(Analyzer.scala:146)
	at org.apache.spark.sql.catalyst.plans.logical.AnalysisHelper$.markInAnalyzer(AnalysisHelper.scala:201)
	at org.apache.spark.sql.catalyst.analysis.Analyzer.executeAndCheck(Analyzer.scala:145)
	at org.apache.spark.sql.hive.test.TestHiveQueryExecution.analyzed$lzycompute(TestHive.scala:606)
	at org.apache.spark.sql.hive.test.TestHiveQueryExecution.analyzed(TestHive.scala:589)
	at org.apache.spark.sql.execution.QueryExecution.assertAnalyzed(QueryExecution.scala:55)
	at org.apache.spark.sql.Dataset$.ofRows(Dataset.scala:87)
	at org.apache.spark.sql.SparkSession.table(SparkSession.scala:589)
	at org.apache.spark.sql.execution.command.DropTableCommand.run(ddl.scala:235)
	at org.apache.spark.sql.execution.command.ExecutedCommandExec.sideEffectResult$lzycompute(commands.scala:71)
	at org.apache.spark.sql.execution.command.ExecutedCommandExec.sideEffectResult(commands.scala:69)
	at org.apache.spark.sql.execution.command.ExecutedCommandExec.executeCollect(commands.scala:80)
	at org.apache.spark.sql.Dataset.$anonfun$logicalPlan$1(Dataset.scala:226)
	at org.apache.spark.sql.Dataset.$anonfun$withAction$1(Dataset.scala:3407)
	at org.apache.spark.sql.execution.SQLExecution$.$anonfun$withNewExecutionId$4(SQLExecution.scala:100)
	at org.apache.spark.sql.execution.SQLExecution$.withSQLConfPropagated(SQLExecution.scala:160)
	at org.apache.spark.sql.execution.SQLExecution$.withNewExecutionId(SQLExecution.scala:87)
	at org.apache.spark.sql.Dataset.withAction(Dataset.scala:3403)
	at org.apache.spark.sql.Dataset.<init>(Dataset.scala:226)
	at org.apache.spark.sql.Dataset$.ofRows(Dataset.scala:88)
	at org.apache.spark.sql.hive.test.TestHiveSparkSession.sql(TestHive.scala:238)
	at org.apache.spark.sql.test.SQLTestUtilsBase.$anonfun$withTable$2(SQLTestUtils.scala:291)
	at scala.collection.IndexedSeqOptimized.foreach(IndexedSeqOptimized.scala:36)
	at scala.collection.IndexedSeqOptimized.foreach$(IndexedSeqOptimized.scala:33)
	at scala.collection.mutable.WrappedArray.foreach(WrappedArray.scala:38)
	at org.apache.spark.sql.test.SQLTestUtilsBase.$anonfun$withTable$1(SQLTestUtils.scala:290)
	at org.apache.spark.util.Utils$.tryWithSafeFinally(Utils.scala:1386)
	at org.apache.spark.sql.test.SQLTestUtilsBase.withTable(SQLTestUtils.scala:290)
	at org.apache.spark.sql.test.SQLTestUtilsBase.withTable$(SQLTestUtils.scala:288)
	at org.apache.spark.sql.execution.datasources.parquet.ParquetCompatibilityTest.withTable(ParquetCompatibilityTest.scala:35)
	at org.apache.spark.sql.hive.ParquetHiveCompatibilitySuite.testParquetHiveCompatibility(ParquetHiveCompatibilitySuite.scala:47)
	at org.apache.spark.sql.hive.ParquetHiveCompatibilitySuite.$anonfun$new$3(ParquetHiveCompatibilitySuite.scala:111)
	at scala.runtime.java8.JFunction0$mcV$sp.apply(JFunction0$mcV$sp.java:23)
	at org.scalatest.OutcomeOf.outcomeOf(OutcomeOf.scala:85)
	at org.scalatest.OutcomeOf.outcomeOf$(OutcomeOf.scala:83)
	at org.scalatest.OutcomeOf$.outcomeOf(OutcomeOf.scala:104)
	at org.scalatest.Transformer.apply(Transformer.scala:22)
	at org.scalatest.Transformer.apply(Transformer.scala:20)
	at org.scalatest.FunSuiteLike$$anon$1.apply(FunSuiteLike.scala:186)
	at org.apache.spark.SparkFunSuite.withFixture(SparkFunSuite.scala:149)
	at org.scalatest.FunSuiteLike.invokeWithFixture$1(FunSuiteLike.scala:184)
	at org.scalatest.FunSuiteLike.$anonfun$runTest$1(FunSuiteLike.scala:196)
	at org.scalatest.SuperEngine.runTestImpl(Engine.scala:286)
	at org.scalatest.FunSuiteLike.runTest(FunSuiteLike.scala:196)
	at org.scalatest.FunSuiteLike.runTest$(FunSuiteLike.scala:178)
	at org.apache.spark.SparkFunSuite.org$scalatest$BeforeAndAfterEach$$super$runTest(SparkFunSuite.scala:56)
	at org.scalatest.BeforeAndAfterEach.runTest(BeforeAndAfterEach.scala:221)
	at org.scalatest.BeforeAndAfterEach.runTest$(BeforeAndAfterEach.scala:214)
	at org.apache.spark.SparkFunSuite.runTest(SparkFunSuite.scala:56)
	at org.scalatest.FunSuiteLike.$anonfun$runTests$1(FunSuiteLike.scala:229)
	at org.scalatest.SuperEngine.$anonfun$runTestsInBranch$1(Engine.scala:393)
	at scala.collection.immutable.List.foreach(List.scala:392)
	at org.scalatest.SuperEngine.traverseSubNodes$1(Engine.scala:381)
	at org.scalatest.SuperEngine.runTestsInBranch(Engine.scala:376)
	at org.scalatest.SuperEngine.runTestsImpl(Engine.scala:458)
	at org.scalatest.FunSuiteLike.runTests(FunSuiteLike.scala:229)
	at org.scalatest.FunSuiteLike.runTests$(FunSuiteLike.scala:228)
	at org.scalatest.FunSuite.runTests(FunSuite.scala:1560)
	at org.scalatest.Suite.run(Suite.scala:1124)
	at org.scalatest.Suite.run$(Suite.scala:1106)
	at org.scalatest.FunSuite.org$scalatest$FunSuiteLike$$super$run(FunSuite.scala:1560)
	at org.scalatest.FunSuiteLike.$anonfun$run$1(FunSuiteLike.scala:233)
	at org.scalatest.SuperEngine.runImpl(Engine.scala:518)
	at org.scalatest.FunSuiteLike.run(FunSuiteLike.scala:233)
	at org.scalatest.FunSuiteLike.run$(FunSuiteLike.scala:232)
	at org.apache.spark.SparkFunSuite.org$scalatest$BeforeAndAfterAll$$super$run(SparkFunSuite.scala:56)
	at org.scalatest.BeforeAndAfterAll.liftedTree1$1(BeforeAndAfterAll.scala:213)
	at org.scalatest.BeforeAndAfterAll.run(BeforeAndAfterAll.scala:210)
	at org.scalatest.BeforeAndAfterAll.run$(BeforeAndAfterAll.scala:208)
	at org.apache.spark.SparkFunSuite.run(SparkFunSuite.scala:56)
	at org.scalatest.tools.Framework.org$scalatest$tools$Framework$$runSuite(Framework.scala:317)
	at org.scalatest.tools.Framework$ScalaTestTask.execute(Framework.scala:510)
	at sbt.ForkMain$Run$2.call(ForkMain.java:296)
	at sbt.ForkMain$Run$2.call(ForkMain.java:286)
	at java.util.concurrent.FutureTask.run(FutureTask.java:266)
	at java.util.concurrent.ThreadPoolExecutor.runWorker(ThreadPoolExecutor.java:1149)
	at java.util.concurrent.ThreadPoolExecutor$Worker.run(ThreadPoolExecutor.java:624)
	at java.lang.Thread.run(Thread.java:748)
[info] - array (1 second, 212 milliseconds)
08:25:16.473 WARN org.apache.spark.sql.execution.command.DropTableCommand: org.apache.spark.sql.AnalysisException: Path does not exist: file:/home/jenkins/workspace/NewSparkPullRequestBuilder/target/tmp/spark-25cb3d08-41c9-430c-a87d-8faa919580cb;
org.apache.spark.sql.AnalysisException: Path does not exist: file:/home/jenkins/workspace/NewSparkPullRequestBuilder/target/tmp/spark-25cb3d08-41c9-430c-a87d-8faa919580cb;
	at org.apache.spark.sql.execution.datasources.DataSource$.$anonfun$checkAndGlobPathIfNecessary$1(DataSource.scala:754)
	at scala.collection.TraversableLike.$anonfun$flatMap$1(TraversableLike.scala:245)
	at scala.collection.immutable.List.foreach(List.scala:392)
	at scala.collection.TraversableLike.flatMap(TraversableLike.scala:245)
	at scala.collection.TraversableLike.flatMap$(TraversableLike.scala:242)
	at scala.collection.immutable.List.flatMap(List.scala:355)
	at org.apache.spark.sql.execution.datasources.DataSource$.checkAndGlobPathIfNecessary(DataSource.scala:741)
	at org.apache.spark.sql.execution.datasources.DataSource.checkAndGlobPathIfNecessary(DataSource.scala:570)
	at org.apache.spark.sql.execution.datasources.DataSource.resolveRelation(DataSource.scala:393)
	at org.apache.spark.sql.hive.HiveMetastoreCatalog.$anonfun$convertToLogicalRelation$5(HiveMetastoreCatalog.scala:248)
	at scala.Option.getOrElse(Option.scala:189)
	at org.apache.spark.sql.hive.HiveMetastoreCatalog.$anonfun$convertToLogicalRelation$4(HiveMetastoreCatalog.scala:238)
	at org.apache.spark.sql.hive.HiveMetastoreCatalog.withTableCreationLock(HiveMetastoreCatalog.scala:58)
	at org.apache.spark.sql.hive.HiveMetastoreCatalog.convertToLogicalRelation(HiveMetastoreCatalog.scala:231)
	at org.apache.spark.sql.hive.HiveMetastoreCatalog.convert(HiveMetastoreCatalog.scala:137)
	at org.apache.spark.sql.hive.RelationConversions$$anonfun$apply$4.applyOrElse(HiveStrategies.scala:220)
	at org.apache.spark.sql.hive.RelationConversions$$anonfun$apply$4.applyOrElse(HiveStrategies.scala:207)
	at org.apache.spark.sql.catalyst.plans.logical.AnalysisHelper.$anonfun$resolveOperatorsDown$2(AnalysisHelper.scala:108)
	at org.apache.spark.sql.catalyst.trees.CurrentOrigin$.withOrigin(TreeNode.scala:72)
	at org.apache.spark.sql.catalyst.plans.logical.AnalysisHelper.$anonfun$resolveOperatorsDown$1(AnalysisHelper.scala:108)
	at org.apache.spark.sql.catalyst.plans.logical.AnalysisHelper$.allowInvokingTransformsInAnalyzer(AnalysisHelper.scala:194)
	at org.apache.spark.sql.catalyst.plans.logical.AnalysisHelper.resolveOperatorsDown(AnalysisHelper.scala:106)
	at org.apache.spark.sql.catalyst.plans.logical.AnalysisHelper.resolveOperatorsDown$(AnalysisHelper.scala:104)
	at org.apache.spark.sql.catalyst.plans.logical.LogicalPlan.resolveOperatorsDown(LogicalPlan.scala:29)
	at org.apache.spark.sql.catalyst.plans.logical.AnalysisHelper.$anonfun$resolveOperatorsDown$4(AnalysisHelper.scala:113)
	at org.apache.spark.sql.catalyst.trees.TreeNode.$anonfun$mapChildren$1(TreeNode.scala:376)
	at org.apache.spark.sql.catalyst.trees.TreeNode.mapProductIterator(TreeNode.scala:214)
	at org.apache.spark.sql.catalyst.trees.TreeNode.mapChildren(TreeNode.scala:374)
	at org.apache.spark.sql.catalyst.trees.TreeNode.mapChildren(TreeNode.scala:327)
	at org.apache.spark.sql.catalyst.plans.logical.AnalysisHelper.$anonfun$resolveOperatorsDown$1(AnalysisHelper.scala:113)
	at org.apache.spark.sql.catalyst.plans.logical.AnalysisHelper$.allowInvokingTransformsInAnalyzer(AnalysisHelper.scala:194)
	at org.apache.spark.sql.catalyst.plans.logical.AnalysisHelper.resolveOperatorsDown(AnalysisHelper.scala:106)
	at org.apache.spark.sql.catalyst.plans.logical.AnalysisHelper.resolveOperatorsDown$(AnalysisHelper.scala:104)
	at org.apache.spark.sql.catalyst.plans.logical.LogicalPlan.resolveOperatorsDown(LogicalPlan.scala:29)
	at org.apache.spark.sql.catalyst.plans.logical.AnalysisHelper.resolveOperators(AnalysisHelper.scala:73)
	at org.apache.spark.sql.catalyst.plans.logical.AnalysisHelper.resolveOperators$(AnalysisHelper.scala:72)
	at org.apache.spark.sql.catalyst.plans.logical.LogicalPlan.resolveOperators(LogicalPlan.scala:29)
	at org.apache.spark.sql.hive.RelationConversions.apply(HiveStrategies.scala:207)
	at org.apache.spark.sql.hive.RelationConversions.apply(HiveStrategies.scala:191)
	at org.apache.spark.sql.catalyst.rules.RuleExecutor.$anonfun$execute$2(RuleExecutor.scala:130)
	at scala.collection.IndexedSeqOptimized.foldLeft(IndexedSeqOptimized.scala:60)
	at scala.collection.IndexedSeqOptimized.foldLeft$(IndexedSeqOptimized.scala:68)
	at scala.collection.mutable.ArrayBuffer.foldLeft(ArrayBuffer.scala:49)
	at org.apache.spark.sql.catalyst.rules.RuleExecutor.$anonfun$execute$1(RuleExecutor.scala:127)
	at org.apache.spark.sql.catalyst.rules.RuleExecutor.$anonfun$execute$1$adapted(RuleExecutor.scala:119)
	at scala.collection.immutable.List.foreach(List.scala:392)
	at org.apache.spark.sql.catalyst.rules.RuleExecutor.execute(RuleExecutor.scala:119)
	at org.apache.spark.sql.catalyst.analysis.Analyzer.org$apache$spark$sql$catalyst$analysis$Analyzer$$executeSameContext(Analyzer.scala:168)
	at org.apache.spark.sql.catalyst.analysis.Analyzer.execute(Analyzer.scala:162)
	at org.apache.spark.sql.catalyst.analysis.Analyzer.execute(Analyzer.scala:122)
	at org.apache.spark.sql.catalyst.rules.RuleExecutor.$anonfun$executeAndTrack$1(RuleExecutor.scala:98)
	at org.apache.spark.sql.catalyst.QueryPlanningTracker$.withTracker(QueryPlanningTracker.scala:88)
	at org.apache.spark.sql.catalyst.rules.RuleExecutor.executeAndTrack(RuleExecutor.scala:98)
	at org.apache.spark.sql.catalyst.analysis.Analyzer.$anonfun$executeAndCheck$1(Analyzer.scala:146)
	at org.apache.spark.sql.catalyst.plans.logical.AnalysisHelper$.markInAnalyzer(AnalysisHelper.scala:201)
	at org.apache.spark.sql.catalyst.analysis.Analyzer.executeAndCheck(Analyzer.scala:145)
	at org.apache.spark.sql.hive.test.TestHiveQueryExecution.analyzed$lzycompute(TestHive.scala:606)
	at org.apache.spark.sql.hive.test.TestHiveQueryExecution.analyzed(TestHive.scala:589)
	at org.apache.spark.sql.execution.QueryExecution.assertAnalyzed(QueryExecution.scala:55)
	at org.apache.spark.sql.Dataset$.ofRows(Dataset.scala:87)
	at org.apache.spark.sql.SparkSession.table(SparkSession.scala:589)
	at org.apache.spark.sql.execution.command.DropTableCommand.run(ddl.scala:235)
	at org.apache.spark.sql.execution.command.ExecutedCommandExec.sideEffectResult$lzycompute(commands.scala:71)
	at org.apache.spark.sql.execution.command.ExecutedCommandExec.sideEffectResult(commands.scala:69)
	at org.apache.spark.sql.execution.command.ExecutedCommandExec.executeCollect(commands.scala:80)
	at org.apache.spark.sql.Dataset.$anonfun$logicalPlan$1(Dataset.scala:226)
	at org.apache.spark.sql.Dataset.$anonfun$withAction$1(Dataset.scala:3407)
	at org.apache.spark.sql.execution.SQLExecution$.$anonfun$withNewExecutionId$4(SQLExecution.scala:100)
	at org.apache.spark.sql.execution.SQLExecution$.withSQLConfPropagated(SQLExecution.scala:160)
	at org.apache.spark.sql.execution.SQLExecution$.withNewExecutionId(SQLExecution.scala:87)
	at org.apache.spark.sql.Dataset.withAction(Dataset.scala:3403)
	at org.apache.spark.sql.Dataset.<init>(Dataset.scala:226)
	at org.apache.spark.sql.Dataset$.ofRows(Dataset.scala:88)
	at org.apache.spark.sql.hive.test.TestHiveSparkSession.sql(TestHive.scala:238)
	at org.apache.spark.sql.test.SQLTestUtilsBase.$anonfun$withTable$2(SQLTestUtils.scala:291)
	at scala.collection.IndexedSeqOptimized.foreach(IndexedSeqOptimized.scala:36)
	at scala.collection.IndexedSeqOptimized.foreach$(IndexedSeqOptimized.scala:33)
	at scala.collection.mutable.WrappedArray.foreach(WrappedArray.scala:38)
	at org.apache.spark.sql.test.SQLTestUtilsBase.$anonfun$withTable$1(SQLTestUtils.scala:290)
	at org.apache.spark.util.Utils$.tryWithSafeFinally(Utils.scala:1386)
	at org.apache.spark.sql.test.SQLTestUtilsBase.withTable(SQLTestUtils.scala:290)
	at org.apache.spark.sql.test.SQLTestUtilsBase.withTable$(SQLTestUtils.scala:288)
	at org.apache.spark.sql.execution.datasources.parquet.ParquetCompatibilityTest.withTable(ParquetCompatibilityTest.scala:35)
	at org.apache.spark.sql.hive.ParquetHiveCompatibilitySuite.testParquetHiveCompatibility(ParquetHiveCompatibilitySuite.scala:47)
	at org.apache.spark.sql.hive.ParquetHiveCompatibilitySuite.$anonfun$new$4(ParquetHiveCompatibilitySuite.scala:120)
	at scala.runtime.java8.JFunction0$mcV$sp.apply(JFunction0$mcV$sp.java:23)
	at org.scalatest.OutcomeOf.outcomeOf(OutcomeOf.scala:85)
	at org.scalatest.OutcomeOf.outcomeOf$(OutcomeOf.scala:83)
	at org.scalatest.OutcomeOf$.outcomeOf(OutcomeOf.scala:104)
	at org.scalatest.Transformer.apply(Transformer.scala:22)
	at org.scalatest.Transformer.apply(Transformer.scala:20)
	at org.scalatest.FunSuiteLike$$anon$1.apply(FunSuiteLike.scala:186)
	at org.apache.spark.SparkFunSuite.withFixture(SparkFunSuite.scala:149)
	at org.scalatest.FunSuiteLike.invokeWithFixture$1(FunSuiteLike.scala:184)
	at org.scalatest.FunSuiteLike.$anonfun$runTest$1(FunSuiteLike.scala:196)
	at org.scalatest.SuperEngine.runTestImpl(Engine.scala:286)
	at org.scalatest.FunSuiteLike.runTest(FunSuiteLike.scala:196)
	at org.scalatest.FunSuiteLike.runTest$(FunSuiteLike.scala:178)
	at org.apache.spark.SparkFunSuite.org$scalatest$BeforeAndAfterEach$$super$runTest(SparkFunSuite.scala:56)
	at org.scalatest.BeforeAndAfterEach.runTest(BeforeAndAfterEach.scala:221)
	at org.scalatest.BeforeAndAfterEach.runTest$(BeforeAndAfterEach.scala:214)
	at org.apache.spark.SparkFunSuite.runTest(SparkFunSuite.scala:56)
	at org.scalatest.FunSuiteLike.$anonfun$runTests$1(FunSuiteLike.scala:229)
	at org.scalatest.SuperEngine.$anonfun$runTestsInBranch$1(Engine.scala:393)
	at scala.collection.immutable.List.foreach(List.scala:392)
	at org.scalatest.SuperEngine.traverseSubNodes$1(Engine.scala:381)
	at org.scalatest.SuperEngine.runTestsInBranch(Engine.scala:376)
	at org.scalatest.SuperEngine.runTestsImpl(Engine.scala:458)
	at org.scalatest.FunSuiteLike.runTests(FunSuiteLike.scala:229)
	at org.scalatest.FunSuiteLike.runTests$(FunSuiteLike.scala:228)
	at org.scalatest.FunSuite.runTests(FunSuite.scala:1560)
	at org.scalatest.Suite.run(Suite.scala:1124)
	at org.scalatest.Suite.run$(Suite.scala:1106)
	at org.scalatest.FunSuite.org$scalatest$FunSuiteLike$$super$run(FunSuite.scala:1560)
	at org.scalatest.FunSuiteLike.$anonfun$run$1(FunSuiteLike.scala:233)
	at org.scalatest.SuperEngine.runImpl(Engine.scala:518)
	at org.scalatest.FunSuiteLike.run(FunSuiteLike.scala:233)
	at org.scalatest.FunSuiteLike.run$(FunSuiteLike.scala:232)
	at org.apache.spark.SparkFunSuite.org$scalatest$BeforeAndAfterAll$$super$run(SparkFunSuite.scala:56)
	at org.scalatest.BeforeAndAfterAll.liftedTree1$1(BeforeAndAfterAll.scala:213)
	at org.scalatest.BeforeAndAfterAll.run(BeforeAndAfterAll.scala:210)
	at org.scalatest.BeforeAndAfterAll.run$(BeforeAndAfterAll.scala:208)
	at org.apache.spark.SparkFunSuite.run(SparkFunSuite.scala:56)
	at org.scalatest.tools.Framework.org$scalatest$tools$Framework$$runSuite(Framework.scala:317)
	at org.scalatest.tools.Framework$ScalaTestTask.execute(Framework.scala:510)
	at sbt.ForkMain$Run$2.call(ForkMain.java:296)
	at sbt.ForkMain$Run$2.call(ForkMain.java:286)
	at java.util.concurrent.FutureTask.run(FutureTask.java:266)
	at java.util.concurrent.ThreadPoolExecutor.runWorker(ThreadPoolExecutor.java:1149)
	at java.util.concurrent.ThreadPoolExecutor$Worker.run(ThreadPoolExecutor.java:624)
	at java.lang.Thread.run(Thread.java:748)
[info] - map (1 second, 109 milliseconds)
[info] - map entries with null keys !!! IGNORED !!!
08:25:17.805 WARN org.apache.spark.sql.execution.command.DropTableCommand: org.apache.spark.sql.AnalysisException: Path does not exist: file:/home/jenkins/workspace/NewSparkPullRequestBuilder/target/tmp/spark-90cf9c45-e629-478e-ae1d-e5ad49bb80fa;
org.apache.spark.sql.AnalysisException: Path does not exist: file:/home/jenkins/workspace/NewSparkPullRequestBuilder/target/tmp/spark-90cf9c45-e629-478e-ae1d-e5ad49bb80fa;
	at org.apache.spark.sql.execution.datasources.DataSource$.$anonfun$checkAndGlobPathIfNecessary$1(DataSource.scala:754)
	at scala.collection.TraversableLike.$anonfun$flatMap$1(TraversableLike.scala:245)
	at scala.collection.immutable.List.foreach(List.scala:392)
	at scala.collection.TraversableLike.flatMap(TraversableLike.scala:245)
	at scala.collection.TraversableLike.flatMap$(TraversableLike.scala:242)
	at scala.collection.immutable.List.flatMap(List.scala:355)
	at org.apache.spark.sql.execution.datasources.DataSource$.checkAndGlobPathIfNecessary(DataSource.scala:741)
	at org.apache.spark.sql.execution.datasources.DataSource.checkAndGlobPathIfNecessary(DataSource.scala:570)
	at org.apache.spark.sql.execution.datasources.DataSource.resolveRelation(DataSource.scala:393)
	at org.apache.spark.sql.hive.HiveMetastoreCatalog.$anonfun$convertToLogicalRelation$5(HiveMetastoreCatalog.scala:248)
	at scala.Option.getOrElse(Option.scala:189)
	at org.apache.spark.sql.hive.HiveMetastoreCatalog.$anonfun$convertToLogicalRelation$4(HiveMetastoreCatalog.scala:238)
	at org.apache.spark.sql.hive.HiveMetastoreCatalog.withTableCreationLock(HiveMetastoreCatalog.scala:58)
	at org.apache.spark.sql.hive.HiveMetastoreCatalog.convertToLogicalRelation(HiveMetastoreCatalog.scala:231)
	at org.apache.spark.sql.hive.HiveMetastoreCatalog.convert(HiveMetastoreCatalog.scala:137)
	at org.apache.spark.sql.hive.RelationConversions$$anonfun$apply$4.applyOrElse(HiveStrategies.scala:220)
	at org.apache.spark.sql.hive.RelationConversions$$anonfun$apply$4.applyOrElse(HiveStrategies.scala:207)
	at org.apache.spark.sql.catalyst.plans.logical.AnalysisHelper.$anonfun$resolveOperatorsDown$2(AnalysisHelper.scala:108)
	at org.apache.spark.sql.catalyst.trees.CurrentOrigin$.withOrigin(TreeNode.scala:72)
	at org.apache.spark.sql.catalyst.plans.logical.AnalysisHelper.$anonfun$resolveOperatorsDown$1(AnalysisHelper.scala:108)
	at org.apache.spark.sql.catalyst.plans.logical.AnalysisHelper$.allowInvokingTransformsInAnalyzer(AnalysisHelper.scala:194)
	at org.apache.spark.sql.catalyst.plans.logical.AnalysisHelper.resolveOperatorsDown(AnalysisHelper.scala:106)
	at org.apache.spark.sql.catalyst.plans.logical.AnalysisHelper.resolveOperatorsDown$(AnalysisHelper.scala:104)
	at org.apache.spark.sql.catalyst.plans.logical.LogicalPlan.resolveOperatorsDown(LogicalPlan.scala:29)
	at org.apache.spark.sql.catalyst.plans.logical.AnalysisHelper.$anonfun$resolveOperatorsDown$4(AnalysisHelper.scala:113)
	at org.apache.spark.sql.catalyst.trees.TreeNode.$anonfun$mapChildren$1(TreeNode.scala:376)
	at org.apache.spark.sql.catalyst.trees.TreeNode.mapProductIterator(TreeNode.scala:214)
	at org.apache.spark.sql.catalyst.trees.TreeNode.mapChildren(TreeNode.scala:374)
	at org.apache.spark.sql.catalyst.trees.TreeNode.mapChildren(TreeNode.scala:327)
	at org.apache.spark.sql.catalyst.plans.logical.AnalysisHelper.$anonfun$resolveOperatorsDown$1(AnalysisHelper.scala:113)
	at org.apache.spark.sql.catalyst.plans.logical.AnalysisHelper$.allowInvokingTransformsInAnalyzer(AnalysisHelper.scala:194)
	at org.apache.spark.sql.catalyst.plans.logical.AnalysisHelper.resolveOperatorsDown(AnalysisHelper.scala:106)
	at org.apache.spark.sql.catalyst.plans.logical.AnalysisHelper.resolveOperatorsDown$(AnalysisHelper.scala:104)
	at org.apache.spark.sql.catalyst.plans.logical.LogicalPlan.resolveOperatorsDown(LogicalPlan.scala:29)
	at org.apache.spark.sql.catalyst.plans.logical.AnalysisHelper.resolveOperators(AnalysisHelper.scala:73)
	at org.apache.spark.sql.catalyst.plans.logical.AnalysisHelper.resolveOperators$(AnalysisHelper.scala:72)
	at org.apache.spark.sql.catalyst.plans.logical.LogicalPlan.resolveOperators(LogicalPlan.scala:29)
	at org.apache.spark.sql.hive.RelationConversions.apply(HiveStrategies.scala:207)
	at org.apache.spark.sql.hive.RelationConversions.apply(HiveStrategies.scala:191)
	at org.apache.spark.sql.catalyst.rules.RuleExecutor.$anonfun$execute$2(RuleExecutor.scala:130)
	at scala.collection.IndexedSeqOptimized.foldLeft(IndexedSeqOptimized.scala:60)
	at scala.collection.IndexedSeqOptimized.foldLeft$(IndexedSeqOptimized.scala:68)
	at scala.collection.mutable.ArrayBuffer.foldLeft(ArrayBuffer.scala:49)
	at org.apache.spark.sql.catalyst.rules.RuleExecutor.$anonfun$execute$1(RuleExecutor.scala:127)
	at org.apache.spark.sql.catalyst.rules.RuleExecutor.$anonfun$execute$1$adapted(RuleExecutor.scala:119)
	at scala.collection.immutable.List.foreach(List.scala:392)
	at org.apache.spark.sql.catalyst.rules.RuleExecutor.execute(RuleExecutor.scala:119)
	at org.apache.spark.sql.catalyst.analysis.Analyzer.org$apache$spark$sql$catalyst$analysis$Analyzer$$executeSameContext(Analyzer.scala:168)
	at org.apache.spark.sql.catalyst.analysis.Analyzer.execute(Analyzer.scala:162)
	at org.apache.spark.sql.catalyst.analysis.Analyzer.execute(Analyzer.scala:122)
	at org.apache.spark.sql.catalyst.rules.RuleExecutor.$anonfun$executeAndTrack$1(RuleExecutor.scala:98)
	at org.apache.spark.sql.catalyst.QueryPlanningTracker$.withTracker(QueryPlanningTracker.scala:88)
	at org.apache.spark.sql.catalyst.rules.RuleExecutor.executeAndTrack(RuleExecutor.scala:98)
	at org.apache.spark.sql.catalyst.analysis.Analyzer.$anonfun$executeAndCheck$1(Analyzer.scala:146)
	at org.apache.spark.sql.catalyst.plans.logical.AnalysisHelper$.markInAnalyzer(AnalysisHelper.scala:201)
	at org.apache.spark.sql.catalyst.analysis.Analyzer.executeAndCheck(Analyzer.scala:145)
	at org.apache.spark.sql.hive.test.TestHiveQueryExecution.analyzed$lzycompute(TestHive.scala:606)
	at org.apache.spark.sql.hive.test.TestHiveQueryExecution.analyzed(TestHive.scala:589)
	at org.apache.spark.sql.execution.QueryExecution.assertAnalyzed(QueryExecution.scala:55)
	at org.apache.spark.sql.Dataset$.ofRows(Dataset.scala:87)
	at org.apache.spark.sql.SparkSession.table(SparkSession.scala:589)
	at org.apache.spark.sql.execution.command.DropTableCommand.run(ddl.scala:235)
	at org.apache.spark.sql.execution.command.ExecutedCommandExec.sideEffectResult$lzycompute(commands.scala:71)
	at org.apache.spark.sql.execution.command.ExecutedCommandExec.sideEffectResult(commands.scala:69)
	at org.apache.spark.sql.execution.command.ExecutedCommandExec.executeCollect(commands.scala:80)
	at org.apache.spark.sql.Dataset.$anonfun$logicalPlan$1(Dataset.scala:226)
	at org.apache.spark.sql.Dataset.$anonfun$withAction$1(Dataset.scala:3407)
	at org.apache.spark.sql.execution.SQLExecution$.$anonfun$withNewExecutionId$4(SQLExecution.scala:100)
	at org.apache.spark.sql.execution.SQLExecution$.withSQLConfPropagated(SQLExecution.scala:160)
	at org.apache.spark.sql.execution.SQLExecution$.withNewExecutionId(SQLExecution.scala:87)
	at org.apache.spark.sql.Dataset.withAction(Dataset.scala:3403)
	at org.apache.spark.sql.Dataset.<init>(Dataset.scala:226)
	at org.apache.spark.sql.Dataset$.ofRows(Dataset.scala:88)
	at org.apache.spark.sql.hive.test.TestHiveSparkSession.sql(TestHive.scala:238)
	at org.apache.spark.sql.test.SQLTestUtilsBase.$anonfun$withTable$2(SQLTestUtils.scala:291)
	at scala.collection.IndexedSeqOptimized.foreach(IndexedSeqOptimized.scala:36)
	at scala.collection.IndexedSeqOptimized.foreach$(IndexedSeqOptimized.scala:33)
	at scala.collection.mutable.WrappedArray.foreach(WrappedArray.scala:38)
	at org.apache.spark.sql.test.SQLTestUtilsBase.$anonfun$withTable$1(SQLTestUtils.scala:290)
	at org.apache.spark.util.Utils$.tryWithSafeFinally(Utils.scala:1386)
	at org.apache.spark.sql.test.SQLTestUtilsBase.withTable(SQLTestUtils.scala:290)
	at org.apache.spark.sql.test.SQLTestUtilsBase.withTable$(SQLTestUtils.scala:288)
	at org.apache.spark.sql.execution.datasources.parquet.ParquetCompatibilityTest.withTable(ParquetCompatibilityTest.scala:35)
	at org.apache.spark.sql.hive.ParquetHiveCompatibilitySuite.testParquetHiveCompatibility(ParquetHiveCompatibilitySuite.scala:47)
	at org.apache.spark.sql.hive.ParquetHiveCompatibilitySuite.$anonfun$new$6(ParquetHiveCompatibilitySuite.scala:136)
	at scala.runtime.java8.JFunction0$mcV$sp.apply(JFunction0$mcV$sp.java:23)
	at org.scalatest.OutcomeOf.outcomeOf(OutcomeOf.scala:85)
	at org.scalatest.OutcomeOf.outcomeOf$(OutcomeOf.scala:83)
	at org.scalatest.OutcomeOf$.outcomeOf(OutcomeOf.scala:104)
	at org.scalatest.Transformer.apply(Transformer.scala:22)
	at org.scalatest.Transformer.apply(Transformer.scala:20)
	at org.scalatest.FunSuiteLike$$anon$1.apply(FunSuiteLike.scala:186)
	at org.apache.spark.SparkFunSuite.withFixture(SparkFunSuite.scala:149)
	at org.scalatest.FunSuiteLike.invokeWithFixture$1(FunSuiteLike.scala:184)
	at org.scalatest.FunSuiteLike.$anonfun$runTest$1(FunSuiteLike.scala:196)
	at org.scalatest.SuperEngine.runTestImpl(Engine.scala:286)
	at org.scalatest.FunSuiteLike.runTest(FunSuiteLike.scala:196)
	at org.scalatest.FunSuiteLike.runTest$(FunSuiteLike.scala:178)
	at org.apache.spark.SparkFunSuite.org$scalatest$BeforeAndAfterEach$$super$runTest(SparkFunSuite.scala:56)
	at org.scalatest.BeforeAndAfterEach.runTest(BeforeAndAfterEach.scala:221)
	at org.scalatest.BeforeAndAfterEach.runTest$(BeforeAndAfterEach.scala:214)
	at org.apache.spark.SparkFunSuite.runTest(SparkFunSuite.scala:56)
	at org.scalatest.FunSuiteLike.$anonfun$runTests$1(FunSuiteLike.scala:229)
	at org.scalatest.SuperEngine.$anonfun$runTestsInBranch$1(Engine.scala:393)
	at scala.collection.immutable.List.foreach(List.scala:392)
	at org.scalatest.SuperEngine.traverseSubNodes$1(Engine.scala:381)
	at org.scalatest.SuperEngine.runTestsInBranch(Engine.scala:376)
	at org.scalatest.SuperEngine.runTestsImpl(Engine.scala:458)
	at org.scalatest.FunSuiteLike.runTests(FunSuiteLike.scala:229)
	at org.scalatest.FunSuiteLike.runTests$(FunSuiteLike.scala:228)
	at org.scalatest.FunSuite.runTests(FunSuite.scala:1560)
	at org.scalatest.Suite.run(Suite.scala:1124)
	at org.scalatest.Suite.run$(Suite.scala:1106)
	at org.scalatest.FunSuite.org$scalatest$FunSuiteLike$$super$run(FunSuite.scala:1560)
	at org.scalatest.FunSuiteLike.$anonfun$run$1(FunSuiteLike.scala:233)
	at org.scalatest.SuperEngine.runImpl(Engine.scala:518)
	at org.scalatest.FunSuiteLike.run(FunSuiteLike.scala:233)
	at org.scalatest.FunSuiteLike.run$(FunSuiteLike.scala:232)
	at org.apache.spark.SparkFunSuite.org$scalatest$BeforeAndAfterAll$$super$run(SparkFunSuite.scala:56)
	at org.scalatest.BeforeAndAfterAll.liftedTree1$1(BeforeAndAfterAll.scala:213)
	at org.scalatest.BeforeAndAfterAll.run(BeforeAndAfterAll.scala:210)
	at org.scalatest.BeforeAndAfterAll.run$(BeforeAndAfterAll.scala:208)
	at org.apache.spark.SparkFunSuite.run(SparkFunSuite.scala:56)
	at org.scalatest.tools.Framework.org$scalatest$tools$Framework$$runSuite(Framework.scala:317)
	at org.scalatest.tools.Framework$ScalaTestTask.execute(Framework.scala:510)
	at sbt.ForkMain$Run$2.call(ForkMain.java:296)
	at sbt.ForkMain$Run$2.call(ForkMain.java:286)
	at java.util.concurrent.FutureTask.run(FutureTask.java:266)
	at java.util.concurrent.ThreadPoolExecutor.runWorker(ThreadPoolExecutor.java:1149)
	at java.util.concurrent.ThreadPoolExecutor$Worker.run(ThreadPoolExecutor.java:624)
	at java.lang.Thread.run(Thread.java:748)
[info] - struct (1 second, 333 milliseconds)
08:25:19.174 WARN org.apache.spark.sql.execution.command.DropTableCommand: org.apache.spark.sql.AnalysisException: Path does not exist: file:/home/jenkins/workspace/NewSparkPullRequestBuilder/target/tmp/spark-24788b28-5e26-416e-a817-9540788c1bd0;
org.apache.spark.sql.AnalysisException: Path does not exist: file:/home/jenkins/workspace/NewSparkPullRequestBuilder/target/tmp/spark-24788b28-5e26-416e-a817-9540788c1bd0;
	at org.apache.spark.sql.execution.datasources.DataSource$.$anonfun$checkAndGlobPathIfNecessary$1(DataSource.scala:754)
	at scala.collection.TraversableLike.$anonfun$flatMap$1(TraversableLike.scala:245)
	at scala.collection.immutable.List.foreach(List.scala:392)
	at scala.collection.TraversableLike.flatMap(TraversableLike.scala:245)
	at scala.collection.TraversableLike.flatMap$(TraversableLike.scala:242)
	at scala.collection.immutable.List.flatMap(List.scala:355)
	at org.apache.spark.sql.execution.datasources.DataSource$.checkAndGlobPathIfNecessary(DataSource.scala:741)
	at org.apache.spark.sql.execution.datasources.DataSource.checkAndGlobPathIfNecessary(DataSource.scala:570)
	at org.apache.spark.sql.execution.datasources.DataSource.resolveRelation(DataSource.scala:393)
	at org.apache.spark.sql.hive.HiveMetastoreCatalog.$anonfun$convertToLogicalRelation$5(HiveMetastoreCatalog.scala:248)
	at scala.Option.getOrElse(Option.scala:189)
	at org.apache.spark.sql.hive.HiveMetastoreCatalog.$anonfun$convertToLogicalRelation$4(HiveMetastoreCatalog.scala:238)
	at org.apache.spark.sql.hive.HiveMetastoreCatalog.withTableCreationLock(HiveMetastoreCatalog.scala:58)
	at org.apache.spark.sql.hive.HiveMetastoreCatalog.convertToLogicalRelation(HiveMetastoreCatalog.scala:231)
	at org.apache.spark.sql.hive.HiveMetastoreCatalog.convert(HiveMetastoreCatalog.scala:137)
	at org.apache.spark.sql.hive.RelationConversions$$anonfun$apply$4.applyOrElse(HiveStrategies.scala:220)
	at org.apache.spark.sql.hive.RelationConversions$$anonfun$apply$4.applyOrElse(HiveStrategies.scala:207)
	at org.apache.spark.sql.catalyst.plans.logical.AnalysisHelper.$anonfun$resolveOperatorsDown$2(AnalysisHelper.scala:108)
	at org.apache.spark.sql.catalyst.trees.CurrentOrigin$.withOrigin(TreeNode.scala:72)
	at org.apache.spark.sql.catalyst.plans.logical.AnalysisHelper.$anonfun$resolveOperatorsDown$1(AnalysisHelper.scala:108)
	at org.apache.spark.sql.catalyst.plans.logical.AnalysisHelper$.allowInvokingTransformsInAnalyzer(AnalysisHelper.scala:194)
	at org.apache.spark.sql.catalyst.plans.logical.AnalysisHelper.resolveOperatorsDown(AnalysisHelper.scala:106)
	at org.apache.spark.sql.catalyst.plans.logical.AnalysisHelper.resolveOperatorsDown$(AnalysisHelper.scala:104)
	at org.apache.spark.sql.catalyst.plans.logical.LogicalPlan.resolveOperatorsDown(LogicalPlan.scala:29)
	at org.apache.spark.sql.catalyst.plans.logical.AnalysisHelper.$anonfun$resolveOperatorsDown$4(AnalysisHelper.scala:113)
	at org.apache.spark.sql.catalyst.trees.TreeNode.$anonfun$mapChildren$1(TreeNode.scala:376)
	at org.apache.spark.sql.catalyst.trees.TreeNode.mapProductIterator(TreeNode.scala:214)
	at org.apache.spark.sql.catalyst.trees.TreeNode.mapChildren(TreeNode.scala:374)
	at org.apache.spark.sql.catalyst.trees.TreeNode.mapChildren(TreeNode.scala:327)
	at org.apache.spark.sql.catalyst.plans.logical.AnalysisHelper.$anonfun$resolveOperatorsDown$1(AnalysisHelper.scala:113)
	at org.apache.spark.sql.catalyst.plans.logical.AnalysisHelper$.allowInvokingTransformsInAnalyzer(AnalysisHelper.scala:194)
	at org.apache.spark.sql.catalyst.plans.logical.AnalysisHelper.resolveOperatorsDown(AnalysisHelper.scala:106)
	at org.apache.spark.sql.catalyst.plans.logical.AnalysisHelper.resolveOperatorsDown$(AnalysisHelper.scala:104)
	at org.apache.spark.sql.catalyst.plans.logical.LogicalPlan.resolveOperatorsDown(LogicalPlan.scala:29)
	at org.apache.spark.sql.catalyst.plans.logical.AnalysisHelper.resolveOperators(AnalysisHelper.scala:73)
	at org.apache.spark.sql.catalyst.plans.logical.AnalysisHelper.resolveOperators$(AnalysisHelper.scala:72)
	at org.apache.spark.sql.catalyst.plans.logical.LogicalPlan.resolveOperators(LogicalPlan.scala:29)
	at org.apache.spark.sql.hive.RelationConversions.apply(HiveStrategies.scala:207)
	at org.apache.spark.sql.hive.RelationConversions.apply(HiveStrategies.scala:191)
	at org.apache.spark.sql.catalyst.rules.RuleExecutor.$anonfun$execute$2(RuleExecutor.scala:130)
	at scala.collection.IndexedSeqOptimized.foldLeft(IndexedSeqOptimized.scala:60)
	at scala.collection.IndexedSeqOptimized.foldLeft$(IndexedSeqOptimized.scala:68)
	at scala.collection.mutable.ArrayBuffer.foldLeft(ArrayBuffer.scala:49)
	at org.apache.spark.sql.catalyst.rules.RuleExecutor.$anonfun$execute$1(RuleExecutor.scala:127)
	at org.apache.spark.sql.catalyst.rules.RuleExecutor.$anonfun$execute$1$adapted(RuleExecutor.scala:119)
	at scala.collection.immutable.List.foreach(List.scala:392)
	at org.apache.spark.sql.catalyst.rules.RuleExecutor.execute(RuleExecutor.scala:119)
	at org.apache.spark.sql.catalyst.analysis.Analyzer.org$apache$spark$sql$catalyst$analysis$Analyzer$$executeSameContext(Analyzer.scala:168)
	at org.apache.spark.sql.catalyst.analysis.Analyzer.execute(Analyzer.scala:162)
	at org.apache.spark.sql.catalyst.analysis.Analyzer.execute(Analyzer.scala:122)
	at org.apache.spark.sql.catalyst.rules.RuleExecutor.$anonfun$executeAndTrack$1(RuleExecutor.scala:98)
	at org.apache.spark.sql.catalyst.QueryPlanningTracker$.withTracker(QueryPlanningTracker.scala:88)
	at org.apache.spark.sql.catalyst.rules.RuleExecutor.executeAndTrack(RuleExecutor.scala:98)
	at org.apache.spark.sql.catalyst.analysis.Analyzer.$anonfun$executeAndCheck$1(Analyzer.scala:146)
	at org.apache.spark.sql.catalyst.plans.logical.AnalysisHelper$.markInAnalyzer(AnalysisHelper.scala:201)
	at org.apache.spark.sql.catalyst.analysis.Analyzer.executeAndCheck(Analyzer.scala:145)
	at org.apache.spark.sql.hive.test.TestHiveQueryExecution.analyzed$lzycompute(TestHive.scala:606)
	at org.apache.spark.sql.hive.test.TestHiveQueryExecution.analyzed(TestHive.scala:589)
	at org.apache.spark.sql.execution.QueryExecution.assertAnalyzed(QueryExecution.scala:55)
	at org.apache.spark.sql.Dataset$.ofRows(Dataset.scala:87)
	at org.apache.spark.sql.SparkSession.table(SparkSession.scala:589)
	at org.apache.spark.sql.execution.command.DropTableCommand.run(ddl.scala:235)
	at org.apache.spark.sql.execution.command.ExecutedCommandExec.sideEffectResult$lzycompute(commands.scala:71)
	at org.apache.spark.sql.execution.command.ExecutedCommandExec.sideEffectResult(commands.scala:69)
	at org.apache.spark.sql.execution.command.ExecutedCommandExec.executeCollect(commands.scala:80)
	at org.apache.spark.sql.Dataset.$anonfun$logicalPlan$1(Dataset.scala:226)
	at org.apache.spark.sql.Dataset.$anonfun$withAction$1(Dataset.scala:3407)
	at org.apache.spark.sql.execution.SQLExecution$.$anonfun$withNewExecutionId$4(SQLExecution.scala:100)
	at org.apache.spark.sql.execution.SQLExecution$.withSQLConfPropagated(SQLExecution.scala:160)
	at org.apache.spark.sql.execution.SQLExecution$.withNewExecutionId(SQLExecution.scala:87)
	at org.apache.spark.sql.Dataset.withAction(Dataset.scala:3403)
	at org.apache.spark.sql.Dataset.<init>(Dataset.scala:226)
	at org.apache.spark.sql.Dataset$.ofRows(Dataset.scala:88)
	at org.apache.spark.sql.hive.test.TestHiveSparkSession.sql(TestHive.scala:238)
	at org.apache.spark.sql.test.SQLTestUtilsBase.$anonfun$withTable$2(SQLTestUtils.scala:291)
	at scala.collection.IndexedSeqOptimized.foreach(IndexedSeqOptimized.scala:36)
	at scala.collection.IndexedSeqOptimized.foreach$(IndexedSeqOptimized.scala:33)
	at scala.collection.mutable.WrappedArray.foreach(WrappedArray.scala:38)
	at org.apache.spark.sql.test.SQLTestUtilsBase.$anonfun$withTable$1(SQLTestUtils.scala:290)
	at org.apache.spark.util.Utils$.tryWithSafeFinally(Utils.scala:1386)
	at org.apache.spark.sql.test.SQLTestUtilsBase.withTable(SQLTestUtils.scala:290)
	at org.apache.spark.sql.test.SQLTestUtilsBase.withTable$(SQLTestUtils.scala:288)
	at org.apache.spark.sql.execution.datasources.parquet.ParquetCompatibilityTest.withTable(ParquetCompatibilityTest.scala:35)
	at org.apache.spark.sql.hive.ParquetHiveCompatibilitySuite.testParquetHiveCompatibility(ParquetHiveCompatibilitySuite.scala:47)
	at org.apache.spark.sql.hive.ParquetHiveCompatibilitySuite.$anonfun$new$7(ParquetHiveCompatibilitySuite.scala:142)
	at scala.runtime.java8.JFunction0$mcV$sp.apply(JFunction0$mcV$sp.java:23)
	at org.scalatest.OutcomeOf.outcomeOf(OutcomeOf.scala:85)
	at org.scalatest.OutcomeOf.outcomeOf$(OutcomeOf.scala:83)
	at org.scalatest.OutcomeOf$.outcomeOf(OutcomeOf.scala:104)
	at org.scalatest.Transformer.apply(Transformer.scala:22)
	at org.scalatest.Transformer.apply(Transformer.scala:20)
	at org.scalatest.FunSuiteLike$$anon$1.apply(FunSuiteLike.scala:186)
	at org.apache.spark.SparkFunSuite.withFixture(SparkFunSuite.scala:149)
	at org.scalatest.FunSuiteLike.invokeWithFixture$1(FunSuiteLike.scala:184)
	at org.scalatest.FunSuiteLike.$anonfun$runTest$1(FunSuiteLike.scala:196)
	at org.scalatest.SuperEngine.runTestImpl(Engine.scala:286)
	at org.scalatest.FunSuiteLike.runTest(FunSuiteLike.scala:196)
	at org.scalatest.FunSuiteLike.runTest$(FunSuiteLike.scala:178)
	at org.apache.spark.SparkFunSuite.org$scalatest$BeforeAndAfterEach$$super$runTest(SparkFunSuite.scala:56)
	at org.scalatest.BeforeAndAfterEach.runTest(BeforeAndAfterEach.scala:221)
	at org.scalatest.BeforeAndAfterEach.runTest$(BeforeAndAfterEach.scala:214)
	at org.apache.spark.SparkFunSuite.runTest(SparkFunSuite.scala:56)
	at org.scalatest.FunSuiteLike.$anonfun$runTests$1(FunSuiteLike.scala:229)
	at org.scalatest.SuperEngine.$anonfun$runTestsInBranch$1(Engine.scala:393)
	at scala.collection.immutable.List.foreach(List.scala:392)
	at org.scalatest.SuperEngine.traverseSubNodes$1(Engine.scala:381)
	at org.scalatest.SuperEngine.runTestsInBranch(Engine.scala:376)
	at org.scalatest.SuperEngine.runTestsImpl(Engine.scala:458)
	at org.scalatest.FunSuiteLike.runTests(FunSuiteLike.scala:229)
	at org.scalatest.FunSuiteLike.runTests$(FunSuiteLike.scala:228)
	at org.scalatest.FunSuite.runTests(FunSuite.scala:1560)
	at org.scalatest.Suite.run(Suite.scala:1124)
	at org.scalatest.Suite.run$(Suite.scala:1106)
	at org.scalatest.FunSuite.org$scalatest$FunSuiteLike$$super$run(FunSuite.scala:1560)
	at org.scalatest.FunSuiteLike.$anonfun$run$1(FunSuiteLike.scala:233)
	at org.scalatest.SuperEngine.runImpl(Engine.scala:518)
	at org.scalatest.FunSuiteLike.run(FunSuiteLike.scala:233)
	at org.scalatest.FunSuiteLike.run$(FunSuiteLike.scala:232)
	at org.apache.spark.SparkFunSuite.org$scalatest$BeforeAndAfterAll$$super$run(SparkFunSuite.scala:56)
	at org.scalatest.BeforeAndAfterAll.liftedTree1$1(BeforeAndAfterAll.scala:213)
	at org.scalatest.BeforeAndAfterAll.run(BeforeAndAfterAll.scala:210)
	at org.scalatest.BeforeAndAfterAll.run$(BeforeAndAfterAll.scala:208)
	at org.apache.spark.SparkFunSuite.run(SparkFunSuite.scala:56)
	at org.scalatest.tools.Framework.org$scalatest$tools$Framework$$runSuite(Framework.scala:317)
	at org.scalatest.tools.Framework$ScalaTestTask.execute(Framework.scala:510)
	at sbt.ForkMain$Run$2.call(ForkMain.java:296)
	at sbt.ForkMain$Run$2.call(ForkMain.java:286)
	at java.util.concurrent.FutureTask.run(FutureTask.java:266)
	at java.util.concurrent.ThreadPoolExecutor.runWorker(ThreadPoolExecutor.java:1149)
	at java.util.concurrent.ThreadPoolExecutor$Worker.run(ThreadPoolExecutor.java:624)
	at java.lang.Thread.run(Thread.java:748)
[info] - SPARK-16344: array of struct with a single field named 'array_element' (1 second, 366 milliseconds)
[info] Test run started
[info] Test org.apache.spark.sql.hive.JavaDataFrameSuite.testUDAF started
[info] Test org.apache.spark.sql.hive.JavaDataFrameSuite.saveTableAndQueryIt started
[info] Test run finished: 0 failed, 0 ignored, 2 total, 2.184s
[info] Test run started
[info] Test org.apache.spark.sql.hive.JavaMetastoreDataSourcesSuite.saveTableAndQueryIt started
08:25:21.950 WARN org.apache.spark.sql.hive.test.TestHiveExternalCatalog: Couldn't find corresponding Hive SerDe for data source provider org.apache.spark.sql.json. Persisting data source table `default`.`javasavedtable` into Hive metastore in Spark SQL specific format, which is NOT compatible with Hive.
[info] Test run finished: 0 failed, 0 ignored, 1 total, 0.554s
08:25:22.312 WARN io.netty.util.concurrent.SingleThreadEventExecutor: An event executor terminated with non-empty task queue (2)
[info] ScalaTest
[info] Run completed in 1 hour, 29 minutes, 47 seconds.
[info] Total number of tests run: 2584
[info] Suites: completed 125, aborted 0
[info] Tests: succeeded 2584, failed 0, canceled 1, ignored 595, pending 0
[info] All tests passed.
[info] Passed: Total 2587, Failed 0, Errors 0, Passed 2587, Ignored 595, Canceled 1
[error] (core/test:test) sbt.TestsFailedException: Tests unsuccessful
[error] Total time: 5435 s, completed Nov 22, 2019 8:25:59 AM
[error] running /home/jenkins/workspace/NewSparkPullRequestBuilder/build/sbt -Phadoop-2.7 -Pmesos -Pyarn -Pkubernetes -Phive-thriftserver -Phive -Phadoop-cloud -Pspark-ganglia-lgpl -Pkinesis-asl -Dtest.exclude.tags=org.apache.spark.tags.ExtendedHiveTest,org.apache.spark.tags.ExtendedYarnTest test ; received return code 1
Attempting to post to Github...
 > Post successful.
Build step 'Execute shell' marked build as failure
Archiving artifacts
Recording test results
Finished: FAILURE