FailedConsole Output

Skipping 8,512 KB.. Full Log
lDDI2RQXJOYpFJdU5qTaKoEttlJQNjBwdjEwsFayAwAsE8VZpQAAAA==- Support hive.aux.jars.path (17 seconds, 280 milliseconds)
[info] - postgreSQL/window_part4.sql (11 seconds, 356 milliseconds)
[info] - postgreSQL/boolean.sql !!! IGNORED !!!
[info] - postgreSQL/text.sql (1 second, 903 milliseconds)
[info] - postgreSQL/interval.sql (1 second, 46 milliseconds)
[info] - postgreSQL/float8.sql (5 seconds, 377 milliseconds)
[info] - SPARK-28840 test --jars command (17 seconds, 186 milliseconds)
[info] - postgreSQL/select_having.sql (2 seconds, 865 milliseconds)
[info] - postgreSQL/timestamp.sql (3 seconds, 276 milliseconds)
[info] - postgreSQL/comments.sql (346 milliseconds)
[info] - postgreSQL/float4.sql !!! IGNORED !!!
[info] - postgreSQL/select_implicit.sql (7 seconds, 163 milliseconds)
[info] - SPARK-28840 test --jars and hive.aux.jars.path command (17 seconds, 963 milliseconds)
[info] - postgreSQL/aggregates_part1.sql (17 seconds, 753 milliseconds)
[info] - postgreSQL/select.sql (3 seconds, 993 milliseconds)
[info] - SPARK-29022 Commands using SerDe provided in ADD JAR sql (20 seconds, 181 milliseconds)
[info] - postgreSQL/groupingsets.sql (12 seconds, 375 milliseconds)
[info] - SPARK-26321 Should not split semicolon within quoted string literals (16 seconds, 821 milliseconds)
[info] ThriftServerPageSuite:
[info] - thriftserver page should load successfully *** FAILED *** (570 milliseconds)
[info]   org.mockito.exceptions.base.MockitoException: ClassCastException occurred while creating the mockito mock :
[info]   class to mock : 'javax.servlet.http.HttpServletRequest', loaded by classloader : 'sun.misc.Launcher$AppClassLoader@f5f2bb7'
[info]   created class : 'org.mockito.codegen.HttpServletRequest$MockitoMock$2122027140', loaded by classloader : 'net.bytebuddy.dynamic.loading.MultipleParentClassLoader@5e516506'
[info]   proxy instance class : 'org.mockito.codegen.HttpServletRequest$MockitoMock$2122027140', loaded by classloader : 'net.bytebuddy.dynamic.loading.MultipleParentClassLoader@5e516506'
[info]   instance creation by : ObjenesisInstantiator
[info] 
[info] You might experience classloading issues, please ask the mockito mailing-list.
[info]   at org.apache.spark.sql.hive.thriftserver.ui.ThriftServerPageSuite.$anonfun$new$1(ThriftServerPageSuite.scala:50)
[info]   at org.scalatest.OutcomeOf.outcomeOf(OutcomeOf.scala:85)
[info]   at org.scalatest.OutcomeOf.outcomeOf$(OutcomeOf.scala:83)
[info]   at org.scalatest.OutcomeOf$.outcomeOf(OutcomeOf.scala:104)
[info]   at org.scalatest.Transformer.apply(Transformer.scala:22)
[info]   at org.scalatest.Transformer.apply(Transformer.scala:20)
[info]   at org.scalatest.FunSuiteLike$$anon$1.apply(FunSuiteLike.scala:186)
[info]   at org.apache.spark.SparkFunSuite.withFixture(SparkFunSuite.scala:149)
[info]   at org.scalatest.FunSuiteLike.invokeWithFixture$1(FunSuiteLike.scala:184)
[info]   at org.scalatest.FunSuiteLike.$anonfun$runTest$1(FunSuiteLike.scala:196)
[info]   at org.scalatest.SuperEngine.runTestImpl(Engine.scala:286)
[info]   at org.scalatest.FunSuiteLike.runTest(FunSuiteLike.scala:196)
[info]   at org.scalatest.FunSuiteLike.runTest$(FunSuiteLike.scala:178)
[info]   at org.apache.spark.SparkFunSuite.org$scalatest$BeforeAndAfterEach$$super$runTest(SparkFunSuite.scala:56)
[info]   at org.scalatest.BeforeAndAfterEach.runTest(BeforeAndAfterEach.scala:221)
[info]   at org.scalatest.BeforeAndAfterEach.runTest$(BeforeAndAfterEach.scala:214)
[info]   at org.apache.spark.SparkFunSuite.runTest(SparkFunSuite.scala:56)
[info]   at org.scalatest.FunSuiteLike.$anonfun$runTests$1(FunSuiteLike.scala:229)
[info]   at org.scalatest.SuperEngine.$anonfun$runTestsInBranch$1(Engine.scala:393)
[info]   at scala.collection.immutable.List.foreach(List.scala:392)
[info]   at org.scalatest.SuperEngine.traverseSubNodes$1(Engine.scala:381)
[info]   at org.scalatest.SuperEngine.runTestsInBranch(Engine.scala:376)
[info]   at org.scalatest.SuperEngine.runTestsImpl(Engine.scala:458)
[info]   at org.scalatest.FunSuiteLike.runTests(FunSuiteLike.scala:229)
[info]   at org.scalatest.FunSuiteLike.runTests$(FunSuiteLike.scala:228)
[info]   at org.scalatest.FunSuite.runTests(FunSuite.scala:1560)
[info]   at org.scalatest.Suite.run(Suite.scala:1124)
[info]   at org.scalatest.Suite.run$(Suite.scala:1106)
[info]   at org.scalatest.FunSuite.org$scalatest$FunSuiteLike$$super$run(FunSuite.scala:1560)
[info]   at org.scalatest.FunSuiteLike.$anonfun$run$1(FunSuiteLike.scala:233)
[info]   at org.scalatest.SuperEngine.runImpl(Engine.scala:518)
[info]   at org.scalatest.FunSuiteLike.run(FunSuiteLike.scala:233)
[info]   at org.scalatest.FunSuiteLike.run$(FunSuiteLike.scala:232)
[info]   at org.apache.spark.SparkFunSuite.org$scalatest$BeforeAndAfterAll$$super$run(SparkFunSuite.scala:56)
[info]   at org.scalatest.BeforeAndAfterAll.liftedTree1$1(BeforeAndAfterAll.scala:213)
[info]   at org.scalatest.BeforeAndAfterAll.run(BeforeAndAfterAll.scala:210)
[info]   at org.scalatest.BeforeAndAfterAll.run$(BeforeAndAfterAll.scala:208)
[info]   at org.apache.spark.SparkFunSuite.run(SparkFunSuite.scala:56)
[info]   at org.scalatest.tools.Framework.org$scalatest$tools$Framework$$runSuite(Framework.scala:317)
[info]   at org.scalatest.tools.Framework$ScalaTestTask.execute(Framework.scala:510)
[info]   at sbt.ForkMain$Run$2.call(ForkMain.java:296)
[info]   at sbt.ForkMain$Run$2.call(ForkMain.java:286)
[info]   at java.util.concurrent.FutureTask.run(FutureTask.java:266)
[info]   at java.util.concurrent.ThreadPoolExecutor.runWorker(ThreadPoolExecutor.java:1149)
[info]   at java.util.concurrent.ThreadPoolExecutor$Worker.run(ThreadPoolExecutor.java:624)
[info]   at java.lang.Thread.run(Thread.java:748)
[info]   Cause: java.lang.ClassCastException: org.mockito.codegen.HttpServletRequest$MockitoMock$2122027140 cannot be cast to org.mockito.internal.creation.bytebuddy.MockAccess
[info]   at org.mockito.internal.creation.bytebuddy.SubclassByteBuddyMockMaker.createMock(SubclassByteBuddyMockMaker.java:48)
[info]   at org.mockito.internal.creation.bytebuddy.ByteBuddyMockMaker.createMock(ByteBuddyMockMaker.java:25)
[info]   at org.mockito.internal.util.MockUtil.createMock(MockUtil.java:35)
[info]   at org.mockito.internal.MockitoCore.mock(MockitoCore.java:62)
[info]   at org.mockito.Mockito.mock(Mockito.java:1908)
[info]   at org.mockito.Mockito.mock(Mockito.java:1817)
[info]   at org.apache.spark.sql.hive.thriftserver.ui.ThriftServerPageSuite.$anonfun$new$1(ThriftServerPageSuite.scala:50)
[info]   at org.scalatest.OutcomeOf.outcomeOf(OutcomeOf.scala:85)
[info]   at org.scalatest.OutcomeOf.outcomeOf$(OutcomeOf.scala:83)
[info]   at org.scalatest.OutcomeOf$.outcomeOf(OutcomeOf.scala:104)
[info]   at org.scalatest.Transformer.apply(Transformer.scala:22)
[info]   at org.scalatest.Transformer.apply(Transformer.scala:20)
[info]   at org.scalatest.FunSuiteLike$$anon$1.apply(FunSuiteLike.scala:186)
[info]   at org.apache.spark.SparkFunSuite.withFixture(SparkFunSuite.scala:149)
[info]   at org.scalatest.FunSuiteLike.invokeWithFixture$1(FunSuiteLike.scala:184)
[info]   at org.scalatest.FunSuiteLike.$anonfun$runTest$1(FunSuiteLike.scala:196)
[info]   at org.scalatest.SuperEngine.runTestImpl(Engine.scala:286)
[info]   at org.scalatest.FunSuiteLike.runTest(FunSuiteLike.scala:196)
[info]   at org.scalatest.FunSuiteLike.runTest$(FunSuiteLike.scala:178)
[info]   at org.apache.spark.SparkFunSuite.org$scalatest$BeforeAndAfterEach$$super$runTest(SparkFunSuite.scala:56)
[info]   at org.scalatest.BeforeAndAfterEach.runTest(BeforeAndAfterEach.scala:221)
[info]   at org.scalatest.BeforeAndAfterEach.runTest$(BeforeAndAfterEach.scala:214)
[info]   at org.apache.spark.SparkFunSuite.runTest(SparkFunSuite.scala:56)
[info]   at org.scalatest.FunSuiteLike.$anonfun$runTests$1(FunSuiteLike.scala:229)
[info]   at org.scalatest.SuperEngine.$anonfun$runTestsInBranch$1(Engine.scala:393)
[info]   at scala.collection.immutable.List.foreach(List.scala:392)
[info]   at org.scalatest.SuperEngine.traverseSubNodes$1(Engine.scala:381)
[info]   at org.scalatest.SuperEngine.runTestsInBranch(Engine.scala:376)
[info]   at org.scalatest.SuperEngine.runTestsImpl(Engine.scala:458)
[info]   at org.scalatest.FunSuiteLike.runTests(FunSuiteLike.scala:229)
[info]   at org.scalatest.FunSuiteLike.runTests$(FunSuiteLike.scala:228)
[info]   at org.scalatest.FunSuite.runTests(FunSuite.scala:1560)
[info]   at org.scalatest.Suite.run(Suite.scala:1124)
[info]   at org.scalatest.Suite.run$(Suite.scala:1106)
[info]   at org.scalatest.FunSuite.org$scalatest$FunSuiteLike$$super$run(FunSuite.scala:1560)
[info]   at org.scalatest.FunSuiteLike.$anonfun$run$1(FunSuiteLike.scala:233)
[info]   at org.scalatest.SuperEngine.runImpl(Engine.scala:518)
[info]   at org.scalatest.FunSuiteLike.run(FunSuiteLike.scala:233)
[info]   at org.scalatest.FunSuiteLike.run$(FunSuiteLike.scala:232)
[info]   at org.apache.spark.SparkFunSuite.org$scalatest$BeforeAndAfterAll$$super$run(SparkFunSuite.scala:56)
[info]   at org.scalatest.BeforeAndAfterAll.liftedTree1$1(BeforeAndAfterAll.scala:213)
[info]   at org.scalatest.BeforeAndAfterAll.run(BeforeAndAfterAll.scala:210)
[info]   at org.scalatest.BeforeAndAfterAll.run$(BeforeAndAfterAll.scala:208)
[info]   at org.apache.spark.SparkFunSuite.run(SparkFunSuite.scala:56)
[info]   at org.scalatest.tools.Framework.org$scalatest$tools$Framework$$runSuite(Framework.scala:317)
[info]   at org.scalatest.tools.Framework$ScalaTestTask.execute(Framework.scala:510)
[info]   at sbt.ForkMain$Run$2.call(ForkMain.java:296)
[info]   at sbt.ForkMain$Run$2.call(ForkMain.java:286)
[info]   at java.util.concurrent.FutureTask.run(FutureTask.java:266)
[info]   at java.util.concurrent.ThreadPoolExecutor.runWorker(ThreadPoolExecutor.java:1149)
[info]   at java.util.concurrent.ThreadPoolExecutor$Worker.run(ThreadPoolExecutor.java:624)
[info]   at java.lang.Thread.run(Thread.java:748)
[info] - thriftserver session page should load successfully *** FAILED *** (1 millisecond)
[info]   org.mockito.exceptions.base.MockitoException: ClassCastException occurred while creating the mockito mock :
[info]   class to mock : 'javax.servlet.http.HttpServletRequest', loaded by classloader : 'sun.misc.Launcher$AppClassLoader@f5f2bb7'
[info]   created class : 'org.mockito.codegen.HttpServletRequest$MockitoMock$2122027140', loaded by classloader : 'net.bytebuddy.dynamic.loading.MultipleParentClassLoader@5e516506'
[info]   proxy instance class : 'org.mockito.codegen.HttpServletRequest$MockitoMock$2122027140', loaded by classloader : 'net.bytebuddy.dynamic.loading.MultipleParentClassLoader@5e516506'
[info]   instance creation by : ObjenesisInstantiator
[info] 
[info] You might experience classloading issues, please ask the mockito mailing-list.
[info]   at org.apache.spark.sql.hive.thriftserver.ui.ThriftServerPageSuite.$anonfun$new$2(ThriftServerPageSuite.scala:73)
[info]   at org.scalatest.OutcomeOf.outcomeOf(OutcomeOf.scala:85)
[info]   at org.scalatest.OutcomeOf.outcomeOf$(OutcomeOf.scala:83)
[info]   at org.scalatest.OutcomeOf$.outcomeOf(OutcomeOf.scala:104)
[info]   at org.scalatest.Transformer.apply(Transformer.scala:22)
[info]   at org.scalatest.Transformer.apply(Transformer.scala:20)
[info]   at org.scalatest.FunSuiteLike$$anon$1.apply(FunSuiteLike.scala:186)
[info]   at org.apache.spark.SparkFunSuite.withFixture(SparkFunSuite.scala:149)
[info]   at org.scalatest.FunSuiteLike.invokeWithFixture$1(FunSuiteLike.scala:184)
[info]   at org.scalatest.FunSuiteLike.$anonfun$runTest$1(FunSuiteLike.scala:196)
[info]   at org.scalatest.SuperEngine.runTestImpl(Engine.scala:286)
[info]   at org.scalatest.FunSuiteLike.runTest(FunSuiteLike.scala:196)
[info]   at org.scalatest.FunSuiteLike.runTest$(FunSuiteLike.scala:178)
[info]   at org.apache.spark.SparkFunSuite.org$scalatest$BeforeAndAfterEach$$super$runTest(SparkFunSuite.scala:56)
[info]   at org.scalatest.BeforeAndAfterEach.runTest(BeforeAndAfterEach.scala:221)
[info]   at org.scalatest.BeforeAndAfterEach.runTest$(BeforeAndAfterEach.scala:214)
[info]   at org.apache.spark.SparkFunSuite.runTest(SparkFunSuite.scala:56)
[info]   at org.scalatest.FunSuiteLike.$anonfun$runTests$1(FunSuiteLike.scala:229)
[info]   at org.scalatest.SuperEngine.$anonfun$runTestsInBranch$1(Engine.scala:393)
[info]   at scala.collection.immutable.List.foreach(List.scala:392)
[info]   at org.scalatest.SuperEngine.traverseSubNodes$1(Engine.scala:381)
[info]   at org.scalatest.SuperEngine.runTestsInBranch(Engine.scala:376)
[info]   at org.scalatest.SuperEngine.runTestsImpl(Engine.scala:458)
[info]   at org.scalatest.FunSuiteLike.runTests(FunSuiteLike.scala:229)
[info]   at org.scalatest.FunSuiteLike.runTests$(FunSuiteLike.scala:228)
[info]   at org.scalatest.FunSuite.runTests(FunSuite.scala:1560)
[info]   at org.scalatest.Suite.run(Suite.scala:1124)
[info]   at org.scalatest.Suite.run$(Suite.scala:1106)
[info]   at org.scalatest.FunSuite.org$scalatest$FunSuiteLike$$super$run(FunSuite.scala:1560)
[info]   at org.scalatest.FunSuiteLike.$anonfun$run$1(FunSuiteLike.scala:233)
[info]   at org.scalatest.SuperEngine.runImpl(Engine.scala:518)
[info]   at org.scalatest.FunSuiteLike.run(FunSuiteLike.scala:233)
[info]   at org.scalatest.FunSuiteLike.run$(FunSuiteLike.scala:232)
[info]   at org.apache.spark.SparkFunSuite.org$scalatest$BeforeAndAfterAll$$super$run(SparkFunSuite.scala:56)
[info]   at org.scalatest.BeforeAndAfterAll.liftedTree1$1(BeforeAndAfterAll.scala:213)
[info]   at org.scalatest.BeforeAndAfterAll.run(BeforeAndAfterAll.scala:210)
[info]   at org.scalatest.BeforeAndAfterAll.run$(BeforeAndAfterAll.scala:208)
[info]   at org.apache.spark.SparkFunSuite.run(SparkFunSuite.scala:56)
[info]   at org.scalatest.tools.Framework.org$scalatest$tools$Framework$$runSuite(Framework.scala:317)
[info]   at org.scalatest.tools.Framework$ScalaTestTask.execute(Framework.scala:510)
[info]   at sbt.ForkMain$Run$2.call(ForkMain.java:296)
[info]   at sbt.ForkMain$Run$2.call(ForkMain.java:286)
[info]   at java.util.concurrent.FutureTask.run(FutureTask.java:266)
[info]   at java.util.concurrent.ThreadPoolExecutor.runWorker(ThreadPoolExecutor.java:1149)
[info]   at java.util.concurrent.ThreadPoolExecutor$Worker.run(ThreadPoolExecutor.java:624)
[info]   at java.lang.Thread.run(Thread.java:748)
[info]   Cause: java.lang.ClassCastException: org.mockito.codegen.HttpServletRequest$MockitoMock$2122027140 cannot be cast to org.mockito.internal.creation.bytebuddy.MockAccess
[info]   at org.mockito.internal.creation.bytebuddy.SubclassByteBuddyMockMaker.createMock(SubclassByteBuddyMockMaker.java:48)
[info]   at org.mockito.internal.creation.bytebuddy.ByteBuddyMockMaker.createMock(ByteBuddyMockMaker.java:25)
[info]   at org.mockito.internal.util.MockUtil.createMock(MockUtil.java:35)
[info]   at org.mockito.internal.MockitoCore.mock(MockitoCore.java:62)
[info]   at org.mockito.Mockito.mock(Mockito.java:1908)
[info]   at org.mockito.Mockito.mock(Mockito.java:1817)
[info]   at org.apache.spark.sql.hive.thriftserver.ui.ThriftServerPageSuite.$anonfun$new$2(ThriftServerPageSuite.scala:73)
[info]   at org.scalatest.OutcomeOf.outcomeOf(OutcomeOf.scala:85)
[info]   at org.scalatest.OutcomeOf.outcomeOf$(OutcomeOf.scala:83)
[info]   at org.scalatest.OutcomeOf$.outcomeOf(OutcomeOf.scala:104)
[info]   at org.scalatest.Transformer.apply(Transformer.scala:22)
[info]   at org.scalatest.Transformer.apply(Transformer.scala:20)
[info]   at org.scalatest.FunSuiteLike$$anon$1.apply(FunSuiteLike.scala:186)
[info]   at org.apache.spark.SparkFunSuite.withFixture(SparkFunSuite.scala:149)
[info]   at org.scalatest.FunSuiteLike.invokeWithFixture$1(FunSuiteLike.scala:184)
[info]   at org.scalatest.FunSuiteLike.$anonfun$runTest$1(FunSuiteLike.scala:196)
[info]   at org.scalatest.SuperEngine.runTestImpl(Engine.scala:286)
[info]   at org.scalatest.FunSuiteLike.runTest(FunSuiteLike.scala:196)
[info]   at org.scalatest.FunSuiteLike.runTest$(FunSuiteLike.scala:178)
[info]   at org.apache.spark.SparkFunSuite.org$scalatest$BeforeAndAfterEach$$super$runTest(SparkFunSuite.scala:56)
[info]   at org.scalatest.BeforeAndAfterEach.runTest(BeforeAndAfterEach.scala:221)
[info]   at org.scalatest.BeforeAndAfterEach.runTest$(BeforeAndAfterEach.scala:214)
[info]   at org.apache.spark.SparkFunSuite.runTest(SparkFunSuite.scala:56)
[info]   at org.scalatest.FunSuiteLike.$anonfun$runTests$1(FunSuiteLike.scala:229)
[info]   at org.scalatest.SuperEngine.$anonfun$runTestsInBranch$1(Engine.scala:393)
[info]   at scala.collection.immutable.List.foreach(List.scala:392)
[info]   at org.scalatest.SuperEngine.traverseSubNodes$1(Engine.scala:381)
[info]   at org.scalatest.SuperEngine.runTestsInBranch(Engine.scala:376)
[info]   at org.scalatest.SuperEngine.runTestsImpl(Engine.scala:458)
[info]   at org.scalatest.FunSuiteLike.runTests(FunSuiteLike.scala:229)
[info]   at org.scalatest.FunSuiteLike.runTests$(FunSuiteLike.scala:228)
[info]   at org.scalatest.FunSuite.runTests(FunSuite.scala:1560)
[info]   at org.scalatest.Suite.run(Suite.scala:1124)
[info]   at org.scalatest.Suite.run$(Suite.scala:1106)
[info]   at org.scalatest.FunSuite.org$scalatest$FunSuiteLike$$super$run(FunSuite.scala:1560)
[info]   at org.scalatest.FunSuiteLike.$anonfun$run$1(FunSuiteLike.scala:233)
[info]   at org.scalatest.SuperEngine.runImpl(Engine.scala:518)
[info]   at org.scalatest.FunSuiteLike.run(FunSuiteLike.scala:233)
[info]   at org.scalatest.FunSuiteLike.run$(FunSuiteLike.scala:232)
[info]   at org.apache.spark.SparkFunSuite.org$scalatest$BeforeAndAfterAll$$super$run(SparkFunSuite.scala:56)
[info]   at org.scalatest.BeforeAndAfterAll.liftedTree1$1(BeforeAndAfterAll.scala:213)
[info]   at org.scalatest.BeforeAndAfterAll.run(BeforeAndAfterAll.scala:210)
[info]   at org.scalatest.BeforeAndAfterAll.run$(BeforeAndAfterAll.scala:208)
[info]   at org.apache.spark.SparkFunSuite.run(SparkFunSuite.scala:56)
[info]   at org.scalatest.tools.Framework.org$scalatest$tools$Framework$$runSuite(Framework.scala:317)
[info]   at org.scalatest.tools.Framework$ScalaTestTask.execute(Framework.scala:510)
[info]   at sbt.ForkMain$Run$2.call(ForkMain.java:296)
[info]   at sbt.ForkMain$Run$2.call(ForkMain.java:286)
[info]   at java.util.concurrent.FutureTask.run(FutureTask.java:266)
[info]   at java.util.concurrent.ThreadPoolExecutor.runWorker(ThreadPoolExecutor.java:1149)
[info]   at java.util.concurrent.ThreadPoolExecutor$Worker.run(ThreadPoolExecutor.java:624)
[info]   at java.lang.Thread.run(Thread.java:748)
[info] HiveCliSessionStateSuite:
[info] - CliSessionState will be reused (5 seconds, 552 milliseconds)
[info] - SessionState will not be reused (5 seconds, 494 milliseconds)
[info] JdbcConnectionUriSuite:
[info] - postgreSQL/window_part1.sql (24 seconds, 320 milliseconds)
[info] - postgreSQL/aggregates_part4.sql (525 milliseconds)
[info] - postgreSQL/create_view.sql (3 seconds, 933 milliseconds)
[info] - postgreSQL/select_distinct.sql (2 seconds, 401 milliseconds)
[info] - postgreSQL/case.sql !!! IGNORED !!!
[info] - postgreSQL/window_part2.sql (10 seconds, 975 milliseconds)
[info] - SPARK-17819 Support default database in connection URIs (1 second, 853 milliseconds)
[info] - postgreSQL/numeric.sql (1 minute, 21 seconds)
[info] - ansi/decimalArithmeticOperations.sql !!! IGNORED !!!
[info] - ansi/higher-order-functions.sql (1 second, 491 milliseconds)
[info] - ansi/literals.sql !!! IGNORED !!!
[info] - ansi/interval.sql (5 seconds, 792 milliseconds)
[info] - subquery/subquery-in-from.sql (520 milliseconds)
[info] - subquery/exists-subquery/exists-within-and-or.sql (975 milliseconds)
[info] - subquery/exists-subquery/exists-having.sql (2 seconds, 173 milliseconds)
[info] - subquery/exists-subquery/exists-aggregate.sql (6 seconds, 592 milliseconds)
[info] - subquery/exists-subquery/exists-cte.sql (2 seconds, 258 milliseconds)
[info] - subquery/exists-subquery/exists-orderby-limit.sql (6 seconds, 329 milliseconds)
[info] - subquery/exists-subquery/exists-joins-and-set-ops.sql (45 seconds, 794 milliseconds)
[info] - subquery/exists-subquery/exists-basic.sql (1 second, 369 milliseconds)
[info] - subquery/negative-cases/invalid-correlation.sql (299 milliseconds)
[info] - subquery/negative-cases/subq-input-typecheck.sql (316 milliseconds)
[info] - subquery/in-subquery/in-joins.sql (1 minute, 52 seconds)
[info] - subquery/in-subquery/in-group-by.sql !!! IGNORED !!!
[info] - subquery/in-subquery/in-basic.sql (606 milliseconds)
[info] - subquery/in-subquery/not-in-unit-tests-multi-column-literal.sql (376 milliseconds)
[info] - subquery/in-subquery/in-limit.sql !!! IGNORED !!!
[info] - subquery/in-subquery/in-order-by.sql !!! IGNORED !!!
[info] - subquery/in-subquery/not-in-unit-tests-multi-column.sql (926 milliseconds)
[info] - subquery/in-subquery/in-set-operations.sql !!! IGNORED !!!
[info] - subquery/in-subquery/not-in-joins.sql (3 seconds, 361 milliseconds)
[info] - subquery/in-subquery/in-multiple-columns.sql (1 second, 457 milliseconds)
[info] - subquery/in-subquery/in-having.sql (3 seconds, 185 milliseconds)
[info] - subquery/in-subquery/in-with-cte.sql (5 seconds, 864 milliseconds)
[info] - subquery/in-subquery/not-in-unit-tests-single-column-literal.sql (411 milliseconds)
[info] - subquery/in-subquery/not-in-group-by.sql (5 seconds, 651 milliseconds)
[info] - subquery/in-subquery/simple-in.sql !!! IGNORED !!!
[info] - subquery/in-subquery/not-in-unit-tests-single-column.sql (1 second, 93 milliseconds)
[info] - subquery/scalar-subquery/scalar-subquery-predicate.sql !!! IGNORED !!!
[info] - subquery/scalar-subquery/scalar-subquery-select.sql (3 seconds, 810 milliseconds)
[info] - Check if ThriftServer can work (110 milliseconds)
[info] ScalaTest
[info] Run completed in 17 minutes, 11 seconds.
[info] Total number of tests run: 410
[info] Suites: completed 14, aborted 1
[info] Tests: succeeded 407, failed 3, canceled 0, ignored 17, pending 0
[info] *** 1 SUITE ABORTED ***
[info] *** 3 TESTS FAILED ***
[error] Error: Total 411, Failed 3, Errors 1, Passed 407, Ignored 17
[error] Failed tests:
[error] 	org.apache.spark.sql.hive.thriftserver.ui.ThriftServerPageSuite
[error] 	org.apache.spark.sql.hive.thriftserver.SparkMetadataOperationSuite
[error] Error during tests:
[error] 	org.apache.spark.sql.hive.thriftserver.ThriftServerWithSparkContextSuite
[error] (hive-thriftserver/test:test) sbt.TestsFailedException: Tests unsuccessful
[error] Total time: 1058 s, completed Nov 28, 2019 8:05:50 AM
[error] running /home/jenkins/workspace/NewSparkPullRequestBuilder/build/sbt -Phadoop-2.7 -Phive -Phive-thriftserver -Dtest.exclude.tags=org.apache.spark.tags.ExtendedHiveTest,org.apache.spark.tags.ExtendedYarnTest hive/test mllib/test examples/test repl/test hive-thriftserver/test avro/test sql/test sql-kafka-0-10/test ; received return code 1
Attempting to post to Github...
 > Post successful.
Build step 'Execute shell' marked build as failure
Archiving artifacts
Recording test results
Finished: FAILURE