FailedConsole Output

Skipping 20,448 KB.. Full Log
QLTestUtils$$super$withTempDir(OrcTest.scala:50)
	at org.apache.spark.sql.test.SQLTestUtils.withTempDir(SQLTestUtils.scala:75)
	at org.apache.spark.sql.test.SQLTestUtils.withTempDir$(SQLTestUtils.scala:74)
	at org.apache.spark.sql.execution.datasources.orc.OrcTest.withTempDir(OrcTest.scala:50)
	at org.apache.spark.sql.execution.datasources.orc.OrcQueryTest.testAllCorruptFiles$1(OrcQuerySuite.scala:564)
	at org.apache.spark.sql.execution.datasources.orc.OrcQueryTest.$anonfun$new$156(OrcQuerySuite.scala:591)
	at scala.runtime.java8.JFunction0$mcV$sp.apply(JFunction0$mcV$sp.java:23)
	at org.scalatest.Assertions.intercept(Assertions.scala:807)
	at org.scalatest.Assertions.intercept$(Assertions.scala:804)
	at org.scalatest.FunSuite.intercept(FunSuite.scala:1560)
	at org.apache.spark.sql.execution.datasources.orc.OrcQueryTest.$anonfun$new$155(OrcQuerySuite.scala:590)
	at org.apache.spark.sql.catalyst.plans.SQLHelper.withSQLConf(SQLHelper.scala:52)
	at org.apache.spark.sql.catalyst.plans.SQLHelper.withSQLConf$(SQLHelper.scala:36)
	at org.apache.spark.sql.execution.datasources.orc.OrcTest.org$apache$spark$sql$test$SQLTestUtilsBase$$super$withSQLConf(OrcTest.scala:50)
	at org.apache.spark.sql.test.SQLTestUtilsBase.withSQLConf(SQLTestUtils.scala:231)
	at org.apache.spark.sql.test.SQLTestUtilsBase.withSQLConf$(SQLTestUtils.scala:229)
	at org.apache.spark.sql.execution.datasources.orc.OrcTest.withSQLConf(OrcTest.scala:50)
	at org.apache.spark.sql.execution.datasources.orc.OrcQueryTest.$anonfun$new$148(OrcQuerySuite.scala:587)
	at scala.runtime.java8.JFunction0$mcV$sp.apply(JFunction0$mcV$sp.java:23)
	at org.scalatest.OutcomeOf.outcomeOf(OutcomeOf.scala:85)
	at org.scalatest.OutcomeOf.outcomeOf$(OutcomeOf.scala:83)
	at org.scalatest.OutcomeOf$.outcomeOf(OutcomeOf.scala:104)
	at org.scalatest.Transformer.apply(Transformer.scala:22)
	at org.scalatest.Transformer.apply(Transformer.scala:20)
	at org.scalatest.FunSuiteLike$$anon$1.apply(FunSuiteLike.scala:186)
	at org.apache.spark.SparkFunSuite.withFixture(SparkFunSuite.scala:149)
	at org.scalatest.FunSuiteLike.invokeWithFixture$1(FunSuiteLike.scala:184)
	at org.scalatest.FunSuiteLike.$anonfun$runTest$1(FunSuiteLike.scala:196)
	at org.scalatest.SuperEngine.runTestImpl(Engine.scala:286)
	at org.scalatest.FunSuiteLike.runTest(FunSuiteLike.scala:196)
	at org.scalatest.FunSuiteLike.runTest$(FunSuiteLike.scala:178)
	at org.apache.spark.SparkFunSuite.org$scalatest$BeforeAndAfterEach$$super$runTest(SparkFunSuite.scala:56)
	at org.scalatest.BeforeAndAfterEach.runTest(BeforeAndAfterEach.scala:221)
	at org.scalatest.BeforeAndAfterEach.runTest$(BeforeAndAfterEach.scala:214)
	at org.apache.spark.SparkFunSuite.runTest(SparkFunSuite.scala:56)
	at org.scalatest.FunSuiteLike.$anonfun$runTests$1(FunSuiteLike.scala:229)
	at org.scalatest.SuperEngine.$anonfun$runTestsInBranch$1(Engine.scala:393)
	at scala.collection.immutable.List.foreach(List.scala:392)
	at org.scalatest.SuperEngine.traverseSubNodes$1(Engine.scala:381)
	at org.scalatest.SuperEngine.runTestsInBranch(Engine.scala:376)
	at org.scalatest.SuperEngine.runTestsImpl(Engine.scala:458)
	at org.scalatest.FunSuiteLike.runTests(FunSuiteLike.scala:229)
	at org.scalatest.FunSuiteLike.runTests$(FunSuiteLike.scala:228)
	at org.scalatest.FunSuite.runTests(FunSuite.scala:1560)
	at org.scalatest.Suite.run(Suite.scala:1124)
	at org.scalatest.Suite.run$(Suite.scala:1106)
	at org.scalatest.FunSuite.org$scalatest$FunSuiteLike$$super$run(FunSuite.scala:1560)
	at org.scalatest.FunSuiteLike.$anonfun$run$1(FunSuiteLike.scala:233)
	at org.scalatest.SuperEngine.runImpl(Engine.scala:518)
	at org.scalatest.FunSuiteLike.run(FunSuiteLike.scala:233)
	at org.scalatest.FunSuiteLike.run$(FunSuiteLike.scala:232)
	at org.apache.spark.SparkFunSuite.org$scalatest$BeforeAndAfterAll$$super$run(SparkFunSuite.scala:56)
	at org.scalatest.BeforeAndAfterAll.liftedTree1$1(BeforeAndAfterAll.scala:213)
	at org.scalatest.BeforeAndAfterAll.run(BeforeAndAfterAll.scala:210)
	at org.scalatest.BeforeAndAfterAll.run$(BeforeAndAfterAll.scala:208)
	at org.apache.spark.SparkFunSuite.run(SparkFunSuite.scala:56)
	at org.scalatest.tools.Framework.org$scalatest$tools$Framework$$runSuite(Framework.scala:317)
	at org.scalatest.tools.Framework$ScalaTestTask.execute(Framework.scala:510)
	at sbt.ForkMain$Run$2.call(ForkMain.java:296)
	at sbt.ForkMain$Run$2.call(ForkMain.java:286)
	at java.util.concurrent.FutureTask.run(FutureTask.java:266)
	at java.util.concurrent.ThreadPoolExecutor.runWorker(ThreadPoolExecutor.java:1149)
	at java.util.concurrent.ThreadPoolExecutor$Worker.run(ThreadPoolExecutor.java:624)
	at java.lang.Thread.run(Thread.java:748)
07:47:59.894 WARN org.apache.spark.sql.hive.orc.OrcFileOperator: Skipped the footer in the corrupted file: file:/home/jenkins/workspace/NewSparkPullRequestBuilder/target/tmp/spark-2dde9011-bd34-4350-b6ce-9e618297207d/second/part-00000-69ecc4e3-49fe-4fd1-bb77-fa61da9b63d0-c000.json
org.apache.orc.FileFormatException: Malformed ORC file file:/home/jenkins/workspace/NewSparkPullRequestBuilder/target/tmp/spark-2dde9011-bd34-4350-b6ce-9e618297207d/second/part-00000-69ecc4e3-49fe-4fd1-bb77-fa61da9b63d0-c000.json. Invalid postscript.
	at org.apache.orc.impl.ReaderImpl.ensureOrcFooter(ReaderImpl.java:274)
	at org.apache.orc.impl.ReaderImpl.extractFileTail(ReaderImpl.java:581)
	at org.apache.orc.impl.ReaderImpl.<init>(ReaderImpl.java:369)
	at org.apache.hadoop.hive.ql.io.orc.ReaderImpl.<init>(ReaderImpl.java:63)
	at org.apache.hadoop.hive.ql.io.orc.OrcFile.createReader(OrcFile.java:55)
	at org.apache.spark.sql.hive.orc.OrcFileOperator$.$anonfun$getFileReader$3(OrcFileOperator.scala:76)
	at scala.collection.Iterator$$anon$10.next(Iterator.scala:459)
	at scala.collection.TraversableOnce.collectFirst(TraversableOnce.scala:148)
	at scala.collection.TraversableOnce.collectFirst$(TraversableOnce.scala:135)
	at scala.collection.AbstractIterator.collectFirst(Iterator.scala:1429)
	at org.apache.spark.sql.hive.orc.OrcFileOperator$.getFileReader(OrcFileOperator.scala:87)
	at org.apache.spark.sql.hive.orc.OrcFileOperator$.$anonfun$readSchema$1(OrcFileOperator.scala:96)
	at scala.collection.Iterator$$anon$10.next(Iterator.scala:459)
	at scala.collection.TraversableOnce.collectFirst(TraversableOnce.scala:148)
	at scala.collection.TraversableOnce.collectFirst$(TraversableOnce.scala:135)
	at scala.collection.AbstractIterator.collectFirst(Iterator.scala:1429)
	at org.apache.spark.sql.hive.orc.OrcFileOperator$.readSchema(OrcFileOperator.scala:96)
	at org.apache.spark.sql.hive.orc.OrcFileFormat.inferSchema(OrcFileFormat.scala:81)
	at org.apache.spark.sql.execution.datasources.DataSource.$anonfun$getOrInferFileFormatSchema$11(DataSource.scala:193)
	at scala.Option.orElse(Option.scala:447)
	at org.apache.spark.sql.execution.datasources.DataSource.getOrInferFileFormatSchema(DataSource.scala:190)
	at org.apache.spark.sql.execution.datasources.DataSource.resolveRelation(DataSource.scala:401)
	at org.apache.spark.sql.DataFrameReader.loadV1Source(DataFrameReader.scala:240)
	at org.apache.spark.sql.DataFrameReader.$anonfun$load$2(DataFrameReader.scala:229)
	at scala.Option.getOrElse(Option.scala:189)
	at org.apache.spark.sql.DataFrameReader.load(DataFrameReader.scala:229)
	at org.apache.spark.sql.DataFrameReader.orc(DataFrameReader.scala:695)
	at org.apache.spark.sql.execution.datasources.orc.OrcQueryTest.$anonfun$new$153(OrcQuerySuite.scala:570)
	at org.apache.spark.sql.execution.datasources.orc.OrcQueryTest.$anonfun$new$153$adapted(OrcQuerySuite.scala:564)
	at org.apache.spark.sql.test.SQLTestUtils.$anonfun$withTempDir$1(SQLTestUtils.scala:76)
	at org.apache.spark.sql.test.SQLTestUtils.$anonfun$withTempDir$1$adapted(SQLTestUtils.scala:75)
	at org.apache.spark.SparkFunSuite.withTempDir(SparkFunSuite.scala:161)
	at org.apache.spark.sql.execution.datasources.orc.OrcTest.org$apache$spark$sql$test$SQLTestUtils$$super$withTempDir(OrcTest.scala:50)
	at org.apache.spark.sql.test.SQLTestUtils.withTempDir(SQLTestUtils.scala:75)
	at org.apache.spark.sql.test.SQLTestUtils.withTempDir$(SQLTestUtils.scala:74)
	at org.apache.spark.sql.execution.datasources.orc.OrcTest.withTempDir(OrcTest.scala:50)
	at org.apache.spark.sql.execution.datasources.orc.OrcQueryTest.testAllCorruptFiles$1(OrcQuerySuite.scala:564)
	at org.apache.spark.sql.execution.datasources.orc.OrcQueryTest.$anonfun$new$156(OrcQuerySuite.scala:591)
	at scala.runtime.java8.JFunction0$mcV$sp.apply(JFunction0$mcV$sp.java:23)
	at org.scalatest.Assertions.intercept(Assertions.scala:807)
	at org.scalatest.Assertions.intercept$(Assertions.scala:804)
	at org.scalatest.FunSuite.intercept(FunSuite.scala:1560)
	at org.apache.spark.sql.execution.datasources.orc.OrcQueryTest.$anonfun$new$155(OrcQuerySuite.scala:590)
	at org.apache.spark.sql.catalyst.plans.SQLHelper.withSQLConf(SQLHelper.scala:52)
	at org.apache.spark.sql.catalyst.plans.SQLHelper.withSQLConf$(SQLHelper.scala:36)
	at org.apache.spark.sql.execution.datasources.orc.OrcTest.org$apache$spark$sql$test$SQLTestUtilsBase$$super$withSQLConf(OrcTest.scala:50)
	at org.apache.spark.sql.test.SQLTestUtilsBase.withSQLConf(SQLTestUtils.scala:231)
	at org.apache.spark.sql.test.SQLTestUtilsBase.withSQLConf$(SQLTestUtils.scala:229)
	at org.apache.spark.sql.execution.datasources.orc.OrcTest.withSQLConf(OrcTest.scala:50)
	at org.apache.spark.sql.execution.datasources.orc.OrcQueryTest.$anonfun$new$148(OrcQuerySuite.scala:587)
	at scala.runtime.java8.JFunction0$mcV$sp.apply(JFunction0$mcV$sp.java:23)
	at org.scalatest.OutcomeOf.outcomeOf(OutcomeOf.scala:85)
	at org.scalatest.OutcomeOf.outcomeOf$(OutcomeOf.scala:83)
	at org.scalatest.OutcomeOf$.outcomeOf(OutcomeOf.scala:104)
	at org.scalatest.Transformer.apply(Transformer.scala:22)
	at org.scalatest.Transformer.apply(Transformer.scala:20)
	at org.scalatest.FunSuiteLike$$anon$1.apply(FunSuiteLike.scala:186)
	at org.apache.spark.SparkFunSuite.withFixture(SparkFunSuite.scala:149)
	at org.scalatest.FunSuiteLike.invokeWithFixture$1(FunSuiteLike.scala:184)
	at org.scalatest.FunSuiteLike.$anonfun$runTest$1(FunSuiteLike.scala:196)
	at org.scalatest.SuperEngine.runTestImpl(Engine.scala:286)
	at org.scalatest.FunSuiteLike.runTest(FunSuiteLike.scala:196)
	at org.scalatest.FunSuiteLike.runTest$(FunSuiteLike.scala:178)
	at org.apache.spark.SparkFunSuite.org$scalatest$BeforeAndAfterEach$$super$runTest(SparkFunSuite.scala:56)
	at org.scalatest.BeforeAndAfterEach.runTest(BeforeAndAfterEach.scala:221)
	at org.scalatest.BeforeAndAfterEach.runTest$(BeforeAndAfterEach.scala:214)
	at org.apache.spark.SparkFunSuite.runTest(SparkFunSuite.scala:56)
	at org.scalatest.FunSuiteLike.$anonfun$runTests$1(FunSuiteLike.scala:229)
	at org.scalatest.SuperEngine.$anonfun$runTestsInBranch$1(Engine.scala:393)
	at scala.collection.immutable.List.foreach(List.scala:392)
	at org.scalatest.SuperEngine.traverseSubNodes$1(Engine.scala:381)
	at org.scalatest.SuperEngine.runTestsInBranch(Engine.scala:376)
	at org.scalatest.SuperEngine.runTestsImpl(Engine.scala:458)
	at org.scalatest.FunSuiteLike.runTests(FunSuiteLike.scala:229)
	at org.scalatest.FunSuiteLike.runTests$(FunSuiteLike.scala:228)
	at org.scalatest.FunSuite.runTests(FunSuite.scala:1560)
	at org.scalatest.Suite.run(Suite.scala:1124)
	at org.scalatest.Suite.run$(Suite.scala:1106)
	at org.scalatest.FunSuite.org$scalatest$FunSuiteLike$$super$run(FunSuite.scala:1560)
	at org.scalatest.FunSuiteLike.$anonfun$run$1(FunSuiteLike.scala:233)
	at org.scalatest.SuperEngine.runImpl(Engine.scala:518)
	at org.scalatest.FunSuiteLike.run(FunSuiteLike.scala:233)
	at org.scalatest.FunSuiteLike.run$(FunSuiteLike.scala:232)
	at org.apache.spark.SparkFunSuite.org$scalatest$BeforeAndAfterAll$$super$run(SparkFunSuite.scala:56)
	at org.scalatest.BeforeAndAfterAll.liftedTree1$1(BeforeAndAfterAll.scala:213)
	at org.scalatest.BeforeAndAfterAll.run(BeforeAndAfterAll.scala:210)
	at org.scalatest.BeforeAndAfterAll.run$(BeforeAndAfterAll.scala:208)
	at org.apache.spark.SparkFunSuite.run(SparkFunSuite.scala:56)
	at org.scalatest.tools.Framework.org$scalatest$tools$Framework$$runSuite(Framework.scala:317)
	at org.scalatest.tools.Framework$ScalaTestTask.execute(Framework.scala:510)
	at sbt.ForkMain$Run$2.call(ForkMain.java:296)
	at sbt.ForkMain$Run$2.call(ForkMain.java:286)
	at java.util.concurrent.FutureTask.run(FutureTask.java:266)
	at java.util.concurrent.ThreadPoolExecutor.runWorker(ThreadPoolExecutor.java:1149)
	at java.util.concurrent.ThreadPoolExecutor$Worker.run(ThreadPoolExecutor.java:624)
	at java.lang.Thread.run(Thread.java:748)
07:48:00.612 WARN org.apache.spark.sql.hive.orc.OrcFileOperator: Skipped the footer in the corrupted file: file:/home/jenkins/workspace/NewSparkPullRequestBuilder/target/tmp/spark-b7c9a31a-bb89-41f6-858a-4861188d723f/first/part-00000-6bfe36f5-0911-413f-b794-86a82fda0273-c000.json
org.apache.orc.FileFormatException: Malformed ORC file file:/home/jenkins/workspace/NewSparkPullRequestBuilder/target/tmp/spark-b7c9a31a-bb89-41f6-858a-4861188d723f/first/part-00000-6bfe36f5-0911-413f-b794-86a82fda0273-c000.json. Invalid postscript.
	at org.apache.orc.impl.ReaderImpl.ensureOrcFooter(ReaderImpl.java:274)
	at org.apache.orc.impl.ReaderImpl.extractFileTail(ReaderImpl.java:581)
	at org.apache.orc.impl.ReaderImpl.<init>(ReaderImpl.java:369)
	at org.apache.hadoop.hive.ql.io.orc.ReaderImpl.<init>(ReaderImpl.java:63)
	at org.apache.hadoop.hive.ql.io.orc.OrcFile.createReader(OrcFile.java:55)
	at org.apache.spark.sql.hive.orc.OrcFileOperator$.$anonfun$getFileReader$3(OrcFileOperator.scala:76)
	at scala.collection.Iterator$$anon$10.next(Iterator.scala:459)
	at scala.collection.TraversableOnce.collectFirst(TraversableOnce.scala:148)
	at scala.collection.TraversableOnce.collectFirst$(TraversableOnce.scala:135)
	at scala.collection.AbstractIterator.collectFirst(Iterator.scala:1429)
	at org.apache.spark.sql.hive.orc.OrcFileOperator$.getFileReader(OrcFileOperator.scala:87)
	at org.apache.spark.sql.hive.orc.OrcFileOperator$.$anonfun$readSchema$1(OrcFileOperator.scala:96)
	at scala.collection.Iterator$$anon$10.next(Iterator.scala:459)
	at scala.collection.TraversableOnce.collectFirst(TraversableOnce.scala:148)
	at scala.collection.TraversableOnce.collectFirst$(TraversableOnce.scala:135)
	at scala.collection.AbstractIterator.collectFirst(Iterator.scala:1429)
	at org.apache.spark.sql.hive.orc.OrcFileOperator$.readSchema(OrcFileOperator.scala:96)
	at org.apache.spark.sql.hive.orc.OrcFileFormat.$anonfun$buildReader$2(OrcFileFormat.scala:163)
	at org.apache.spark.sql.execution.datasources.FileFormat$$anon$1.apply(FileFormat.scala:147)
	at org.apache.spark.sql.execution.datasources.FileFormat$$anon$1.apply(FileFormat.scala:132)
	at org.apache.spark.sql.execution.datasources.FileScanRDD$$anon$1.org$apache$spark$sql$execution$datasources$FileScanRDD$$anon$$readCurrentFile(FileScanRDD.scala:116)
	at org.apache.spark.sql.execution.datasources.FileScanRDD$$anon$1$$anon$2.internalIter$lzycompute(FileScanRDD.scala:141)
	at org.apache.spark.sql.execution.datasources.FileScanRDD$$anon$1$$anon$2.internalIter(FileScanRDD.scala:141)
	at org.apache.spark.sql.execution.datasources.FileScanRDD$$anon$1$$anon$2.getNext(FileScanRDD.scala:145)
	at org.apache.spark.util.NextIterator.hasNext(NextIterator.scala:73)
	at org.apache.spark.sql.execution.datasources.FileScanRDD$$anon$1.hasNext(FileScanRDD.scala:93)
	at org.apache.spark.sql.execution.datasources.FileScanRDD$$anon$1.nextIterator(FileScanRDD.scala:173)
	at org.apache.spark.sql.execution.datasources.FileScanRDD$$anon$1.hasNext(FileScanRDD.scala:93)
	at scala.collection.Iterator$$anon$10.hasNext(Iterator.scala:458)
	at org.apache.spark.sql.catalyst.expressions.GeneratedClass$GeneratedIteratorForCodegenStage1.agg_doAggregateWithoutKey_0$(generated.java:33)
	at org.apache.spark.sql.catalyst.expressions.GeneratedClass$GeneratedIteratorForCodegenStage1.processNext(generated.java:63)
	at org.apache.spark.sql.execution.BufferedRowIterator.hasNext(BufferedRowIterator.java:43)
	at org.apache.spark.sql.execution.WholeStageCodegenExec$$anon$1.hasNext(WholeStageCodegenExec.scala:726)
	at scala.collection.Iterator$$anon$10.hasNext(Iterator.scala:458)
	at org.apache.spark.shuffle.sort.BypassMergeSortShuffleWriter.write(BypassMergeSortShuffleWriter.java:132)
	at org.apache.spark.shuffle.ShuffleWriteProcessor.write(ShuffleWriteProcessor.scala:59)
	at org.apache.spark.scheduler.ShuffleMapTask.runTask(ShuffleMapTask.scala:99)
	at org.apache.spark.scheduler.ShuffleMapTask.runTask(ShuffleMapTask.scala:52)
	at org.apache.spark.scheduler.Task.run(Task.scala:127)
	at org.apache.spark.executor.Executor$TaskRunner.$anonfun$run$3(Executor.scala:441)
	at org.apache.spark.util.Utils$.tryWithSafeFinally(Utils.scala:1377)
	at org.apache.spark.executor.Executor$TaskRunner.run(Executor.scala:444)
	at java.util.concurrent.ThreadPoolExecutor.runWorker(ThreadPoolExecutor.java:1149)
	at java.util.concurrent.ThreadPoolExecutor$Worker.run(ThreadPoolExecutor.java:624)
	at java.lang.Thread.run(Thread.java:748)
07:48:00.614 WARN org.apache.spark.sql.hive.orc.OrcFileOperator: Skipped the footer in the corrupted file: file:/home/jenkins/workspace/NewSparkPullRequestBuilder/target/tmp/spark-b7c9a31a-bb89-41f6-858a-4861188d723f/second/part-00000-09b1fb64-0da6-470a-9562-d6806a1bc3eb-c000.json
org.apache.orc.FileFormatException: Malformed ORC file file:/home/jenkins/workspace/NewSparkPullRequestBuilder/target/tmp/spark-b7c9a31a-bb89-41f6-858a-4861188d723f/second/part-00000-09b1fb64-0da6-470a-9562-d6806a1bc3eb-c000.json. Invalid postscript.
	at org.apache.orc.impl.ReaderImpl.ensureOrcFooter(ReaderImpl.java:274)
	at org.apache.orc.impl.ReaderImpl.extractFileTail(ReaderImpl.java:581)
	at org.apache.orc.impl.ReaderImpl.<init>(ReaderImpl.java:369)
	at org.apache.hadoop.hive.ql.io.orc.ReaderImpl.<init>(ReaderImpl.java:63)
	at org.apache.hadoop.hive.ql.io.orc.OrcFile.createReader(OrcFile.java:55)
	at org.apache.spark.sql.hive.orc.OrcFileOperator$.$anonfun$getFileReader$3(OrcFileOperator.scala:76)
	at scala.collection.Iterator$$anon$10.next(Iterator.scala:459)
	at scala.collection.TraversableOnce.collectFirst(TraversableOnce.scala:148)
	at scala.collection.TraversableOnce.collectFirst$(TraversableOnce.scala:135)
	at scala.collection.AbstractIterator.collectFirst(Iterator.scala:1429)
	at org.apache.spark.sql.hive.orc.OrcFileOperator$.getFileReader(OrcFileOperator.scala:87)
	at org.apache.spark.sql.hive.orc.OrcFileOperator$.$anonfun$readSchema$1(OrcFileOperator.scala:96)
	at scala.collection.Iterator$$anon$10.next(Iterator.scala:459)
	at scala.collection.TraversableOnce.collectFirst(TraversableOnce.scala:148)
	at scala.collection.TraversableOnce.collectFirst$(TraversableOnce.scala:135)
	at scala.collection.AbstractIterator.collectFirst(Iterator.scala:1429)
	at org.apache.spark.sql.hive.orc.OrcFileOperator$.readSchema(OrcFileOperator.scala:96)
	at org.apache.spark.sql.hive.orc.OrcFileFormat.$anonfun$buildReader$2(OrcFileFormat.scala:163)
	at org.apache.spark.sql.execution.datasources.FileFormat$$anon$1.apply(FileFormat.scala:147)
	at org.apache.spark.sql.execution.datasources.FileFormat$$anon$1.apply(FileFormat.scala:132)
	at org.apache.spark.sql.execution.datasources.FileScanRDD$$anon$1.org$apache$spark$sql$execution$datasources$FileScanRDD$$anon$$readCurrentFile(FileScanRDD.scala:116)
	at org.apache.spark.sql.execution.datasources.FileScanRDD$$anon$1$$anon$2.internalIter$lzycompute(FileScanRDD.scala:141)
	at org.apache.spark.sql.execution.datasources.FileScanRDD$$anon$1$$anon$2.internalIter(FileScanRDD.scala:141)
	at org.apache.spark.sql.execution.datasources.FileScanRDD$$anon$1$$anon$2.getNext(FileScanRDD.scala:145)
	at org.apache.spark.util.NextIterator.hasNext(NextIterator.scala:73)
	at org.apache.spark.sql.execution.datasources.FileScanRDD$$anon$1.hasNext(FileScanRDD.scala:93)
	at org.apache.spark.sql.execution.datasources.FileScanRDD$$anon$1.nextIterator(FileScanRDD.scala:173)
	at org.apache.spark.sql.execution.datasources.FileScanRDD$$anon$1.hasNext(FileScanRDD.scala:93)
	at org.apache.spark.sql.execution.datasources.FileScanRDD$$anon$1.nextIterator(FileScanRDD.scala:173)
	at org.apache.spark.sql.execution.datasources.FileScanRDD$$anon$1.hasNext(FileScanRDD.scala:93)
	at scala.collection.Iterator$$anon$10.hasNext(Iterator.scala:458)
	at org.apache.spark.sql.catalyst.expressions.GeneratedClass$GeneratedIteratorForCodegenStage1.agg_doAggregateWithoutKey_0$(generated.java:33)
	at org.apache.spark.sql.catalyst.expressions.GeneratedClass$GeneratedIteratorForCodegenStage1.processNext(generated.java:63)
	at org.apache.spark.sql.execution.BufferedRowIterator.hasNext(BufferedRowIterator.java:43)
	at org.apache.spark.sql.execution.WholeStageCodegenExec$$anon$1.hasNext(WholeStageCodegenExec.scala:726)
	at scala.collection.Iterator$$anon$10.hasNext(Iterator.scala:458)
	at org.apache.spark.shuffle.sort.BypassMergeSortShuffleWriter.write(BypassMergeSortShuffleWriter.java:132)
	at org.apache.spark.shuffle.ShuffleWriteProcessor.write(ShuffleWriteProcessor.scala:59)
	at org.apache.spark.scheduler.ShuffleMapTask.runTask(ShuffleMapTask.scala:99)
	at org.apache.spark.scheduler.ShuffleMapTask.runTask(ShuffleMapTask.scala:52)
	at org.apache.spark.scheduler.Task.run(Task.scala:127)
	at org.apache.spark.executor.Executor$TaskRunner.$anonfun$run$3(Executor.scala:441)
	at org.apache.spark.util.Utils$.tryWithSafeFinally(Utils.scala:1377)
	at org.apache.spark.executor.Executor$TaskRunner.run(Executor.scala:444)
	at java.util.concurrent.ThreadPoolExecutor.runWorker(ThreadPoolExecutor.java:1149)
	at java.util.concurrent.ThreadPoolExecutor$Worker.run(ThreadPoolExecutor.java:624)
	at java.lang.Thread.run(Thread.java:748)
07:48:01.510 ERROR org.apache.spark.executor.Executor: Exception in task 0.0 in stage 11852.0 (TID 21670)
org.apache.spark.SparkException: Could not read footer for file: file:/home/jenkins/workspace/NewSparkPullRequestBuilder/target/tmp/spark-33919ff1-f682-41fe-ad50-28ae2a58b5bf/third/part-00000-f6d751e1-16ba-4610-b25d-672914d87538-c000.json
	at org.apache.spark.sql.hive.orc.OrcFileOperator$.$anonfun$getFileReader$3(OrcFileOperator.scala:83)
	at scala.collection.Iterator$$anon$10.next(Iterator.scala:459)
	at scala.collection.TraversableOnce.collectFirst(TraversableOnce.scala:148)
	at scala.collection.TraversableOnce.collectFirst$(TraversableOnce.scala:135)
	at scala.collection.AbstractIterator.collectFirst(Iterator.scala:1429)
	at org.apache.spark.sql.hive.orc.OrcFileOperator$.getFileReader(OrcFileOperator.scala:87)
	at org.apache.spark.sql.hive.orc.OrcFileOperator$.$anonfun$readSchema$1(OrcFileOperator.scala:96)
	at scala.collection.Iterator$$anon$10.next(Iterator.scala:459)
	at scala.collection.TraversableOnce.collectFirst(TraversableOnce.scala:148)
	at scala.collection.TraversableOnce.collectFirst$(TraversableOnce.scala:135)
	at scala.collection.AbstractIterator.collectFirst(Iterator.scala:1429)
	at org.apache.spark.sql.hive.orc.OrcFileOperator$.readSchema(OrcFileOperator.scala:96)
	at org.apache.spark.sql.hive.orc.OrcFileFormat.$anonfun$buildReader$2(OrcFileFormat.scala:163)
	at org.apache.spark.sql.execution.datasources.FileFormat$$anon$1.apply(FileFormat.scala:147)
	at org.apache.spark.sql.execution.datasources.FileFormat$$anon$1.apply(FileFormat.scala:132)
	at org.apache.spark.sql.execution.datasources.FileScanRDD$$anon$1.org$apache$spark$sql$execution$datasources$FileScanRDD$$anon$$readCurrentFile(FileScanRDD.scala:116)
	at org.apache.spark.sql.execution.datasources.FileScanRDD$$anon$1.nextIterator(FileScanRDD.scala:169)
	at org.apache.spark.sql.execution.datasources.FileScanRDD$$anon$1.hasNext(FileScanRDD.scala:93)
	at scala.collection.Iterator$$anon$10.hasNext(Iterator.scala:458)
	at scala.collection.Iterator$$anon$10.hasNext(Iterator.scala:458)
	at scala.collection.Iterator$$anon$10.hasNext(Iterator.scala:458)
	at org.apache.spark.util.Utils$.getIteratorSize(Utils.scala:1804)
	at org.apache.spark.rdd.RDD.$anonfun$count$1(RDD.scala:1227)
	at org.apache.spark.rdd.RDD.$anonfun$count$1$adapted(RDD.scala:1227)
	at org.apache.spark.SparkContext.$anonfun$runJob$5(SparkContext.scala:2156)
	at org.apache.spark.scheduler.ResultTask.runTask(ResultTask.scala:90)
	at org.apache.spark.scheduler.Task.run(Task.scala:127)
	at org.apache.spark.executor.Executor$TaskRunner.$anonfun$run$3(Executor.scala:441)
	at org.apache.spark.util.Utils$.tryWithSafeFinally(Utils.scala:1377)
	at org.apache.spark.executor.Executor$TaskRunner.run(Executor.scala:444)
	at java.util.concurrent.ThreadPoolExecutor.runWorker(ThreadPoolExecutor.java:1149)
	at java.util.concurrent.ThreadPoolExecutor$Worker.run(ThreadPoolExecutor.java:624)
	at java.lang.Thread.run(Thread.java:748)
Caused by: org.apache.orc.FileFormatException: Malformed ORC file file:/home/jenkins/workspace/NewSparkPullRequestBuilder/target/tmp/spark-33919ff1-f682-41fe-ad50-28ae2a58b5bf/third/part-00000-f6d751e1-16ba-4610-b25d-672914d87538-c000.json. Invalid postscript.
	at org.apache.orc.impl.ReaderImpl.ensureOrcFooter(ReaderImpl.java:274)
	at org.apache.orc.impl.ReaderImpl.extractFileTail(ReaderImpl.java:581)
	at org.apache.orc.impl.ReaderImpl.<init>(ReaderImpl.java:369)
	at org.apache.hadoop.hive.ql.io.orc.ReaderImpl.<init>(ReaderImpl.java:63)
	at org.apache.hadoop.hive.ql.io.orc.OrcFile.createReader(OrcFile.java:55)
	at org.apache.spark.sql.hive.orc.OrcFileOperator$.$anonfun$getFileReader$3(OrcFileOperator.scala:76)
	... 32 more
07:48:01.514 WARN org.apache.spark.scheduler.TaskSetManager: Lost task 0.0 in stage 11852.0 (TID 21670, amp-jenkins-worker-04.amp, executor driver): org.apache.spark.SparkException: Could not read footer for file: file:/home/jenkins/workspace/NewSparkPullRequestBuilder/target/tmp/spark-33919ff1-f682-41fe-ad50-28ae2a58b5bf/third/part-00000-f6d751e1-16ba-4610-b25d-672914d87538-c000.json
	at org.apache.spark.sql.hive.orc.OrcFileOperator$.$anonfun$getFileReader$3(OrcFileOperator.scala:83)
	at scala.collection.Iterator$$anon$10.next(Iterator.scala:459)
	at scala.collection.TraversableOnce.collectFirst(TraversableOnce.scala:148)
	at scala.collection.TraversableOnce.collectFirst$(TraversableOnce.scala:135)
	at scala.collection.AbstractIterator.collectFirst(Iterator.scala:1429)
	at org.apache.spark.sql.hive.orc.OrcFileOperator$.getFileReader(OrcFileOperator.scala:87)
	at org.apache.spark.sql.hive.orc.OrcFileOperator$.$anonfun$readSchema$1(OrcFileOperator.scala:96)
	at scala.collection.Iterator$$anon$10.next(Iterator.scala:459)
	at scala.collection.TraversableOnce.collectFirst(TraversableOnce.scala:148)
	at scala.collection.TraversableOnce.collectFirst$(TraversableOnce.scala:135)
	at scala.collection.AbstractIterator.collectFirst(Iterator.scala:1429)
	at org.apache.spark.sql.hive.orc.OrcFileOperator$.readSchema(OrcFileOperator.scala:96)
	at org.apache.spark.sql.hive.orc.OrcFileFormat.$anonfun$buildReader$2(OrcFileFormat.scala:163)
	at org.apache.spark.sql.execution.datasources.FileFormat$$anon$1.apply(FileFormat.scala:147)
	at org.apache.spark.sql.execution.datasources.FileFormat$$anon$1.apply(FileFormat.scala:132)
	at org.apache.spark.sql.execution.datasources.FileScanRDD$$anon$1.org$apache$spark$sql$execution$datasources$FileScanRDD$$anon$$readCurrentFile(FileScanRDD.scala:116)
	at org.apache.spark.sql.execution.datasources.FileScanRDD$$anon$1.nextIterator(FileScanRDD.scala:169)
	at org.apache.spark.sql.execution.datasources.FileScanRDD$$anon$1.hasNext(FileScanRDD.scala:93)
	at scala.collection.Iterator$$anon$10.hasNext(Iterator.scala:458)
	at scala.collection.Iterator$$anon$10.hasNext(Iterator.scala:458)
	at scala.collection.Iterator$$anon$10.hasNext(Iterator.scala:458)
	at org.apache.spark.util.Utils$.getIteratorSize(Utils.scala:1804)
	at org.apache.spark.rdd.RDD.$anonfun$count$1(RDD.scala:1227)
	at org.apache.spark.rdd.RDD.$anonfun$count$1$adapted(RDD.scala:1227)
	at org.apache.spark.SparkContext.$anonfun$runJob$5(SparkContext.scala:2156)
	at org.apache.spark.scheduler.ResultTask.runTask(ResultTask.scala:90)
	at org.apache.spark.scheduler.Task.run(Task.scala:127)
	at org.apache.spark.executor.Executor$TaskRunner.$anonfun$run$3(Executor.scala:441)
	at org.apache.spark.util.Utils$.tryWithSafeFinally(Utils.scala:1377)
	at org.apache.spark.executor.Executor$TaskRunner.run(Executor.scala:444)
	at java.util.concurrent.ThreadPoolExecutor.runWorker(ThreadPoolExecutor.java:1149)
	at java.util.concurrent.ThreadPoolExecutor$Worker.run(ThreadPoolExecutor.java:624)
	at java.lang.Thread.run(Thread.java:748)
Caused by: org.apache.orc.FileFormatException: Malformed ORC file file:/home/jenkins/workspace/NewSparkPullRequestBuilder/target/tmp/spark-33919ff1-f682-41fe-ad50-28ae2a58b5bf/third/part-00000-f6d751e1-16ba-4610-b25d-672914d87538-c000.json. Invalid postscript.
	at org.apache.orc.impl.ReaderImpl.ensureOrcFooter(ReaderImpl.java:274)
	at org.apache.orc.impl.ReaderImpl.extractFileTail(ReaderImpl.java:581)
	at org.apache.orc.impl.ReaderImpl.<init>(ReaderImpl.java:369)
	at org.apache.hadoop.hive.ql.io.orc.ReaderImpl.<init>(ReaderImpl.java:63)
	at org.apache.hadoop.hive.ql.io.orc.OrcFile.createReader(OrcFile.java:55)
	at org.apache.spark.sql.hive.orc.OrcFileOperator$.$anonfun$getFileReader$3(OrcFileOperator.scala:76)
	... 32 more

07:48:01.514 ERROR org.apache.spark.scheduler.TaskSetManager: Task 0 in stage 11852.0 failed 1 times; aborting job
07:48:02.342 ERROR org.apache.spark.executor.Executor: Exception in task 0.0 in stage 11856.0 (TID 21674)
org.apache.spark.SparkException: Could not read footer for file: file:/home/jenkins/workspace/NewSparkPullRequestBuilder/target/tmp/spark-c13b7ee8-dbae-4a33-ae2e-d23e6c4191ec/third/part-00000-e5c05151-2948-4a71-ad27-4cb2ed0009c5-c000.json
	at org.apache.spark.sql.hive.orc.OrcFileOperator$.$anonfun$getFileReader$3(OrcFileOperator.scala:83)
	at scala.collection.Iterator$$anon$10.next(Iterator.scala:459)
	at scala.collection.TraversableOnce.collectFirst(TraversableOnce.scala:148)
	at scala.collection.TraversableOnce.collectFirst$(TraversableOnce.scala:135)
	at scala.collection.AbstractIterator.collectFirst(Iterator.scala:1429)
	at org.apache.spark.sql.hive.orc.OrcFileOperator$.getFileReader(OrcFileOperator.scala:87)
	at org.apache.spark.sql.hive.orc.OrcFileOperator$.$anonfun$readSchema$1(OrcFileOperator.scala:96)
	at scala.collection.Iterator$$anon$10.next(Iterator.scala:459)
	at scala.collection.TraversableOnce.collectFirst(TraversableOnce.scala:148)
	at scala.collection.TraversableOnce.collectFirst$(TraversableOnce.scala:135)
	at scala.collection.AbstractIterator.collectFirst(Iterator.scala:1429)
	at org.apache.spark.sql.hive.orc.OrcFileOperator$.readSchema(OrcFileOperator.scala:96)
	at org.apache.spark.sql.hive.orc.OrcFileFormat.$anonfun$buildReader$2(OrcFileFormat.scala:163)
	at org.apache.spark.sql.execution.datasources.FileFormat$$anon$1.apply(FileFormat.scala:147)
	at org.apache.spark.sql.execution.datasources.FileFormat$$anon$1.apply(FileFormat.scala:132)
	at org.apache.spark.sql.execution.datasources.FileScanRDD$$anon$1.org$apache$spark$sql$execution$datasources$FileScanRDD$$anon$$readCurrentFile(FileScanRDD.scala:116)
	at org.apache.spark.sql.execution.datasources.FileScanRDD$$anon$1.nextIterator(FileScanRDD.scala:169)
	at org.apache.spark.sql.execution.datasources.FileScanRDD$$anon$1.hasNext(FileScanRDD.scala:93)
	at scala.collection.Iterator$$anon$10.hasNext(Iterator.scala:458)
	at scala.collection.Iterator$$anon$10.hasNext(Iterator.scala:458)
	at scala.collection.Iterator$$anon$10.hasNext(Iterator.scala:458)
	at org.apache.spark.util.Utils$.getIteratorSize(Utils.scala:1804)
	at org.apache.spark.rdd.RDD.$anonfun$count$1(RDD.scala:1227)
	at org.apache.spark.rdd.RDD.$anonfun$count$1$adapted(RDD.scala:1227)
	at org.apache.spark.SparkContext.$anonfun$runJob$5(SparkContext.scala:2156)
	at org.apache.spark.scheduler.ResultTask.runTask(ResultTask.scala:90)
	at org.apache.spark.scheduler.Task.run(Task.scala:127)
	at org.apache.spark.executor.Executor$TaskRunner.$anonfun$run$3(Executor.scala:441)
	at org.apache.spark.util.Utils$.tryWithSafeFinally(Utils.scala:1377)
	at org.apache.spark.executor.Executor$TaskRunner.run(Executor.scala:444)
	at java.util.concurrent.ThreadPoolExecutor.runWorker(ThreadPoolExecutor.java:1149)
	at java.util.concurrent.ThreadPoolExecutor$Worker.run(ThreadPoolExecutor.java:624)
	at java.lang.Thread.run(Thread.java:748)
Caused by: org.apache.orc.FileFormatException: Malformed ORC file file:/home/jenkins/workspace/NewSparkPullRequestBuilder/target/tmp/spark-c13b7ee8-dbae-4a33-ae2e-d23e6c4191ec/third/part-00000-e5c05151-2948-4a71-ad27-4cb2ed0009c5-c000.json. Invalid postscript.
	at org.apache.orc.impl.ReaderImpl.ensureOrcFooter(ReaderImpl.java:274)
	at org.apache.orc.impl.ReaderImpl.extractFileTail(ReaderImpl.java:581)
	at org.apache.orc.impl.ReaderImpl.<init>(ReaderImpl.java:369)
	at org.apache.hadoop.hive.ql.io.orc.ReaderImpl.<init>(ReaderImpl.java:63)
	at org.apache.hadoop.hive.ql.io.orc.OrcFile.createReader(OrcFile.java:55)
	at org.apache.spark.sql.hive.orc.OrcFileOperator$.$anonfun$getFileReader$3(OrcFileOperator.scala:76)
	... 32 more
07:48:02.345 WARN org.apache.spark.scheduler.TaskSetManager: Lost task 0.0 in stage 11856.0 (TID 21674, amp-jenkins-worker-04.amp, executor driver): org.apache.spark.SparkException: Could not read footer for file: file:/home/jenkins/workspace/NewSparkPullRequestBuilder/target/tmp/spark-c13b7ee8-dbae-4a33-ae2e-d23e6c4191ec/third/part-00000-e5c05151-2948-4a71-ad27-4cb2ed0009c5-c000.json
	at org.apache.spark.sql.hive.orc.OrcFileOperator$.$anonfun$getFileReader$3(OrcFileOperator.scala:83)
	at scala.collection.Iterator$$anon$10.next(Iterator.scala:459)
	at scala.collection.TraversableOnce.collectFirst(TraversableOnce.scala:148)
	at scala.collection.TraversableOnce.collectFirst$(TraversableOnce.scala:135)
	at scala.collection.AbstractIterator.collectFirst(Iterator.scala:1429)
	at org.apache.spark.sql.hive.orc.OrcFileOperator$.getFileReader(OrcFileOperator.scala:87)
	at org.apache.spark.sql.hive.orc.OrcFileOperator$.$anonfun$readSchema$1(OrcFileOperator.scala:96)
	at scala.collection.Iterator$$anon$10.next(Iterator.scala:459)
	at scala.collection.TraversableOnce.collectFirst(TraversableOnce.scala:148)
	at scala.collection.TraversableOnce.collectFirst$(TraversableOnce.scala:135)
	at scala.collection.AbstractIterator.collectFirst(Iterator.scala:1429)
	at org.apache.spark.sql.hive.orc.OrcFileOperator$.readSchema(OrcFileOperator.scala:96)
	at org.apache.spark.sql.hive.orc.OrcFileFormat.$anonfun$buildReader$2(OrcFileFormat.scala:163)
	at org.apache.spark.sql.execution.datasources.FileFormat$$anon$1.apply(FileFormat.scala:147)
	at org.apache.spark.sql.execution.datasources.FileFormat$$anon$1.apply(FileFormat.scala:132)
	at org.apache.spark.sql.execution.datasources.FileScanRDD$$anon$1.org$apache$spark$sql$execution$datasources$FileScanRDD$$anon$$readCurrentFile(FileScanRDD.scala:116)
	at org.apache.spark.sql.execution.datasources.FileScanRDD$$anon$1.nextIterator(FileScanRDD.scala:169)
	at org.apache.spark.sql.execution.datasources.FileScanRDD$$anon$1.hasNext(FileScanRDD.scala:93)
	at scala.collection.Iterator$$anon$10.hasNext(Iterator.scala:458)
	at scala.collection.Iterator$$anon$10.hasNext(Iterator.scala:458)
	at scala.collection.Iterator$$anon$10.hasNext(Iterator.scala:458)
	at org.apache.spark.util.Utils$.getIteratorSize(Utils.scala:1804)
	at org.apache.spark.rdd.RDD.$anonfun$count$1(RDD.scala:1227)
	at org.apache.spark.rdd.RDD.$anonfun$count$1$adapted(RDD.scala:1227)
	at org.apache.spark.SparkContext.$anonfun$runJob$5(SparkContext.scala:2156)
	at org.apache.spark.scheduler.ResultTask.runTask(ResultTask.scala:90)
	at org.apache.spark.scheduler.Task.run(Task.scala:127)
	at org.apache.spark.executor.Executor$TaskRunner.$anonfun$run$3(Executor.scala:441)
	at org.apache.spark.util.Utils$.tryWithSafeFinally(Utils.scala:1377)
	at org.apache.spark.executor.Executor$TaskRunner.run(Executor.scala:444)
	at java.util.concurrent.ThreadPoolExecutor.runWorker(ThreadPoolExecutor.java:1149)
	at java.util.concurrent.ThreadPoolExecutor$Worker.run(ThreadPoolExecutor.java:624)
	at java.lang.Thread.run(Thread.java:748)
Caused by: org.apache.orc.FileFormatException: Malformed ORC file file:/home/jenkins/workspace/NewSparkPullRequestBuilder/target/tmp/spark-c13b7ee8-dbae-4a33-ae2e-d23e6c4191ec/third/part-00000-e5c05151-2948-4a71-ad27-4cb2ed0009c5-c000.json. Invalid postscript.
	at org.apache.orc.impl.ReaderImpl.ensureOrcFooter(ReaderImpl.java:274)
	at org.apache.orc.impl.ReaderImpl.extractFileTail(ReaderImpl.java:581)
	at org.apache.orc.impl.ReaderImpl.<init>(ReaderImpl.java:369)
	at org.apache.hadoop.hive.ql.io.orc.ReaderImpl.<init>(ReaderImpl.java:63)
	at org.apache.hadoop.hive.ql.io.orc.OrcFile.createReader(OrcFile.java:55)
	at org.apache.spark.sql.hive.orc.OrcFileOperator$.$anonfun$getFileReader$3(OrcFileOperator.scala:76)
	... 32 more

07:48:02.345 ERROR org.apache.spark.scheduler.TaskSetManager: Task 0 in stage 11856.0 failed 1 times; aborting job
07:48:03.515 ERROR org.apache.spark.executor.Executor: Exception in task 0.0 in stage 11861.0 (TID 21679)
org.apache.spark.SparkException: Could not read footer for file: file:/home/jenkins/workspace/NewSparkPullRequestBuilder/target/tmp/spark-83996d26-7aae-4227-839b-dcf30428a1e1/first/part-00000-9837d7df-7562-46ed-a2ab-793661dfba7f-c000.json
	at org.apache.spark.sql.hive.orc.OrcFileOperator$.$anonfun$getFileReader$3(OrcFileOperator.scala:83)
	at scala.collection.Iterator$$anon$10.next(Iterator.scala:459)
	at scala.collection.TraversableOnce.collectFirst(TraversableOnce.scala:148)
	at scala.collection.TraversableOnce.collectFirst$(TraversableOnce.scala:135)
	at scala.collection.AbstractIterator.collectFirst(Iterator.scala:1429)
	at org.apache.spark.sql.hive.orc.OrcFileOperator$.getFileReader(OrcFileOperator.scala:87)
	at org.apache.spark.sql.hive.orc.OrcFileOperator$.$anonfun$readSchema$1(OrcFileOperator.scala:96)
	at scala.collection.Iterator$$anon$10.next(Iterator.scala:459)
	at scala.collection.TraversableOnce.collectFirst(TraversableOnce.scala:148)
	at scala.collection.TraversableOnce.collectFirst$(TraversableOnce.scala:135)
	at scala.collection.AbstractIterator.collectFirst(Iterator.scala:1429)
	at org.apache.spark.sql.hive.orc.OrcFileOperator$.readSchema(OrcFileOperator.scala:96)
	at org.apache.spark.sql.hive.orc.OrcFileFormat.$anonfun$buildReader$2(OrcFileFormat.scala:163)
	at org.apache.spark.sql.execution.datasources.FileFormat$$anon$1.apply(FileFormat.scala:147)
	at org.apache.spark.sql.execution.datasources.FileFormat$$anon$1.apply(FileFormat.scala:132)
	at org.apache.spark.sql.execution.datasources.FileScanRDD$$anon$1.org$apache$spark$sql$execution$datasources$FileScanRDD$$anon$$readCurrentFile(FileScanRDD.scala:116)
	at org.apache.spark.sql.execution.datasources.FileScanRDD$$anon$1.nextIterator(FileScanRDD.scala:169)
	at org.apache.spark.sql.execution.datasources.FileScanRDD$$anon$1.hasNext(FileScanRDD.scala:93)
	at scala.collection.Iterator$$anon$10.hasNext(Iterator.scala:458)
	at org.apache.spark.sql.catalyst.expressions.GeneratedClass$GeneratedIteratorForCodegenStage1.agg_doAggregateWithoutKey_0$(generated.java:33)
	at org.apache.spark.sql.catalyst.expressions.GeneratedClass$GeneratedIteratorForCodegenStage1.processNext(generated.java:63)
	at org.apache.spark.sql.execution.BufferedRowIterator.hasNext(BufferedRowIterator.java:43)
	at org.apache.spark.sql.execution.WholeStageCodegenExec$$anon$1.hasNext(WholeStageCodegenExec.scala:726)
	at scala.collection.Iterator$$anon$10.hasNext(Iterator.scala:458)
	at org.apache.spark.shuffle.sort.BypassMergeSortShuffleWriter.write(BypassMergeSortShuffleWriter.java:132)
	at org.apache.spark.shuffle.ShuffleWriteProcessor.write(ShuffleWriteProcessor.scala:59)
	at org.apache.spark.scheduler.ShuffleMapTask.runTask(ShuffleMapTask.scala:99)
	at org.apache.spark.scheduler.ShuffleMapTask.runTask(ShuffleMapTask.scala:52)
	at org.apache.spark.scheduler.Task.run(Task.scala:127)
	at org.apache.spark.executor.Executor$TaskRunner.$anonfun$run$3(Executor.scala:441)
	at org.apache.spark.util.Utils$.tryWithSafeFinally(Utils.scala:1377)
	at org.apache.spark.executor.Executor$TaskRunner.run(Executor.scala:444)
	at java.util.concurrent.ThreadPoolExecutor.runWorker(ThreadPoolExecutor.java:1149)
	at java.util.concurrent.ThreadPoolExecutor$Worker.run(ThreadPoolExecutor.java:624)
	at java.lang.Thread.run(Thread.java:748)
Caused by: org.apache.orc.FileFormatException: Malformed ORC file file:/home/jenkins/workspace/NewSparkPullRequestBuilder/target/tmp/spark-83996d26-7aae-4227-839b-dcf30428a1e1/first/part-00000-9837d7df-7562-46ed-a2ab-793661dfba7f-c000.json. Invalid postscript.
	at org.apache.orc.impl.ReaderImpl.ensureOrcFooter(ReaderImpl.java:274)
	at org.apache.orc.impl.ReaderImpl.extractFileTail(ReaderImpl.java:581)
	at org.apache.orc.impl.ReaderImpl.<init>(ReaderImpl.java:369)
	at org.apache.hadoop.hive.ql.io.orc.ReaderImpl.<init>(ReaderImpl.java:63)
	at org.apache.hadoop.hive.ql.io.orc.OrcFile.createReader(OrcFile.java:55)
	at org.apache.spark.sql.hive.orc.OrcFileOperator$.$anonfun$getFileReader$3(OrcFileOperator.scala:76)
	... 34 more
07:48:03.530 WARN org.apache.spark.scheduler.TaskSetManager: Lost task 0.0 in stage 11861.0 (TID 21679, amp-jenkins-worker-04.amp, executor driver): org.apache.spark.SparkException: Could not read footer for file: file:/home/jenkins/workspace/NewSparkPullRequestBuilder/target/tmp/spark-83996d26-7aae-4227-839b-dcf30428a1e1/first/part-00000-9837d7df-7562-46ed-a2ab-793661dfba7f-c000.json
	at org.apache.spark.sql.hive.orc.OrcFileOperator$.$anonfun$getFileReader$3(OrcFileOperator.scala:83)
	at scala.collection.Iterator$$anon$10.next(Iterator.scala:459)
	at scala.collection.TraversableOnce.collectFirst(TraversableOnce.scala:148)
	at scala.collection.TraversableOnce.collectFirst$(TraversableOnce.scala:135)
	at scala.collection.AbstractIterator.collectFirst(Iterator.scala:1429)
	at org.apache.spark.sql.hive.orc.OrcFileOperator$.getFileReader(OrcFileOperator.scala:87)
	at org.apache.spark.sql.hive.orc.OrcFileOperator$.$anonfun$readSchema$1(OrcFileOperator.scala:96)
	at scala.collection.Iterator$$anon$10.next(Iterator.scala:459)
	at scala.collection.TraversableOnce.collectFirst(TraversableOnce.scala:148)
	at scala.collection.TraversableOnce.collectFirst$(TraversableOnce.scala:135)
	at scala.collection.AbstractIterator.collectFirst(Iterator.scala:1429)
	at org.apache.spark.sql.hive.orc.OrcFileOperator$.readSchema(OrcFileOperator.scala:96)
	at org.apache.spark.sql.hive.orc.OrcFileFormat.$anonfun$buildReader$2(OrcFileFormat.scala:163)
	at org.apache.spark.sql.execution.datasources.FileFormat$$anon$1.apply(FileFormat.scala:147)
	at org.apache.spark.sql.execution.datasources.FileFormat$$anon$1.apply(FileFormat.scala:132)
	at org.apache.spark.sql.execution.datasources.FileScanRDD$$anon$1.org$apache$spark$sql$execution$datasources$FileScanRDD$$anon$$readCurrentFile(FileScanRDD.scala:116)
	at org.apache.spark.sql.execution.datasources.FileScanRDD$$anon$1.nextIterator(FileScanRDD.scala:169)
	at org.apache.spark.sql.execution.datasources.FileScanRDD$$anon$1.hasNext(FileScanRDD.scala:93)
	at scala.collection.Iterator$$anon$10.hasNext(Iterator.scala:458)
	at org.apache.spark.sql.catalyst.expressions.GeneratedClass$GeneratedIteratorForCodegenStage1.agg_doAggregateWithoutKey_0$(generated.java:33)
	at org.apache.spark.sql.catalyst.expressions.GeneratedClass$GeneratedIteratorForCodegenStage1.processNext(generated.java:63)
	at org.apache.spark.sql.execution.BufferedRowIterator.hasNext(BufferedRowIterator.java:43)
	at org.apache.spark.sql.execution.WholeStageCodegenExec$$anon$1.hasNext(WholeStageCodegenExec.scala:726)
	at scala.collection.Iterator$$anon$10.hasNext(Iterator.scala:458)
	at org.apache.spark.shuffle.sort.BypassMergeSortShuffleWriter.write(BypassMergeSortShuffleWriter.java:132)
	at org.apache.spark.shuffle.ShuffleWriteProcessor.write(ShuffleWriteProcessor.scala:59)
	at org.apache.spark.scheduler.ShuffleMapTask.runTask(ShuffleMapTask.scala:99)
	at org.apache.spark.scheduler.ShuffleMapTask.runTask(ShuffleMapTask.scala:52)
	at org.apache.spark.scheduler.Task.run(Task.scala:127)
	at org.apache.spark.executor.Executor$TaskRunner.$anonfun$run$3(Executor.scala:441)
	at org.apache.spark.util.Utils$.tryWithSafeFinally(Utils.scala:1377)
	at org.apache.spark.executor.Executor$TaskRunner.run(Executor.scala:444)
	at java.util.concurrent.ThreadPoolExecutor.runWorker(ThreadPoolExecutor.java:1149)
	at java.util.concurrent.ThreadPoolExecutor$Worker.run(ThreadPoolExecutor.java:624)
	at java.lang.Thread.run(Thread.java:748)
Caused by: org.apache.orc.FileFormatException: Malformed ORC file file:/home/jenkins/workspace/NewSparkPullRequestBuilder/target/tmp/spark-83996d26-7aae-4227-839b-dcf30428a1e1/first/part-00000-9837d7df-7562-46ed-a2ab-793661dfba7f-c000.json. Invalid postscript.
	at org.apache.orc.impl.ReaderImpl.ensureOrcFooter(ReaderImpl.java:274)
	at org.apache.orc.impl.ReaderImpl.extractFileTail(ReaderImpl.java:581)
	at org.apache.orc.impl.ReaderImpl.<init>(ReaderImpl.java:369)
	at org.apache.hadoop.hive.ql.io.orc.ReaderImpl.<init>(ReaderImpl.java:63)
	at org.apache.hadoop.hive.ql.io.orc.OrcFile.createReader(OrcFile.java:55)
	at org.apache.spark.sql.hive.orc.OrcFileOperator$.$anonfun$getFileReader$3(OrcFileOperator.scala:76)
	... 34 more

07:48:03.530 ERROR org.apache.spark.scheduler.TaskSetManager: Task 0 in stage 11861.0 failed 1 times; aborting job
[info] - Enabling/disabling ignoreCorruptFiles (6 seconds, 118 milliseconds)
[info] - SPARK-27160 Predicate pushdown correctness on DecimalType for ORC (1 second, 59 milliseconds)
[info] - SPARK-8501: Avoids discovery schema from empty ORC files (975 milliseconds)
07:48:07.277 ERROR org.apache.hadoop.hive.ql.io.AcidUtils: Failed to get files with ID; using regular API: Only supported for DFS; got class org.apache.hadoop.hive.ql.io.ProxyLocalFileSystem
07:48:07.354 ERROR org.apache.hadoop.hive.ql.io.AcidUtils: Failed to get files with ID; using regular API: Only supported for DFS; got class org.apache.hadoop.hive.ql.io.ProxyLocalFileSystem
[info] - Verify the ORC conversion parameter: CONVERT_METASTORE_ORC (1 second, 908 milliseconds)
[info] - converted ORC table supports resolving mixed case field (1 second, 568 milliseconds)
[info] - SPARK-20728 Make ORCFileFormat configurable between sql/hive and sql/core (467 milliseconds)
[info] - SPARK-22267 Spark SQL incorrectly reads ORC files when column order is different (1 second, 412 milliseconds)
[info] - SPARK-19809 NullPointerException on zero-size ORC file (887 milliseconds)
[info] - SPARK-23340 Empty float/double array columns raise EOFException !!! IGNORED !!!
07:48:12.055 WARN org.apache.hadoop.hive.metastore.HiveMetaStore: Location: file:/home/jenkins/workspace/NewSparkPullRequestBuilder/target/tmp/warehouse-f296ea11-e474-48d2-9824-2a06408cd910/spark_26437 specified for non-external table:spark_26437
07:48:12.870 ERROR org.apache.hadoop.hive.ql.io.AcidUtils: Failed to get files with ID; using regular API: Only supported for DFS; got class org.apache.hadoop.hive.ql.io.ProxyLocalFileSystem
07:48:12.978 ERROR org.apache.hadoop.hive.ql.io.AcidUtils: Failed to get files with ID; using regular API: Only supported for DFS; got class org.apache.hadoop.hive.ql.io.ProxyLocalFileSystem
[info] - SPARK-26437 Can not query decimal type when value is 0 (1 second, 314 milliseconds)
07:48:13.213 WARN org.apache.hadoop.hive.metastore.HiveMetaStore: Location: file:/home/jenkins/workspace/NewSparkPullRequestBuilder/target/tmp/warehouse-f296ea11-e474-48d2-9824-2a06408cd910/dummy_orc_partitioned specified for non-external table:dummy_orc_partitioned
07:48:14.384 WARN org.apache.hadoop.hive.metastore.HiveMetaStore: Location: file:/home/jenkins/workspace/NewSparkPullRequestBuilder/target/tmp/warehouse-f296ea11-e474-48d2-9824-2a06408cd910/dummy_orc_partitioned specified for non-external table:dummy_orc_partitioned
[info] - SPARK-28573 ORC conversation could be applied for partitioned table insertion (2 seconds, 839 milliseconds)
07:48:16.138 WARN org.apache.hadoop.hive.conf.HiveConf: HiveConf of name hive.internal.ss.authz.settings.applied.marker does not exist
07:48:16.139 WARN org.apache.hadoop.hive.conf.HiveConf: HiveConf of name hive.stats.jdbc.timeout does not exist
07:48:16.139 WARN org.apache.hadoop.hive.conf.HiveConf: HiveConf of name hive.stats.retries.wait does not exist
07:48:16.297 WARN org.apache.hadoop.hive.conf.HiveConf: HiveConf of name hive.internal.ss.authz.settings.applied.marker does not exist
07:48:16.297 WARN org.apache.hadoop.hive.conf.HiveConf: HiveConf of name hive.stats.jdbc.timeout does not exist
07:48:16.298 WARN org.apache.hadoop.hive.conf.HiveConf: HiveConf of name hive.stats.retries.wait does not exist
[info] HiveOrcPartitionDiscoverySuite:
[info] - read partitioned table - normal case (1 second, 837 milliseconds)
[info] - read partitioned table - with nulls (1 second, 513 milliseconds)
[info] - SPARK-27162: handle pathfilter configuration correctly (853 milliseconds)
07:48:20.617 WARN org.apache.hadoop.hive.conf.HiveConf: HiveConf of name hive.internal.ss.authz.settings.applied.marker does not exist
07:48:20.617 WARN org.apache.hadoop.hive.conf.HiveConf: HiveConf of name hive.stats.jdbc.timeout does not exist
07:48:20.618 WARN org.apache.hadoop.hive.conf.HiveConf: HiveConf of name hive.stats.retries.wait does not exist
07:48:20.738 WARN org.apache.hadoop.hive.conf.HiveConf: HiveConf of name hive.internal.ss.authz.settings.applied.marker does not exist
07:48:20.738 WARN org.apache.hadoop.hive.conf.HiveConf: HiveConf of name hive.stats.jdbc.timeout does not exist
07:48:20.738 WARN org.apache.hadoop.hive.conf.HiveConf: HiveConf of name hive.stats.retries.wait does not exist
[info] PruneFileSourcePartitionsSuite:
[info] - PruneFileSourcePartitions should not change the output of LogicalRelation (331 milliseconds)
[info] - SPARK-20986 Reset table's statistics after PruneFileSourcePartitions rule (1 second, 758 milliseconds)
[info] - SPARK-26576 Broadcast hint not applied to partitioned table (1 second, 169 milliseconds)
07:48:24.132 WARN org.apache.hadoop.hive.conf.HiveConf: HiveConf of name hive.internal.ss.authz.settings.applied.marker does not exist
07:48:24.132 WARN org.apache.hadoop.hive.conf.HiveConf: HiveConf of name hive.stats.jdbc.timeout does not exist
07:48:24.132 WARN org.apache.hadoop.hive.conf.HiveConf: HiveConf of name hive.stats.retries.wait does not exist
07:48:24.286 WARN org.apache.hadoop.hive.conf.HiveConf: HiveConf of name hive.internal.ss.authz.settings.applied.marker does not exist
07:48:24.286 WARN org.apache.hadoop.hive.conf.HiveConf: HiveConf of name hive.stats.jdbc.timeout does not exist
07:48:24.286 WARN org.apache.hadoop.hive.conf.HiveConf: HiveConf of name hive.stats.retries.wait does not exist
[info] HiveOrcFilterSuite:
[info] - filter pushdown - integer (812 milliseconds)
[info] - filter pushdown - long (749 milliseconds)
[info] - filter pushdown - float (763 milliseconds)
[info] - filter pushdown - double (814 milliseconds)
[info] - filter pushdown - string (763 milliseconds)
[info] - filter pushdown - boolean (733 milliseconds)
[info] - filter pushdown - decimal (924 milliseconds)
[info] - filter pushdown - timestamp (754 milliseconds)
[info] - filter pushdown - combinations with logical operators (434 milliseconds)
[info] - no filter pushdown - non-supported types (1 second, 21 milliseconds)
[info] - SPARK-12218 and SPARK-25699 Converting conjunctions into ORC SearchArguments (2 milliseconds)
[info] - SPARK-27699 Converting disjunctions into ORC SearchArguments (0 milliseconds)
07:48:32.167 WARN org.apache.hadoop.hive.conf.HiveConf: HiveConf of name hive.internal.ss.authz.settings.applied.marker does not exist
07:48:32.167 WARN org.apache.hadoop.hive.conf.HiveConf: HiveConf of name hive.stats.jdbc.timeout does not exist
07:48:32.167 WARN org.apache.hadoop.hive.conf.HiveConf: HiveConf of name hive.stats.retries.wait does not exist
07:48:32.248 WARN org.apache.hadoop.hive.conf.HiveConf: HiveConf of name hive.internal.ss.authz.settings.applied.marker does not exist
07:48:32.248 WARN org.apache.hadoop.hive.conf.HiveConf: HiveConf of name hive.stats.jdbc.timeout does not exist
07:48:32.248 WARN org.apache.hadoop.hive.conf.HiveConf: HiveConf of name hive.stats.retries.wait does not exist
[info] ParquetHiveCompatibilitySuite:
07:48:33.517 WARN org.apache.spark.sql.execution.command.DropTableCommand: org.apache.spark.sql.AnalysisException: Path does not exist: file:/home/jenkins/workspace/NewSparkPullRequestBuilder/target/tmp/spark-819c6f42-50d2-4418-938c-cf1763b1a4b2;
org.apache.spark.sql.AnalysisException: Path does not exist: file:/home/jenkins/workspace/NewSparkPullRequestBuilder/target/tmp/spark-819c6f42-50d2-4418-938c-cf1763b1a4b2;
	at org.apache.spark.sql.execution.datasources.DataSource$.$anonfun$checkAndGlobPathIfNecessary$1(DataSource.scala:759)
	at scala.collection.TraversableLike.$anonfun$flatMap$1(TraversableLike.scala:245)
	at scala.collection.immutable.List.foreach(List.scala:392)
	at scala.collection.TraversableLike.flatMap(TraversableLike.scala:245)
	at scala.collection.TraversableLike.flatMap$(TraversableLike.scala:242)
	at scala.collection.immutable.List.flatMap(List.scala:355)
	at org.apache.spark.sql.execution.datasources.DataSource$.checkAndGlobPathIfNecessary(DataSource.scala:746)
	at org.apache.spark.sql.execution.datasources.DataSource.checkAndGlobPathIfNecessary(DataSource.scala:575)
	at org.apache.spark.sql.execution.datasources.DataSource.resolveRelation(DataSource.scala:398)
	at org.apache.spark.sql.hive.HiveMetastoreCatalog.$anonfun$convertToLogicalRelation$5(HiveMetastoreCatalog.scala:248)
	at scala.Option.getOrElse(Option.scala:189)
	at org.apache.spark.sql.hive.HiveMetastoreCatalog.$anonfun$convertToLogicalRelation$4(HiveMetastoreCatalog.scala:238)
	at org.apache.spark.sql.hive.HiveMetastoreCatalog.withTableCreationLock(HiveMetastoreCatalog.scala:58)
	at org.apache.spark.sql.hive.HiveMetastoreCatalog.convertToLogicalRelation(HiveMetastoreCatalog.scala:231)
	at org.apache.spark.sql.hive.HiveMetastoreCatalog.convert(HiveMetastoreCatalog.scala:137)
	at org.apache.spark.sql.hive.RelationConversions$$anonfun$apply$4.applyOrElse(HiveStrategies.scala:220)
	at org.apache.spark.sql.hive.RelationConversions$$anonfun$apply$4.applyOrElse(HiveStrategies.scala:207)
	at org.apache.spark.sql.catalyst.plans.logical.AnalysisHelper.$anonfun$resolveOperatorsDown$2(AnalysisHelper.scala:108)
	at org.apache.spark.sql.catalyst.trees.CurrentOrigin$.withOrigin(TreeNode.scala:72)
	at org.apache.spark.sql.catalyst.plans.logical.AnalysisHelper.$anonfun$resolveOperatorsDown$1(AnalysisHelper.scala:108)
	at org.apache.spark.sql.catalyst.plans.logical.AnalysisHelper$.allowInvokingTransformsInAnalyzer(AnalysisHelper.scala:194)
	at org.apache.spark.sql.catalyst.plans.logical.AnalysisHelper.resolveOperatorsDown(AnalysisHelper.scala:106)
	at org.apache.spark.sql.catalyst.plans.logical.AnalysisHelper.resolveOperatorsDown$(AnalysisHelper.scala:104)
	at org.apache.spark.sql.catalyst.plans.logical.LogicalPlan.resolveOperatorsDown(LogicalPlan.scala:29)
	at org.apache.spark.sql.catalyst.plans.logical.AnalysisHelper.$anonfun$resolveOperatorsDown$4(AnalysisHelper.scala:113)
	at org.apache.spark.sql.catalyst.trees.TreeNode.$anonfun$mapChildren$1(TreeNode.scala:376)
	at org.apache.spark.sql.catalyst.trees.TreeNode.mapProductIterator(TreeNode.scala:214)
	at org.apache.spark.sql.catalyst.trees.TreeNode.mapChildren(TreeNode.scala:374)
	at org.apache.spark.sql.catalyst.trees.TreeNode.mapChildren(TreeNode.scala:327)
	at org.apache.spark.sql.catalyst.plans.logical.AnalysisHelper.$anonfun$resolveOperatorsDown$1(AnalysisHelper.scala:113)
	at org.apache.spark.sql.catalyst.plans.logical.AnalysisHelper$.allowInvokingTransformsInAnalyzer(AnalysisHelper.scala:194)
	at org.apache.spark.sql.catalyst.plans.logical.AnalysisHelper.resolveOperatorsDown(AnalysisHelper.scala:106)
	at org.apache.spark.sql.catalyst.plans.logical.AnalysisHelper.resolveOperatorsDown$(AnalysisHelper.scala:104)
	at org.apache.spark.sql.catalyst.plans.logical.LogicalPlan.resolveOperatorsDown(LogicalPlan.scala:29)
	at org.apache.spark.sql.catalyst.plans.logical.AnalysisHelper.resolveOperators(AnalysisHelper.scala:73)
	at org.apache.spark.sql.catalyst.plans.logical.AnalysisHelper.resolveOperators$(AnalysisHelper.scala:72)
	at org.apache.spark.sql.catalyst.plans.logical.LogicalPlan.resolveOperators(LogicalPlan.scala:29)
	at org.apache.spark.sql.hive.RelationConversions.apply(HiveStrategies.scala:207)
	at org.apache.spark.sql.hive.RelationConversions.apply(HiveStrategies.scala:191)
	at org.apache.spark.sql.catalyst.rules.RuleExecutor.$anonfun$execute$2(RuleExecutor.scala:130)
	at scala.collection.IndexedSeqOptimized.foldLeft(IndexedSeqOptimized.scala:60)
	at scala.collection.IndexedSeqOptimized.foldLeft$(IndexedSeqOptimized.scala:68)
	at scala.collection.mutable.ArrayBuffer.foldLeft(ArrayBuffer.scala:49)
	at org.apache.spark.sql.catalyst.rules.RuleExecutor.$anonfun$execute$1(RuleExecutor.scala:127)
	at org.apache.spark.sql.catalyst.rules.RuleExecutor.$anonfun$execute$1$adapted(RuleExecutor.scala:119)
	at scala.collection.immutable.List.foreach(List.scala:392)
	at org.apache.spark.sql.catalyst.rules.RuleExecutor.execute(RuleExecutor.scala:119)
	at org.apache.spark.sql.catalyst.analysis.Analyzer.org$apache$spark$sql$catalyst$analysis$Analyzer$$executeSameContext(Analyzer.scala:168)
	at org.apache.spark.sql.catalyst.analysis.Analyzer.execute(Analyzer.scala:162)
	at org.apache.spark.sql.catalyst.analysis.Analyzer.execute(Analyzer.scala:122)
	at org.apache.spark.sql.catalyst.rules.RuleExecutor.$anonfun$executeAndTrack$1(RuleExecutor.scala:98)
	at org.apache.spark.sql.catalyst.QueryPlanningTracker$.withTracker(QueryPlanningTracker.scala:88)
	at org.apache.spark.sql.catalyst.rules.RuleExecutor.executeAndTrack(RuleExecutor.scala:98)
	at org.apache.spark.sql.catalyst.analysis.Analyzer.$anonfun$executeAndCheck$1(Analyzer.scala:146)
	at org.apache.spark.sql.catalyst.plans.logical.AnalysisHelper$.markInAnalyzer(AnalysisHelper.scala:201)
	at org.apache.spark.sql.catalyst.analysis.Analyzer.executeAndCheck(Analyzer.scala:145)
	at org.apache.spark.sql.hive.test.TestHiveQueryExecution.analyzed$lzycompute(TestHive.scala:606)
	at org.apache.spark.sql.hive.test.TestHiveQueryExecution.analyzed(TestHive.scala:589)
	at org.apache.spark.sql.execution.QueryExecution.assertAnalyzed(QueryExecution.scala:55)
	at org.apache.spark.sql.Dataset$.ofRows(Dataset.scala:87)
	at org.apache.spark.sql.SparkSession.table(SparkSession.scala:589)
	at org.apache.spark.sql.execution.command.DropTableCommand.run(ddl.scala:241)
	at org.apache.spark.sql.execution.command.ExecutedCommandExec.sideEffectResult$lzycompute(commands.scala:70)
	at org.apache.spark.sql.execution.command.ExecutedCommandExec.sideEffectResult(commands.scala:68)
	at org.apache.spark.sql.execution.command.ExecutedCommandExec.executeCollect(commands.scala:79)
	at org.apache.spark.sql.Dataset.$anonfun$logicalPlan$1(Dataset.scala:226)
	at org.apache.spark.sql.Dataset.$anonfun$withAction$1(Dataset.scala:3477)
	at org.apache.spark.sql.execution.SQLExecution$.$anonfun$withNewExecutionId$4(SQLExecution.scala:100)
	at org.apache.spark.sql.execution.SQLExecution$.withSQLConfPropagated(SQLExecution.scala:160)
	at org.apache.spark.sql.execution.SQLExecution$.withNewExecutionId(SQLExecution.scala:87)
	at org.apache.spark.sql.Dataset.withAction(Dataset.scala:3473)
	at org.apache.spark.sql.Dataset.<init>(Dataset.scala:226)
	at org.apache.spark.sql.Dataset$.ofRows(Dataset.scala:88)
	at org.apache.spark.sql.hive.test.TestHiveSparkSession.sql(TestHive.scala:238)
	at org.apache.spark.sql.test.SQLTestUtilsBase.$anonfun$withTable$2(SQLTestUtils.scala:291)
	at scala.collection.IndexedSeqOptimized.foreach(IndexedSeqOptimized.scala:36)
	at scala.collection.IndexedSeqOptimized.foreach$(IndexedSeqOptimized.scala:33)
	at scala.collection.mutable.WrappedArray.foreach(WrappedArray.scala:38)
	at org.apache.spark.sql.test.SQLTestUtilsBase.$anonfun$withTable$1(SQLTestUtils.scala:290)
	at org.apache.spark.util.Utils$.tryWithSafeFinally(Utils.scala:1386)
	at org.apache.spark.sql.test.SQLTestUtilsBase.withTable(SQLTestUtils.scala:290)
	at org.apache.spark.sql.test.SQLTestUtilsBase.withTable$(SQLTestUtils.scala:288)
	at org.apache.spark.sql.execution.datasources.parquet.ParquetCompatibilityTest.withTable(ParquetCompatibilityTest.scala:35)
	at org.apache.spark.sql.hive.ParquetHiveCompatibilitySuite.testParquetHiveCompatibility(ParquetHiveCompatibilitySuite.scala:47)
	at org.apache.spark.sql.hive.ParquetHiveCompatibilitySuite.$anonfun$new$1(ParquetHiveCompatibilitySuite.scala:94)
	at scala.runtime.java8.JFunction0$mcV$sp.apply(JFunction0$mcV$sp.java:23)
	at org.scalatest.OutcomeOf.outcomeOf(OutcomeOf.scala:85)
	at org.scalatest.OutcomeOf.outcomeOf$(OutcomeOf.scala:83)
	at org.scalatest.OutcomeOf$.outcomeOf(OutcomeOf.scala:104)
	at org.scalatest.Transformer.apply(Transformer.scala:22)
	at org.scalatest.Transformer.apply(Transformer.scala:20)
	at org.scalatest.FunSuiteLike$$anon$1.apply(FunSuiteLike.scala:186)
	at org.apache.spark.SparkFunSuite.withFixture(SparkFunSuite.scala:149)
	at org.scalatest.FunSuiteLike.invokeWithFixture$1(FunSuiteLike.scala:184)
	at org.scalatest.FunSuiteLike.$anonfun$runTest$1(FunSuiteLike.scala:196)
	at org.scalatest.SuperEngine.runTestImpl(Engine.scala:286)
	at org.scalatest.FunSuiteLike.runTest(FunSuiteLike.scala:196)
	at org.scalatest.FunSuiteLike.runTest$(FunSuiteLike.scala:178)
	at org.apache.spark.SparkFunSuite.org$scalatest$BeforeAndAfterEach$$super$runTest(SparkFunSuite.scala:56)
	at org.scalatest.BeforeAndAfterEach.runTest(BeforeAndAfterEach.scala:221)
	at org.scalatest.BeforeAndAfterEach.runTest$(BeforeAndAfterEach.scala:214)
	at org.apache.spark.SparkFunSuite.runTest(SparkFunSuite.scala:56)
	at org.scalatest.FunSuiteLike.$anonfun$runTests$1(FunSuiteLike.scala:229)
	at org.scalatest.SuperEngine.$anonfun$runTestsInBranch$1(Engine.scala:393)
	at scala.collection.immutable.List.foreach(List.scala:392)
	at org.scalatest.SuperEngine.traverseSubNodes$1(Engine.scala:381)
	at org.scalatest.SuperEngine.runTestsInBranch(Engine.scala:376)
	at org.scalatest.SuperEngine.runTestsImpl(Engine.scala:458)
	at org.scalatest.FunSuiteLike.runTests(FunSuiteLike.scala:229)
	at org.scalatest.FunSuiteLike.runTests$(FunSuiteLike.scala:228)
	at org.scalatest.FunSuite.runTests(FunSuite.scala:1560)
	at org.scalatest.Suite.run(Suite.scala:1124)
	at org.scalatest.Suite.run$(Suite.scala:1106)
	at org.scalatest.FunSuite.org$scalatest$FunSuiteLike$$super$run(FunSuite.scala:1560)
	at org.scalatest.FunSuiteLike.$anonfun$run$1(FunSuiteLike.scala:233)
	at org.scalatest.SuperEngine.runImpl(Engine.scala:518)
	at org.scalatest.FunSuiteLike.run(FunSuiteLike.scala:233)
	at org.scalatest.FunSuiteLike.run$(FunSuiteLike.scala:232)
	at org.apache.spark.SparkFunSuite.org$scalatest$BeforeAndAfterAll$$super$run(SparkFunSuite.scala:56)
	at org.scalatest.BeforeAndAfterAll.liftedTree1$1(BeforeAndAfterAll.scala:213)
	at org.scalatest.BeforeAndAfterAll.run(BeforeAndAfterAll.scala:210)
	at org.scalatest.BeforeAndAfterAll.run$(BeforeAndAfterAll.scala:208)
	at org.apache.spark.SparkFunSuite.run(SparkFunSuite.scala:56)
	at org.scalatest.tools.Framework.org$scalatest$tools$Framework$$runSuite(Framework.scala:317)
	at org.scalatest.tools.Framework$ScalaTestTask.execute(Framework.scala:510)
	at sbt.ForkMain$Run$2.call(ForkMain.java:296)
	at sbt.ForkMain$Run$2.call(ForkMain.java:286)
	at java.util.concurrent.FutureTask.run(FutureTask.java:266)
	at java.util.concurrent.ThreadPoolExecutor.runWorker(ThreadPoolExecutor.java:1149)
	at java.util.concurrent.ThreadPoolExecutor$Worker.run(ThreadPoolExecutor.java:624)
	at java.lang.Thread.run(Thread.java:748)
[info] - simple primitives (1 second, 288 milliseconds)
07:48:34.623 WARN org.apache.spark.sql.execution.command.DropTableCommand: org.apache.spark.sql.AnalysisException: Path does not exist: file:/home/jenkins/workspace/NewSparkPullRequestBuilder/target/tmp/spark-3681bf49-9cc2-4b9f-8ae8-d052211e5dfe;
org.apache.spark.sql.AnalysisException: Path does not exist: file:/home/jenkins/workspace/NewSparkPullRequestBuilder/target/tmp/spark-3681bf49-9cc2-4b9f-8ae8-d052211e5dfe;
	at org.apache.spark.sql.execution.datasources.DataSource$.$anonfun$checkAndGlobPathIfNecessary$1(DataSource.scala:759)
	at scala.collection.TraversableLike.$anonfun$flatMap$1(TraversableLike.scala:245)
	at scala.collection.immutable.List.foreach(List.scala:392)
	at scala.collection.TraversableLike.flatMap(TraversableLike.scala:245)
	at scala.collection.TraversableLike.flatMap$(TraversableLike.scala:242)
	at scala.collection.immutable.List.flatMap(List.scala:355)
	at org.apache.spark.sql.execution.datasources.DataSource$.checkAndGlobPathIfNecessary(DataSource.scala:746)
	at org.apache.spark.sql.execution.datasources.DataSource.checkAndGlobPathIfNecessary(DataSource.scala:575)
	at org.apache.spark.sql.execution.datasources.DataSource.resolveRelation(DataSource.scala:398)
	at org.apache.spark.sql.hive.HiveMetastoreCatalog.$anonfun$convertToLogicalRelation$5(HiveMetastoreCatalog.scala:248)
	at scala.Option.getOrElse(Option.scala:189)
	at org.apache.spark.sql.hive.HiveMetastoreCatalog.$anonfun$convertToLogicalRelation$4(HiveMetastoreCatalog.scala:238)
	at org.apache.spark.sql.hive.HiveMetastoreCatalog.withTableCreationLock(HiveMetastoreCatalog.scala:58)
	at org.apache.spark.sql.hive.HiveMetastoreCatalog.convertToLogicalRelation(HiveMetastoreCatalog.scala:231)
	at org.apache.spark.sql.hive.HiveMetastoreCatalog.convert(HiveMetastoreCatalog.scala:137)
	at org.apache.spark.sql.hive.RelationConversions$$anonfun$apply$4.applyOrElse(HiveStrategies.scala:220)
	at org.apache.spark.sql.hive.RelationConversions$$anonfun$apply$4.applyOrElse(HiveStrategies.scala:207)
	at org.apache.spark.sql.catalyst.plans.logical.AnalysisHelper.$anonfun$resolveOperatorsDown$2(AnalysisHelper.scala:108)
	at org.apache.spark.sql.catalyst.trees.CurrentOrigin$.withOrigin(TreeNode.scala:72)
	at org.apache.spark.sql.catalyst.plans.logical.AnalysisHelper.$anonfun$resolveOperatorsDown$1(AnalysisHelper.scala:108)
	at org.apache.spark.sql.catalyst.plans.logical.AnalysisHelper$.allowInvokingTransformsInAnalyzer(AnalysisHelper.scala:194)
	at org.apache.spark.sql.catalyst.plans.logical.AnalysisHelper.resolveOperatorsDown(AnalysisHelper.scala:106)
	at org.apache.spark.sql.catalyst.plans.logical.AnalysisHelper.resolveOperatorsDown$(AnalysisHelper.scala:104)
	at org.apache.spark.sql.catalyst.plans.logical.LogicalPlan.resolveOperatorsDown(LogicalPlan.scala:29)
	at org.apache.spark.sql.catalyst.plans.logical.AnalysisHelper.$anonfun$resolveOperatorsDown$4(AnalysisHelper.scala:113)
	at org.apache.spark.sql.catalyst.trees.TreeNode.$anonfun$mapChildren$1(TreeNode.scala:376)
	at org.apache.spark.sql.catalyst.trees.TreeNode.mapProductIterator(TreeNode.scala:214)
	at org.apache.spark.sql.catalyst.trees.TreeNode.mapChildren(TreeNode.scala:374)
	at org.apache.spark.sql.catalyst.trees.TreeNode.mapChildren(TreeNode.scala:327)
	at org.apache.spark.sql.catalyst.plans.logical.AnalysisHelper.$anonfun$resolveOperatorsDown$1(AnalysisHelper.scala:113)
	at org.apache.spark.sql.catalyst.plans.logical.AnalysisHelper$.allowInvokingTransformsInAnalyzer(AnalysisHelper.scala:194)
	at org.apache.spark.sql.catalyst.plans.logical.AnalysisHelper.resolveOperatorsDown(AnalysisHelper.scala:106)
	at org.apache.spark.sql.catalyst.plans.logical.AnalysisHelper.resolveOperatorsDown$(AnalysisHelper.scala:104)
	at org.apache.spark.sql.catalyst.plans.logical.LogicalPlan.resolveOperatorsDown(LogicalPlan.scala:29)
	at org.apache.spark.sql.catalyst.plans.logical.AnalysisHelper.resolveOperators(AnalysisHelper.scala:73)
	at org.apache.spark.sql.catalyst.plans.logical.AnalysisHelper.resolveOperators$(AnalysisHelper.scala:72)
	at org.apache.spark.sql.catalyst.plans.logical.LogicalPlan.resolveOperators(LogicalPlan.scala:29)
	at org.apache.spark.sql.hive.RelationConversions.apply(HiveStrategies.scala:207)
	at org.apache.spark.sql.hive.RelationConversions.apply(HiveStrategies.scala:191)
	at org.apache.spark.sql.catalyst.rules.RuleExecutor.$anonfun$execute$2(RuleExecutor.scala:130)
	at scala.collection.IndexedSeqOptimized.foldLeft(IndexedSeqOptimized.scala:60)
	at scala.collection.IndexedSeqOptimized.foldLeft$(IndexedSeqOptimized.scala:68)
	at scala.collection.mutable.ArrayBuffer.foldLeft(ArrayBuffer.scala:49)
	at org.apache.spark.sql.catalyst.rules.RuleExecutor.$anonfun$execute$1(RuleExecutor.scala:127)
	at org.apache.spark.sql.catalyst.rules.RuleExecutor.$anonfun$execute$1$adapted(RuleExecutor.scala:119)
	at scala.collection.immutable.List.foreach(List.scala:392)
	at org.apache.spark.sql.catalyst.rules.RuleExecutor.execute(RuleExecutor.scala:119)
	at org.apache.spark.sql.catalyst.analysis.Analyzer.org$apache$spark$sql$catalyst$analysis$Analyzer$$executeSameContext(Analyzer.scala:168)
	at org.apache.spark.sql.catalyst.analysis.Analyzer.execute(Analyzer.scala:162)
	at org.apache.spark.sql.catalyst.analysis.Analyzer.execute(Analyzer.scala:122)
	at org.apache.spark.sql.catalyst.rules.RuleExecutor.$anonfun$executeAndTrack$1(RuleExecutor.scala:98)
	at org.apache.spark.sql.catalyst.QueryPlanningTracker$.withTracker(QueryPlanningTracker.scala:88)
	at org.apache.spark.sql.catalyst.rules.RuleExecutor.executeAndTrack(RuleExecutor.scala:98)
	at org.apache.spark.sql.catalyst.analysis.Analyzer.$anonfun$executeAndCheck$1(Analyzer.scala:146)
	at org.apache.spark.sql.catalyst.plans.logical.AnalysisHelper$.markInAnalyzer(AnalysisHelper.scala:201)
	at org.apache.spark.sql.catalyst.analysis.Analyzer.executeAndCheck(Analyzer.scala:145)
	at org.apache.spark.sql.hive.test.TestHiveQueryExecution.analyzed$lzycompute(TestHive.scala:606)
	at org.apache.spark.sql.hive.test.TestHiveQueryExecution.analyzed(TestHive.scala:589)
	at org.apache.spark.sql.execution.QueryExecution.assertAnalyzed(QueryExecution.scala:55)
	at org.apache.spark.sql.Dataset$.ofRows(Dataset.scala:87)
	at org.apache.spark.sql.SparkSession.table(SparkSession.scala:589)
	at org.apache.spark.sql.execution.command.DropTableCommand.run(ddl.scala:241)
	at org.apache.spark.sql.execution.command.ExecutedCommandExec.sideEffectResult$lzycompute(commands.scala:70)
	at org.apache.spark.sql.execution.command.ExecutedCommandExec.sideEffectResult(commands.scala:68)
	at org.apache.spark.sql.execution.command.ExecutedCommandExec.executeCollect(commands.scala:79)
	at org.apache.spark.sql.Dataset.$anonfun$logicalPlan$1(Dataset.scala:226)
	at org.apache.spark.sql.Dataset.$anonfun$withAction$1(Dataset.scala:3477)
	at org.apache.spark.sql.execution.SQLExecution$.$anonfun$withNewExecutionId$4(SQLExecution.scala:100)
	at org.apache.spark.sql.execution.SQLExecution$.withSQLConfPropagated(SQLExecution.scala:160)
	at org.apache.spark.sql.execution.SQLExecution$.withNewExecutionId(SQLExecution.scala:87)
	at org.apache.spark.sql.Dataset.withAction(Dataset.scala:3473)
	at org.apache.spark.sql.Dataset.<init>(Dataset.scala:226)
	at org.apache.spark.sql.Dataset$.ofRows(Dataset.scala:88)
	at org.apache.spark.sql.hive.test.TestHiveSparkSession.sql(TestHive.scala:238)
	at org.apache.spark.sql.test.SQLTestUtilsBase.$anonfun$withTable$2(SQLTestUtils.scala:291)
	at scala.collection.IndexedSeqOptimized.foreach(IndexedSeqOptimized.scala:36)
	at scala.collection.IndexedSeqOptimized.foreach$(IndexedSeqOptimized.scala:33)
	at scala.collection.mutable.WrappedArray.foreach(WrappedArray.scala:38)
	at org.apache.spark.sql.test.SQLTestUtilsBase.$anonfun$withTable$1(SQLTestUtils.scala:290)
	at org.apache.spark.util.Utils$.tryWithSafeFinally(Utils.scala:1386)
	at org.apache.spark.sql.test.SQLTestUtilsBase.withTable(SQLTestUtils.scala:290)
	at org.apache.spark.sql.test.SQLTestUtilsBase.withTable$(SQLTestUtils.scala:288)
	at org.apache.spark.sql.execution.datasources.parquet.ParquetCompatibilityTest.withTable(ParquetCompatibilityTest.scala:35)
	at org.apache.spark.sql.hive.ParquetHiveCompatibilitySuite.testParquetHiveCompatibility(ParquetHiveCompatibilitySuite.scala:47)
	at org.apache.spark.sql.hive.ParquetHiveCompatibilitySuite.$anonfun$new$2(ParquetHiveCompatibilitySuite.scala:98)
	at scala.runtime.java8.JFunction0$mcV$sp.apply(JFunction0$mcV$sp.java:23)
	at org.scalatest.OutcomeOf.outcomeOf(OutcomeOf.scala:85)
	at org.scalatest.OutcomeOf.outcomeOf$(OutcomeOf.scala:83)
	at org.scalatest.OutcomeOf$.outcomeOf(OutcomeOf.scala:104)
	at org.scalatest.Transformer.apply(Transformer.scala:22)
	at org.scalatest.Transformer.apply(Transformer.scala:20)
	at org.scalatest.FunSuiteLike$$anon$1.apply(FunSuiteLike.scala:186)
	at org.apache.spark.SparkFunSuite.withFixture(SparkFunSuite.scala:149)
	at org.scalatest.FunSuiteLike.invokeWithFixture$1(FunSuiteLike.scala:184)
	at org.scalatest.FunSuiteLike.$anonfun$runTest$1(FunSuiteLike.scala:196)
	at org.scalatest.SuperEngine.runTestImpl(Engine.scala:286)
	at org.scalatest.FunSuiteLike.runTest(FunSuiteLike.scala:196)
	at org.scalatest.FunSuiteLike.runTest$(FunSuiteLike.scala:178)
	at org.apache.spark.SparkFunSuite.org$scalatest$BeforeAndAfterEach$$super$runTest(SparkFunSuite.scala:56)
	at org.scalatest.BeforeAndAfterEach.runTest(BeforeAndAfterEach.scala:221)
	at org.scalatest.BeforeAndAfterEach.runTest$(BeforeAndAfterEach.scala:214)
	at org.apache.spark.SparkFunSuite.runTest(SparkFunSuite.scala:56)
	at org.scalatest.FunSuiteLike.$anonfun$runTests$1(FunSuiteLike.scala:229)
	at org.scalatest.SuperEngine.$anonfun$runTestsInBranch$1(Engine.scala:393)
	at scala.collection.immutable.List.foreach(List.scala:392)
	at org.scalatest.SuperEngine.traverseSubNodes$1(Engine.scala:381)
	at org.scalatest.SuperEngine.runTestsInBranch(Engine.scala:376)
	at org.scalatest.SuperEngine.runTestsImpl(Engine.scala:458)
	at org.scalatest.FunSuiteLike.runTests(FunSuiteLike.scala:229)
	at org.scalatest.FunSuiteLike.runTests$(FunSuiteLike.scala:228)
	at org.scalatest.FunSuite.runTests(FunSuite.scala:1560)
	at org.scalatest.Suite.run(Suite.scala:1124)
	at org.scalatest.Suite.run$(Suite.scala:1106)
	at org.scalatest.FunSuite.org$scalatest$FunSuiteLike$$super$run(FunSuite.scala:1560)
	at org.scalatest.FunSuiteLike.$anonfun$run$1(FunSuiteLike.scala:233)
	at org.scalatest.SuperEngine.runImpl(Engine.scala:518)
	at org.scalatest.FunSuiteLike.run(FunSuiteLike.scala:233)
	at org.scalatest.FunSuiteLike.run$(FunSuiteLike.scala:232)
	at org.apache.spark.SparkFunSuite.org$scalatest$BeforeAndAfterAll$$super$run(SparkFunSuite.scala:56)
	at org.scalatest.BeforeAndAfterAll.liftedTree1$1(BeforeAndAfterAll.scala:213)
	at org.scalatest.BeforeAndAfterAll.run(BeforeAndAfterAll.scala:210)
	at org.scalatest.BeforeAndAfterAll.run$(BeforeAndAfterAll.scala:208)
	at org.apache.spark.SparkFunSuite.run(SparkFunSuite.scala:56)
	at org.scalatest.tools.Framework.org$scalatest$tools$Framework$$runSuite(Framework.scala:317)
	at org.scalatest.tools.Framework$ScalaTestTask.execute(Framework.scala:510)
	at sbt.ForkMain$Run$2.call(ForkMain.java:296)
	at sbt.ForkMain$Run$2.call(ForkMain.java:286)
	at java.util.concurrent.FutureTask.run(FutureTask.java:266)
	at java.util.concurrent.ThreadPoolExecutor.runWorker(ThreadPoolExecutor.java:1149)
	at java.util.concurrent.ThreadPoolExecutor$Worker.run(ThreadPoolExecutor.java:624)
	at java.lang.Thread.run(Thread.java:748)
[info] - SPARK-10177 timestamp (1 second, 115 milliseconds)
07:48:35.957 WARN org.apache.spark.sql.execution.command.DropTableCommand: org.apache.spark.sql.AnalysisException: Path does not exist: file:/home/jenkins/workspace/NewSparkPullRequestBuilder/target/tmp/spark-125b1496-74f8-44a4-8298-ab45a98c8f65;
org.apache.spark.sql.AnalysisException: Path does not exist: file:/home/jenkins/workspace/NewSparkPullRequestBuilder/target/tmp/spark-125b1496-74f8-44a4-8298-ab45a98c8f65;
	at org.apache.spark.sql.execution.datasources.DataSource$.$anonfun$checkAndGlobPathIfNecessary$1(DataSource.scala:759)
	at scala.collection.TraversableLike.$anonfun$flatMap$1(TraversableLike.scala:245)
	at scala.collection.immutable.List.foreach(List.scala:392)
	at scala.collection.TraversableLike.flatMap(TraversableLike.scala:245)
	at scala.collection.TraversableLike.flatMap$(TraversableLike.scala:242)
	at scala.collection.immutable.List.flatMap(List.scala:355)
	at org.apache.spark.sql.execution.datasources.DataSource$.checkAndGlobPathIfNecessary(DataSource.scala:746)
	at org.apache.spark.sql.execution.datasources.DataSource.checkAndGlobPathIfNecessary(DataSource.scala:575)
	at org.apache.spark.sql.execution.datasources.DataSource.resolveRelation(DataSource.scala:398)
	at org.apache.spark.sql.hive.HiveMetastoreCatalog.$anonfun$convertToLogicalRelation$5(HiveMetastoreCatalog.scala:248)
	at scala.Option.getOrElse(Option.scala:189)
	at org.apache.spark.sql.hive.HiveMetastoreCatalog.$anonfun$convertToLogicalRelation$4(HiveMetastoreCatalog.scala:238)
	at org.apache.spark.sql.hive.HiveMetastoreCatalog.withTableCreationLock(HiveMetastoreCatalog.scala:58)
	at org.apache.spark.sql.hive.HiveMetastoreCatalog.convertToLogicalRelation(HiveMetastoreCatalog.scala:231)
	at org.apache.spark.sql.hive.HiveMetastoreCatalog.convert(HiveMetastoreCatalog.scala:137)
	at org.apache.spark.sql.hive.RelationConversions$$anonfun$apply$4.applyOrElse(HiveStrategies.scala:220)
	at org.apache.spark.sql.hive.RelationConversions$$anonfun$apply$4.applyOrElse(HiveStrategies.scala:207)
	at org.apache.spark.sql.catalyst.plans.logical.AnalysisHelper.$anonfun$resolveOperatorsDown$2(AnalysisHelper.scala:108)
	at org.apache.spark.sql.catalyst.trees.CurrentOrigin$.withOrigin(TreeNode.scala:72)
	at org.apache.spark.sql.catalyst.plans.logical.AnalysisHelper.$anonfun$resolveOperatorsDown$1(AnalysisHelper.scala:108)
	at org.apache.spark.sql.catalyst.plans.logical.AnalysisHelper$.allowInvokingTransformsInAnalyzer(AnalysisHelper.scala:194)
	at org.apache.spark.sql.catalyst.plans.logical.AnalysisHelper.resolveOperatorsDown(AnalysisHelper.scala:106)
	at org.apache.spark.sql.catalyst.plans.logical.AnalysisHelper.resolveOperatorsDown$(AnalysisHelper.scala:104)
	at org.apache.spark.sql.catalyst.plans.logical.LogicalPlan.resolveOperatorsDown(LogicalPlan.scala:29)
	at org.apache.spark.sql.catalyst.plans.logical.AnalysisHelper.$anonfun$resolveOperatorsDown$4(AnalysisHelper.scala:113)
	at org.apache.spark.sql.catalyst.trees.TreeNode.$anonfun$mapChildren$1(TreeNode.scala:376)
	at org.apache.spark.sql.catalyst.trees.TreeNode.mapProductIterator(TreeNode.scala:214)
	at org.apache.spark.sql.catalyst.trees.TreeNode.mapChildren(TreeNode.scala:374)
	at org.apache.spark.sql.catalyst.trees.TreeNode.mapChildren(TreeNode.scala:327)
	at org.apache.spark.sql.catalyst.plans.logical.AnalysisHelper.$anonfun$resolveOperatorsDown$1(AnalysisHelper.scala:113)
	at org.apache.spark.sql.catalyst.plans.logical.AnalysisHelper$.allowInvokingTransformsInAnalyzer(AnalysisHelper.scala:194)
	at org.apache.spark.sql.catalyst.plans.logical.AnalysisHelper.resolveOperatorsDown(AnalysisHelper.scala:106)
	at org.apache.spark.sql.catalyst.plans.logical.AnalysisHelper.resolveOperatorsDown$(AnalysisHelper.scala:104)
	at org.apache.spark.sql.catalyst.plans.logical.LogicalPlan.resolveOperatorsDown(LogicalPlan.scala:29)
	at org.apache.spark.sql.catalyst.plans.logical.AnalysisHelper.resolveOperators(AnalysisHelper.scala:73)
	at org.apache.spark.sql.catalyst.plans.logical.AnalysisHelper.resolveOperators$(AnalysisHelper.scala:72)
	at org.apache.spark.sql.catalyst.plans.logical.LogicalPlan.resolveOperators(LogicalPlan.scala:29)
	at org.apache.spark.sql.hive.RelationConversions.apply(HiveStrategies.scala:207)
	at org.apache.spark.sql.hive.RelationConversions.apply(HiveStrategies.scala:191)
	at org.apache.spark.sql.catalyst.rules.RuleExecutor.$anonfun$execute$2(RuleExecutor.scala:130)
	at scala.collection.IndexedSeqOptimized.foldLeft(IndexedSeqOptimized.scala:60)
	at scala.collection.IndexedSeqOptimized.foldLeft$(IndexedSeqOptimized.scala:68)
	at scala.collection.mutable.ArrayBuffer.foldLeft(ArrayBuffer.scala:49)
	at org.apache.spark.sql.catalyst.rules.RuleExecutor.$anonfun$execute$1(RuleExecutor.scala:127)
	at org.apache.spark.sql.catalyst.rules.RuleExecutor.$anonfun$execute$1$adapted(RuleExecutor.scala:119)
	at scala.collection.immutable.List.foreach(List.scala:392)
	at org.apache.spark.sql.catalyst.rules.RuleExecutor.execute(RuleExecutor.scala:119)
	at org.apache.spark.sql.catalyst.analysis.Analyzer.org$apache$spark$sql$catalyst$analysis$Analyzer$$executeSameContext(Analyzer.scala:168)
	at org.apache.spark.sql.catalyst.analysis.Analyzer.execute(Analyzer.scala:162)
	at org.apache.spark.sql.catalyst.analysis.Analyzer.execute(Analyzer.scala:122)
	at org.apache.spark.sql.catalyst.rules.RuleExecutor.$anonfun$executeAndTrack$1(RuleExecutor.scala:98)
	at org.apache.spark.sql.catalyst.QueryPlanningTracker$.withTracker(QueryPlanningTracker.scala:88)
	at org.apache.spark.sql.catalyst.rules.RuleExecutor.executeAndTrack(RuleExecutor.scala:98)
	at org.apache.spark.sql.catalyst.analysis.Analyzer.$anonfun$executeAndCheck$1(Analyzer.scala:146)
	at org.apache.spark.sql.catalyst.plans.logical.AnalysisHelper$.markInAnalyzer(AnalysisHelper.scala:201)
	at org.apache.spark.sql.catalyst.analysis.Analyzer.executeAndCheck(Analyzer.scala:145)
	at org.apache.spark.sql.hive.test.TestHiveQueryExecution.analyzed$lzycompute(TestHive.scala:606)
	at org.apache.spark.sql.hive.test.TestHiveQueryExecution.analyzed(TestHive.scala:589)
	at org.apache.spark.sql.execution.QueryExecution.assertAnalyzed(QueryExecution.scala:55)
	at org.apache.spark.sql.Dataset$.ofRows(Dataset.scala:87)
	at org.apache.spark.sql.SparkSession.table(SparkSession.scala:589)
	at org.apache.spark.sql.execution.command.DropTableCommand.run(ddl.scala:241)
	at org.apache.spark.sql.execution.command.ExecutedCommandExec.sideEffectResult$lzycompute(commands.scala:70)
	at org.apache.spark.sql.execution.command.ExecutedCommandExec.sideEffectResult(commands.scala:68)
	at org.apache.spark.sql.execution.command.ExecutedCommandExec.executeCollect(commands.scala:79)
	at org.apache.spark.sql.Dataset.$anonfun$logicalPlan$1(Dataset.scala:226)
	at org.apache.spark.sql.Dataset.$anonfun$withAction$1(Dataset.scala:3477)
	at org.apache.spark.sql.execution.SQLExecution$.$anonfun$withNewExecutionId$4(SQLExecution.scala:100)
	at org.apache.spark.sql.execution.SQLExecution$.withSQLConfPropagated(SQLExecution.scala:160)
	at org.apache.spark.sql.execution.SQLExecution$.withNewExecutionId(SQLExecution.scala:87)
	at org.apache.spark.sql.Dataset.withAction(Dataset.scala:3473)
	at org.apache.spark.sql.Dataset.<init>(Dataset.scala:226)
	at org.apache.spark.sql.Dataset$.ofRows(Dataset.scala:88)
	at org.apache.spark.sql.hive.test.TestHiveSparkSession.sql(TestHive.scala:238)
	at org.apache.spark.sql.test.SQLTestUtilsBase.$anonfun$withTable$2(SQLTestUtils.scala:291)
	at scala.collection.IndexedSeqOptimized.foreach(IndexedSeqOptimized.scala:36)
	at scala.collection.IndexedSeqOptimized.foreach$(IndexedSeqOptimized.scala:33)
	at scala.collection.mutable.WrappedArray.foreach(WrappedArray.scala:38)
	at org.apache.spark.sql.test.SQLTestUtilsBase.$anonfun$withTable$1(SQLTestUtils.scala:290)
	at org.apache.spark.util.Utils$.tryWithSafeFinally(Utils.scala:1386)
	at org.apache.spark.sql.test.SQLTestUtilsBase.withTable(SQLTestUtils.scala:290)
	at org.apache.spark.sql.test.SQLTestUtilsBase.withTable$(SQLTestUtils.scala:288)
	at org.apache.spark.sql.execution.datasources.parquet.ParquetCompatibilityTest.withTable(ParquetCompatibilityTest.scala:35)
	at org.apache.spark.sql.hive.ParquetHiveCompatibilitySuite.testParquetHiveCompatibility(ParquetHiveCompatibilitySuite.scala:47)
	at org.apache.spark.sql.hive.ParquetHiveCompatibilitySuite.$anonfun$new$3(ParquetHiveCompatibilitySuite.scala:111)
	at scala.runtime.java8.JFunction0$mcV$sp.apply(JFunction0$mcV$sp.java:23)
	at org.scalatest.OutcomeOf.outcomeOf(OutcomeOf.scala:85)
	at org.scalatest.OutcomeOf.outcomeOf$(OutcomeOf.scala:83)
	at org.scalatest.OutcomeOf$.outcomeOf(OutcomeOf.scala:104)
	at org.scalatest.Transformer.apply(Transformer.scala:22)
	at org.scalatest.Transformer.apply(Transformer.scala:20)
	at org.scalatest.FunSuiteLike$$anon$1.apply(FunSuiteLike.scala:186)
	at org.apache.spark.SparkFunSuite.withFixture(SparkFunSuite.scala:149)
	at org.scalatest.FunSuiteLike.invokeWithFixture$1(FunSuiteLike.scala:184)
	at org.scalatest.FunSuiteLike.$anonfun$runTest$1(FunSuiteLike.scala:196)
	at org.scalatest.SuperEngine.runTestImpl(Engine.scala:286)
	at org.scalatest.FunSuiteLike.runTest(FunSuiteLike.scala:196)
	at org.scalatest.FunSuiteLike.runTest$(FunSuiteLike.scala:178)
	at org.apache.spark.SparkFunSuite.org$scalatest$BeforeAndAfterEach$$super$runTest(SparkFunSuite.scala:56)
	at org.scalatest.BeforeAndAfterEach.runTest(BeforeAndAfterEach.scala:221)
	at org.scalatest.BeforeAndAfterEach.runTest$(BeforeAndAfterEach.scala:214)
	at org.apache.spark.SparkFunSuite.runTest(SparkFunSuite.scala:56)
	at org.scalatest.FunSuiteLike.$anonfun$runTests$1(FunSuiteLike.scala:229)
	at org.scalatest.SuperEngine.$anonfun$runTestsInBranch$1(Engine.scala:393)
	at scala.collection.immutable.List.foreach(List.scala:392)
	at org.scalatest.SuperEngine.traverseSubNodes$1(Engine.scala:381)
	at org.scalatest.SuperEngine.runTestsInBranch(Engine.scala:376)
	at org.scalatest.SuperEngine.runTestsImpl(Engine.scala:458)
	at org.scalatest.FunSuiteLike.runTests(FunSuiteLike.scala:229)
	at org.scalatest.FunSuiteLike.runTests$(FunSuiteLike.scala:228)
	at org.scalatest.FunSuite.runTests(FunSuite.scala:1560)
	at org.scalatest.Suite.run(Suite.scala:1124)
	at org.scalatest.Suite.run$(Suite.scala:1106)
	at org.scalatest.FunSuite.org$scalatest$FunSuiteLike$$super$run(FunSuite.scala:1560)
	at org.scalatest.FunSuiteLike.$anonfun$run$1(FunSuiteLike.scala:233)
	at org.scalatest.SuperEngine.runImpl(Engine.scala:518)
	at org.scalatest.FunSuiteLike.run(FunSuiteLike.scala:233)
	at org.scalatest.FunSuiteLike.run$(FunSuiteLike.scala:232)
	at org.apache.spark.SparkFunSuite.org$scalatest$BeforeAndAfterAll$$super$run(SparkFunSuite.scala:56)
	at org.scalatest.BeforeAndAfterAll.liftedTree1$1(BeforeAndAfterAll.scala:213)
	at org.scalatest.BeforeAndAfterAll.run(BeforeAndAfterAll.scala:210)
	at org.scalatest.BeforeAndAfterAll.run$(BeforeAndAfterAll.scala:208)
	at org.apache.spark.SparkFunSuite.run(SparkFunSuite.scala:56)
	at org.scalatest.tools.Framework.org$scalatest$tools$Framework$$runSuite(Framework.scala:317)
	at org.scalatest.tools.Framework$ScalaTestTask.execute(Framework.scala:510)
	at sbt.ForkMain$Run$2.call(ForkMain.java:296)
	at sbt.ForkMain$Run$2.call(ForkMain.java:286)
	at java.util.concurrent.FutureTask.run(FutureTask.java:266)
	at java.util.concurrent.ThreadPoolExecutor.runWorker(ThreadPoolExecutor.java:1149)
	at java.util.concurrent.ThreadPoolExecutor$Worker.run(ThreadPoolExecutor.java:624)
	at java.lang.Thread.run(Thread.java:748)
[info] - array (1 second, 320 milliseconds)
07:48:37.188 WARN org.apache.spark.sql.execution.command.DropTableCommand: org.apache.spark.sql.AnalysisException: Path does not exist: file:/home/jenkins/workspace/NewSparkPullRequestBuilder/target/tmp/spark-91623218-a540-4b4d-97bd-ba80254f490c;
org.apache.spark.sql.AnalysisException: Path does not exist: file:/home/jenkins/workspace/NewSparkPullRequestBuilder/target/tmp/spark-91623218-a540-4b4d-97bd-ba80254f490c;
	at org.apache.spark.sql.execution.datasources.DataSource$.$anonfun$checkAndGlobPathIfNecessary$1(DataSource.scala:759)
	at scala.collection.TraversableLike.$anonfun$flatMap$1(TraversableLike.scala:245)
	at scala.collection.immutable.List.foreach(List.scala:392)
	at scala.collection.TraversableLike.flatMap(TraversableLike.scala:245)
	at scala.collection.TraversableLike.flatMap$(TraversableLike.scala:242)
	at scala.collection.immutable.List.flatMap(List.scala:355)
	at org.apache.spark.sql.execution.datasources.DataSource$.checkAndGlobPathIfNecessary(DataSource.scala:746)
	at org.apache.spark.sql.execution.datasources.DataSource.checkAndGlobPathIfNecessary(DataSource.scala:575)
	at org.apache.spark.sql.execution.datasources.DataSource.resolveRelation(DataSource.scala:398)
	at org.apache.spark.sql.hive.HiveMetastoreCatalog.$anonfun$convertToLogicalRelation$5(HiveMetastoreCatalog.scala:248)
	at scala.Option.getOrElse(Option.scala:189)
	at org.apache.spark.sql.hive.HiveMetastoreCatalog.$anonfun$convertToLogicalRelation$4(HiveMetastoreCatalog.scala:238)
	at org.apache.spark.sql.hive.HiveMetastoreCatalog.withTableCreationLock(HiveMetastoreCatalog.scala:58)
	at org.apache.spark.sql.hive.HiveMetastoreCatalog.convertToLogicalRelation(HiveMetastoreCatalog.scala:231)
	at org.apache.spark.sql.hive.HiveMetastoreCatalog.convert(HiveMetastoreCatalog.scala:137)
	at org.apache.spark.sql.hive.RelationConversions$$anonfun$apply$4.applyOrElse(HiveStrategies.scala:220)
	at org.apache.spark.sql.hive.RelationConversions$$anonfun$apply$4.applyOrElse(HiveStrategies.scala:207)
	at org.apache.spark.sql.catalyst.plans.logical.AnalysisHelper.$anonfun$resolveOperatorsDown$2(AnalysisHelper.scala:108)
	at org.apache.spark.sql.catalyst.trees.CurrentOrigin$.withOrigin(TreeNode.scala:72)
	at org.apache.spark.sql.catalyst.plans.logical.AnalysisHelper.$anonfun$resolveOperatorsDown$1(AnalysisHelper.scala:108)
	at org.apache.spark.sql.catalyst.plans.logical.AnalysisHelper$.allowInvokingTransformsInAnalyzer(AnalysisHelper.scala:194)
	at org.apache.spark.sql.catalyst.plans.logical.AnalysisHelper.resolveOperatorsDown(AnalysisHelper.scala:106)
	at org.apache.spark.sql.catalyst.plans.logical.AnalysisHelper.resolveOperatorsDown$(AnalysisHelper.scala:104)
	at org.apache.spark.sql.catalyst.plans.logical.LogicalPlan.resolveOperatorsDown(LogicalPlan.scala:29)
	at org.apache.spark.sql.catalyst.plans.logical.AnalysisHelper.$anonfun$resolveOperatorsDown$4(AnalysisHelper.scala:113)
	at org.apache.spark.sql.catalyst.trees.TreeNode.$anonfun$mapChildren$1(TreeNode.scala:376)
	at org.apache.spark.sql.catalyst.trees.TreeNode.mapProductIterator(TreeNode.scala:214)
	at org.apache.spark.sql.catalyst.trees.TreeNode.mapChildren(TreeNode.scala:374)
	at org.apache.spark.sql.catalyst.trees.TreeNode.mapChildren(TreeNode.scala:327)
	at org.apache.spark.sql.catalyst.plans.logical.AnalysisHelper.$anonfun$resolveOperatorsDown$1(AnalysisHelper.scala:113)
	at org.apache.spark.sql.catalyst.plans.logical.AnalysisHelper$.allowInvokingTransformsInAnalyzer(AnalysisHelper.scala:194)
	at org.apache.spark.sql.catalyst.plans.logical.AnalysisHelper.resolveOperatorsDown(AnalysisHelper.scala:106)
	at org.apache.spark.sql.catalyst.plans.logical.AnalysisHelper.resolveOperatorsDown$(AnalysisHelper.scala:104)
	at org.apache.spark.sql.catalyst.plans.logical.LogicalPlan.resolveOperatorsDown(LogicalPlan.scala:29)
	at org.apache.spark.sql.catalyst.plans.logical.AnalysisHelper.resolveOperators(AnalysisHelper.scala:73)
	at org.apache.spark.sql.catalyst.plans.logical.AnalysisHelper.resolveOperators$(AnalysisHelper.scala:72)
	at org.apache.spark.sql.catalyst.plans.logical.LogicalPlan.resolveOperators(LogicalPlan.scala:29)
	at org.apache.spark.sql.hive.RelationConversions.apply(HiveStrategies.scala:207)
	at org.apache.spark.sql.hive.RelationConversions.apply(HiveStrategies.scala:191)
	at org.apache.spark.sql.catalyst.rules.RuleExecutor.$anonfun$execute$2(RuleExecutor.scala:130)
	at scala.collection.IndexedSeqOptimized.foldLeft(IndexedSeqOptimized.scala:60)
	at scala.collection.IndexedSeqOptimized.foldLeft$(IndexedSeqOptimized.scala:68)
	at scala.collection.mutable.ArrayBuffer.foldLeft(ArrayBuffer.scala:49)
	at org.apache.spark.sql.catalyst.rules.RuleExecutor.$anonfun$execute$1(RuleExecutor.scala:127)
	at org.apache.spark.sql.catalyst.rules.RuleExecutor.$anonfun$execute$1$adapted(RuleExecutor.scala:119)
	at scala.collection.immutable.List.foreach(List.scala:392)
	at org.apache.spark.sql.catalyst.rules.RuleExecutor.execute(RuleExecutor.scala:119)
	at org.apache.spark.sql.catalyst.analysis.Analyzer.org$apache$spark$sql$catalyst$analysis$Analyzer$$executeSameContext(Analyzer.scala:168)
	at org.apache.spark.sql.catalyst.analysis.Analyzer.execute(Analyzer.scala:162)
	at org.apache.spark.sql.catalyst.analysis.Analyzer.execute(Analyzer.scala:122)
	at org.apache.spark.sql.catalyst.rules.RuleExecutor.$anonfun$executeAndTrack$1(RuleExecutor.scala:98)
	at org.apache.spark.sql.catalyst.QueryPlanningTracker$.withTracker(QueryPlanningTracker.scala:88)
	at org.apache.spark.sql.catalyst.rules.RuleExecutor.executeAndTrack(RuleExecutor.scala:98)
	at org.apache.spark.sql.catalyst.analysis.Analyzer.$anonfun$executeAndCheck$1(Analyzer.scala:146)
	at org.apache.spark.sql.catalyst.plans.logical.AnalysisHelper$.markInAnalyzer(AnalysisHelper.scala:201)
	at org.apache.spark.sql.catalyst.analysis.Analyzer.executeAndCheck(Analyzer.scala:145)
	at org.apache.spark.sql.hive.test.TestHiveQueryExecution.analyzed$lzycompute(TestHive.scala:606)
	at org.apache.spark.sql.hive.test.TestHiveQueryExecution.analyzed(TestHive.scala:589)
	at org.apache.spark.sql.execution.QueryExecution.assertAnalyzed(QueryExecution.scala:55)
	at org.apache.spark.sql.Dataset$.ofRows(Dataset.scala:87)
	at org.apache.spark.sql.SparkSession.table(SparkSession.scala:589)
	at org.apache.spark.sql.execution.command.DropTableCommand.run(ddl.scala:241)
	at org.apache.spark.sql.execution.command.ExecutedCommandExec.sideEffectResult$lzycompute(commands.scala:70)
	at org.apache.spark.sql.execution.command.ExecutedCommandExec.sideEffectResult(commands.scala:68)
	at org.apache.spark.sql.execution.command.ExecutedCommandExec.executeCollect(commands.scala:79)
	at org.apache.spark.sql.Dataset.$anonfun$logicalPlan$1(Dataset.scala:226)
	at org.apache.spark.sql.Dataset.$anonfun$withAction$1(Dataset.scala:3477)
	at org.apache.spark.sql.execution.SQLExecution$.$anonfun$withNewExecutionId$4(SQLExecution.scala:100)
	at org.apache.spark.sql.execution.SQLExecution$.withSQLConfPropagated(SQLExecution.scala:160)
	at org.apache.spark.sql.execution.SQLExecution$.withNewExecutionId(SQLExecution.scala:87)
	at org.apache.spark.sql.Dataset.withAction(Dataset.scala:3473)
	at org.apache.spark.sql.Dataset.<init>(Dataset.scala:226)
	at org.apache.spark.sql.Dataset$.ofRows(Dataset.scala:88)
	at org.apache.spark.sql.hive.test.TestHiveSparkSession.sql(TestHive.scala:238)
	at org.apache.spark.sql.test.SQLTestUtilsBase.$anonfun$withTable$2(SQLTestUtils.scala:291)
	at scala.collection.IndexedSeqOptimized.foreach(IndexedSeqOptimized.scala:36)
	at scala.collection.IndexedSeqOptimized.foreach$(IndexedSeqOptimized.scala:33)
	at scala.collection.mutable.WrappedArray.foreach(WrappedArray.scala:38)
	at org.apache.spark.sql.test.SQLTestUtilsBase.$anonfun$withTable$1(SQLTestUtils.scala:290)
	at org.apache.spark.util.Utils$.tryWithSafeFinally(Utils.scala:1386)
	at org.apache.spark.sql.test.SQLTestUtilsBase.withTable(SQLTestUtils.scala:290)
	at org.apache.spark.sql.test.SQLTestUtilsBase.withTable$(SQLTestUtils.scala:288)
	at org.apache.spark.sql.execution.datasources.parquet.ParquetCompatibilityTest.withTable(ParquetCompatibilityTest.scala:35)
	at org.apache.spark.sql.hive.ParquetHiveCompatibilitySuite.testParquetHiveCompatibility(ParquetHiveCompatibilitySuite.scala:47)
	at org.apache.spark.sql.hive.ParquetHiveCompatibilitySuite.$anonfun$new$4(ParquetHiveCompatibilitySuite.scala:120)
	at scala.runtime.java8.JFunction0$mcV$sp.apply(JFunction0$mcV$sp.java:23)
	at org.scalatest.OutcomeOf.outcomeOf(OutcomeOf.scala:85)
	at org.scalatest.OutcomeOf.outcomeOf$(OutcomeOf.scala:83)
	at org.scalatest.OutcomeOf$.outcomeOf(OutcomeOf.scala:104)
	at org.scalatest.Transformer.apply(Transformer.scala:22)
	at org.scalatest.Transformer.apply(Transformer.scala:20)
	at org.scalatest.FunSuiteLike$$anon$1.apply(FunSuiteLike.scala:186)
	at org.apache.spark.SparkFunSuite.withFixture(SparkFunSuite.scala:149)
	at org.scalatest.FunSuiteLike.invokeWithFixture$1(FunSuiteLike.scala:184)
	at org.scalatest.FunSuiteLike.$anonfun$runTest$1(FunSuiteLike.scala:196)
	at org.scalatest.SuperEngine.runTestImpl(Engine.scala:286)
	at org.scalatest.FunSuiteLike.runTest(FunSuiteLike.scala:196)
	at org.scalatest.FunSuiteLike.runTest$(FunSuiteLike.scala:178)
	at org.apache.spark.SparkFunSuite.org$scalatest$BeforeAndAfterEach$$super$runTest(SparkFunSuite.scala:56)
	at org.scalatest.BeforeAndAfterEach.runTest(BeforeAndAfterEach.scala:221)
	at org.scalatest.BeforeAndAfterEach.runTest$(BeforeAndAfterEach.scala:214)
	at org.apache.spark.SparkFunSuite.runTest(SparkFunSuite.scala:56)
	at org.scalatest.FunSuiteLike.$anonfun$runTests$1(FunSuiteLike.scala:229)
	at org.scalatest.SuperEngine.$anonfun$runTestsInBranch$1(Engine.scala:393)
	at scala.collection.immutable.List.foreach(List.scala:392)
	at org.scalatest.SuperEngine.traverseSubNodes$1(Engine.scala:381)
	at org.scalatest.SuperEngine.runTestsInBranch(Engine.scala:376)
	at org.scalatest.SuperEngine.runTestsImpl(Engine.scala:458)
	at org.scalatest.FunSuiteLike.runTests(FunSuiteLike.scala:229)
	at org.scalatest.FunSuiteLike.runTests$(FunSuiteLike.scala:228)
	at org.scalatest.FunSuite.runTests(FunSuite.scala:1560)
	at org.scalatest.Suite.run(Suite.scala:1124)
	at org.scalatest.Suite.run$(Suite.scala:1106)
	at org.scalatest.FunSuite.org$scalatest$FunSuiteLike$$super$run(FunSuite.scala:1560)
	at org.scalatest.FunSuiteLike.$anonfun$run$1(FunSuiteLike.scala:233)
	at org.scalatest.SuperEngine.runImpl(Engine.scala:518)
	at org.scalatest.FunSuiteLike.run(FunSuiteLike.scala:233)
	at org.scalatest.FunSuiteLike.run$(FunSuiteLike.scala:232)
	at org.apache.spark.SparkFunSuite.org$scalatest$BeforeAndAfterAll$$super$run(SparkFunSuite.scala:56)
	at org.scalatest.BeforeAndAfterAll.liftedTree1$1(BeforeAndAfterAll.scala:213)
	at org.scalatest.BeforeAndAfterAll.run(BeforeAndAfterAll.scala:210)
	at org.scalatest.BeforeAndAfterAll.run$(BeforeAndAfterAll.scala:208)
	at org.apache.spark.SparkFunSuite.run(SparkFunSuite.scala:56)
	at org.scalatest.tools.Framework.org$scalatest$tools$Framework$$runSuite(Framework.scala:317)
	at org.scalatest.tools.Framework$ScalaTestTask.execute(Framework.scala:510)
	at sbt.ForkMain$Run$2.call(ForkMain.java:296)
	at sbt.ForkMain$Run$2.call(ForkMain.java:286)
	at java.util.concurrent.FutureTask.run(FutureTask.java:266)
	at java.util.concurrent.ThreadPoolExecutor.runWorker(ThreadPoolExecutor.java:1149)
	at java.util.concurrent.ThreadPoolExecutor$Worker.run(ThreadPoolExecutor.java:624)
	at java.lang.Thread.run(Thread.java:748)
[info] - map (1 second, 229 milliseconds)
[info] - map entries with null keys !!! IGNORED !!!
07:48:38.380 WARN org.apache.spark.sql.execution.command.DropTableCommand: org.apache.spark.sql.AnalysisException: Path does not exist: file:/home/jenkins/workspace/NewSparkPullRequestBuilder/target/tmp/spark-a02a6fb2-558f-4773-bd37-c108129318d0;
org.apache.spark.sql.AnalysisException: Path does not exist: file:/home/jenkins/workspace/NewSparkPullRequestBuilder/target/tmp/spark-a02a6fb2-558f-4773-bd37-c108129318d0;
	at org.apache.spark.sql.execution.datasources.DataSource$.$anonfun$checkAndGlobPathIfNecessary$1(DataSource.scala:759)
	at scala.collection.TraversableLike.$anonfun$flatMap$1(TraversableLike.scala:245)
	at scala.collection.immutable.List.foreach(List.scala:392)
	at scala.collection.TraversableLike.flatMap(TraversableLike.scala:245)
	at scala.collection.TraversableLike.flatMap$(TraversableLike.scala:242)
	at scala.collection.immutable.List.flatMap(List.scala:355)
	at org.apache.spark.sql.execution.datasources.DataSource$.checkAndGlobPathIfNecessary(DataSource.scala:746)
	at org.apache.spark.sql.execution.datasources.DataSource.checkAndGlobPathIfNecessary(DataSource.scala:575)
	at org.apache.spark.sql.execution.datasources.DataSource.resolveRelation(DataSource.scala:398)
	at org.apache.spark.sql.hive.HiveMetastoreCatalog.$anonfun$convertToLogicalRelation$5(HiveMetastoreCatalog.scala:248)
	at scala.Option.getOrElse(Option.scala:189)
	at org.apache.spark.sql.hive.HiveMetastoreCatalog.$anonfun$convertToLogicalRelation$4(HiveMetastoreCatalog.scala:238)
	at org.apache.spark.sql.hive.HiveMetastoreCatalog.withTableCreationLock(HiveMetastoreCatalog.scala:58)
	at org.apache.spark.sql.hive.HiveMetastoreCatalog.convertToLogicalRelation(HiveMetastoreCatalog.scala:231)
	at org.apache.spark.sql.hive.HiveMetastoreCatalog.convert(HiveMetastoreCatalog.scala:137)
	at org.apache.spark.sql.hive.RelationConversions$$anonfun$apply$4.applyOrElse(HiveStrategies.scala:220)
	at org.apache.spark.sql.hive.RelationConversions$$anonfun$apply$4.applyOrElse(HiveStrategies.scala:207)
	at org.apache.spark.sql.catalyst.plans.logical.AnalysisHelper.$anonfun$resolveOperatorsDown$2(AnalysisHelper.scala:108)
	at org.apache.spark.sql.catalyst.trees.CurrentOrigin$.withOrigin(TreeNode.scala:72)
	at org.apache.spark.sql.catalyst.plans.logical.AnalysisHelper.$anonfun$resolveOperatorsDown$1(AnalysisHelper.scala:108)
	at org.apache.spark.sql.catalyst.plans.logical.AnalysisHelper$.allowInvokingTransformsInAnalyzer(AnalysisHelper.scala:194)
	at org.apache.spark.sql.catalyst.plans.logical.AnalysisHelper.resolveOperatorsDown(AnalysisHelper.scala:106)
	at org.apache.spark.sql.catalyst.plans.logical.AnalysisHelper.resolveOperatorsDown$(AnalysisHelper.scala:104)
	at org.apache.spark.sql.catalyst.plans.logical.LogicalPlan.resolveOperatorsDown(LogicalPlan.scala:29)
	at org.apache.spark.sql.catalyst.plans.logical.AnalysisHelper.$anonfun$resolveOperatorsDown$4(AnalysisHelper.scala:113)
	at org.apache.spark.sql.catalyst.trees.TreeNode.$anonfun$mapChildren$1(TreeNode.scala:376)
	at org.apache.spark.sql.catalyst.trees.TreeNode.mapProductIterator(TreeNode.scala:214)
	at org.apache.spark.sql.catalyst.trees.TreeNode.mapChildren(TreeNode.scala:374)
	at org.apache.spark.sql.catalyst.trees.TreeNode.mapChildren(TreeNode.scala:327)
	at org.apache.spark.sql.catalyst.plans.logical.AnalysisHelper.$anonfun$resolveOperatorsDown$1(AnalysisHelper.scala:113)
	at org.apache.spark.sql.catalyst.plans.logical.AnalysisHelper$.allowInvokingTransformsInAnalyzer(AnalysisHelper.scala:194)
	at org.apache.spark.sql.catalyst.plans.logical.AnalysisHelper.resolveOperatorsDown(AnalysisHelper.scala:106)
	at org.apache.spark.sql.catalyst.plans.logical.AnalysisHelper.resolveOperatorsDown$(AnalysisHelper.scala:104)
	at org.apache.spark.sql.catalyst.plans.logical.LogicalPlan.resolveOperatorsDown(LogicalPlan.scala:29)
	at org.apache.spark.sql.catalyst.plans.logical.AnalysisHelper.resolveOperators(AnalysisHelper.scala:73)
	at org.apache.spark.sql.catalyst.plans.logical.AnalysisHelper.resolveOperators$(AnalysisHelper.scala:72)
	at org.apache.spark.sql.catalyst.plans.logical.LogicalPlan.resolveOperators(LogicalPlan.scala:29)
	at org.apache.spark.sql.hive.RelationConversions.apply(HiveStrategies.scala:207)
	at org.apache.spark.sql.hive.RelationConversions.apply(HiveStrategies.scala:191)
	at org.apache.spark.sql.catalyst.rules.RuleExecutor.$anonfun$execute$2(RuleExecutor.scala:130)
	at scala.collection.IndexedSeqOptimized.foldLeft(IndexedSeqOptimized.scala:60)
	at scala.collection.IndexedSeqOptimized.foldLeft$(IndexedSeqOptimized.scala:68)
	at scala.collection.mutable.ArrayBuffer.foldLeft(ArrayBuffer.scala:49)
	at org.apache.spark.sql.catalyst.rules.RuleExecutor.$anonfun$execute$1(RuleExecutor.scala:127)
	at org.apache.spark.sql.catalyst.rules.RuleExecutor.$anonfun$execute$1$adapted(RuleExecutor.scala:119)
	at scala.collection.immutable.List.foreach(List.scala:392)
	at org.apache.spark.sql.catalyst.rules.RuleExecutor.execute(RuleExecutor.scala:119)
	at org.apache.spark.sql.catalyst.analysis.Analyzer.org$apache$spark$sql$catalyst$analysis$Analyzer$$executeSameContext(Analyzer.scala:168)
	at org.apache.spark.sql.catalyst.analysis.Analyzer.execute(Analyzer.scala:162)
	at org.apache.spark.sql.catalyst.analysis.Analyzer.execute(Analyzer.scala:122)
	at org.apache.spark.sql.catalyst.rules.RuleExecutor.$anonfun$executeAndTrack$1(RuleExecutor.scala:98)
	at org.apache.spark.sql.catalyst.QueryPlanningTracker$.withTracker(QueryPlanningTracker.scala:88)
	at org.apache.spark.sql.catalyst.rules.RuleExecutor.executeAndTrack(RuleExecutor.scala:98)
	at org.apache.spark.sql.catalyst.analysis.Analyzer.$anonfun$executeAndCheck$1(Analyzer.scala:146)
	at org.apache.spark.sql.catalyst.plans.logical.AnalysisHelper$.markInAnalyzer(AnalysisHelper.scala:201)
	at org.apache.spark.sql.catalyst.analysis.Analyzer.executeAndCheck(Analyzer.scala:145)
	at org.apache.spark.sql.hive.test.TestHiveQueryExecution.analyzed$lzycompute(TestHive.scala:606)
	at org.apache.spark.sql.hive.test.TestHiveQueryExecution.analyzed(TestHive.scala:589)
	at org.apache.spark.sql.execution.QueryExecution.assertAnalyzed(QueryExecution.scala:55)
	at org.apache.spark.sql.Dataset$.ofRows(Dataset.scala:87)
	at org.apache.spark.sql.SparkSession.table(SparkSession.scala:589)
	at org.apache.spark.sql.execution.command.DropTableCommand.run(ddl.scala:241)
	at org.apache.spark.sql.execution.command.ExecutedCommandExec.sideEffectResult$lzycompute(commands.scala:70)
	at org.apache.spark.sql.execution.command.ExecutedCommandExec.sideEffectResult(commands.scala:68)
	at org.apache.spark.sql.execution.command.ExecutedCommandExec.executeCollect(commands.scala:79)
	at org.apache.spark.sql.Dataset.$anonfun$logicalPlan$1(Dataset.scala:226)
	at org.apache.spark.sql.Dataset.$anonfun$withAction$1(Dataset.scala:3477)
	at org.apache.spark.sql.execution.SQLExecution$.$anonfun$withNewExecutionId$4(SQLExecution.scala:100)
	at org.apache.spark.sql.execution.SQLExecution$.withSQLConfPropagated(SQLExecution.scala:160)
	at org.apache.spark.sql.execution.SQLExecution$.withNewExecutionId(SQLExecution.scala:87)
	at org.apache.spark.sql.Dataset.withAction(Dataset.scala:3473)
	at org.apache.spark.sql.Dataset.<init>(Dataset.scala:226)
	at org.apache.spark.sql.Dataset$.ofRows(Dataset.scala:88)
	at org.apache.spark.sql.hive.test.TestHiveSparkSession.sql(TestHive.scala:238)
	at org.apache.spark.sql.test.SQLTestUtilsBase.$anonfun$withTable$2(SQLTestUtils.scala:291)
	at scala.collection.IndexedSeqOptimized.foreach(IndexedSeqOptimized.scala:36)
	at scala.collection.IndexedSeqOptimized.foreach$(IndexedSeqOptimized.scala:33)
	at scala.collection.mutable.WrappedArray.foreach(WrappedArray.scala:38)
	at org.apache.spark.sql.test.SQLTestUtilsBase.$anonfun$withTable$1(SQLTestUtils.scala:290)
	at org.apache.spark.util.Utils$.tryWithSafeFinally(Utils.scala:1386)
	at org.apache.spark.sql.test.SQLTestUtilsBase.withTable(SQLTestUtils.scala:290)
	at org.apache.spark.sql.test.SQLTestUtilsBase.withTable$(SQLTestUtils.scala:288)
	at org.apache.spark.sql.execution.datasources.parquet.ParquetCompatibilityTest.withTable(ParquetCompatibilityTest.scala:35)
	at org.apache.spark.sql.hive.ParquetHiveCompatibilitySuite.testParquetHiveCompatibility(ParquetHiveCompatibilitySuite.scala:47)
	at org.apache.spark.sql.hive.ParquetHiveCompatibilitySuite.$anonfun$new$6(ParquetHiveCompatibilitySuite.scala:136)
	at scala.runtime.java8.JFunction0$mcV$sp.apply(JFunction0$mcV$sp.java:23)
	at org.scalatest.OutcomeOf.outcomeOf(OutcomeOf.scala:85)
	at org.scalatest.OutcomeOf.outcomeOf$(OutcomeOf.scala:83)
	at org.scalatest.OutcomeOf$.outcomeOf(OutcomeOf.scala:104)
	at org.scalatest.Transformer.apply(Transformer.scala:22)
	at org.scalatest.Transformer.apply(Transformer.scala:20)
	at org.scalatest.FunSuiteLike$$anon$1.apply(FunSuiteLike.scala:186)
	at org.apache.spark.SparkFunSuite.withFixture(SparkFunSuite.scala:149)
	at org.scalatest.FunSuiteLike.invokeWithFixture$1(FunSuiteLike.scala:184)
	at org.scalatest.FunSuiteLike.$anonfun$runTest$1(FunSuiteLike.scala:196)
	at org.scalatest.SuperEngine.runTestImpl(Engine.scala:286)
	at org.scalatest.FunSuiteLike.runTest(FunSuiteLike.scala:196)
	at org.scalatest.FunSuiteLike.runTest$(FunSuiteLike.scala:178)
	at org.apache.spark.SparkFunSuite.org$scalatest$BeforeAndAfterEach$$super$runTest(SparkFunSuite.scala:56)
	at org.scalatest.BeforeAndAfterEach.runTest(BeforeAndAfterEach.scala:221)
	at org.scalatest.BeforeAndAfterEach.runTest$(BeforeAndAfterEach.scala:214)
	at org.apache.spark.SparkFunSuite.runTest(SparkFunSuite.scala:56)
	at org.scalatest.FunSuiteLike.$anonfun$runTests$1(FunSuiteLike.scala:229)
	at org.scalatest.SuperEngine.$anonfun$runTestsInBranch$1(Engine.scala:393)
	at scala.collection.immutable.List.foreach(List.scala:392)
	at org.scalatest.SuperEngine.traverseSubNodes$1(Engine.scala:381)
	at org.scalatest.SuperEngine.runTestsInBranch(Engine.scala:376)
	at org.scalatest.SuperEngine.runTestsImpl(Engine.scala:458)
	at org.scalatest.FunSuiteLike.runTests(FunSuiteLike.scala:229)
	at org.scalatest.FunSuiteLike.runTests$(FunSuiteLike.scala:228)
	at org.scalatest.FunSuite.runTests(FunSuite.scala:1560)
	at org.scalatest.Suite.run(Suite.scala:1124)
	at org.scalatest.Suite.run$(Suite.scala:1106)
	at org.scalatest.FunSuite.org$scalatest$FunSuiteLike$$super$run(FunSuite.scala:1560)
	at org.scalatest.FunSuiteLike.$anonfun$run$1(FunSuiteLike.scala:233)
	at org.scalatest.SuperEngine.runImpl(Engine.scala:518)
	at org.scalatest.FunSuiteLike.run(FunSuiteLike.scala:233)
	at org.scalatest.FunSuiteLike.run$(FunSuiteLike.scala:232)
	at org.apache.spark.SparkFunSuite.org$scalatest$BeforeAndAfterAll$$super$run(SparkFunSuite.scala:56)
	at org.scalatest.BeforeAndAfterAll.liftedTree1$1(BeforeAndAfterAll.scala:213)
	at org.scalatest.BeforeAndAfterAll.run(BeforeAndAfterAll.scala:210)
	at org.scalatest.BeforeAndAfterAll.run$(BeforeAndAfterAll.scala:208)
	at org.apache.spark.SparkFunSuite.run(SparkFunSuite.scala:56)
	at org.scalatest.tools.Framework.org$scalatest$tools$Framework$$runSuite(Framework.scala:317)
	at org.scalatest.tools.Framework$ScalaTestTask.execute(Framework.scala:510)
	at sbt.ForkMain$Run$2.call(ForkMain.java:296)
	at sbt.ForkMain$Run$2.call(ForkMain.java:286)
	at java.util.concurrent.FutureTask.run(FutureTask.java:266)
	at java.util.concurrent.ThreadPoolExecutor.runWorker(ThreadPoolExecutor.java:1149)
	at java.util.concurrent.ThreadPoolExecutor$Worker.run(ThreadPoolExecutor.java:624)
	at java.lang.Thread.run(Thread.java:748)
[info] - struct (1 second, 194 milliseconds)
07:48:39.685 WARN org.apache.spark.sql.execution.command.DropTableCommand: org.apache.spark.sql.AnalysisException: Path does not exist: file:/home/jenkins/workspace/NewSparkPullRequestBuilder/target/tmp/spark-8fcfdb81-d9a9-45bf-9263-b306f9e61613;
org.apache.spark.sql.AnalysisException: Path does not exist: file:/home/jenkins/workspace/NewSparkPullRequestBuilder/target/tmp/spark-8fcfdb81-d9a9-45bf-9263-b306f9e61613;
	at org.apache.spark.sql.execution.datasources.DataSource$.$anonfun$checkAndGlobPathIfNecessary$1(DataSource.scala:759)
	at scala.collection.TraversableLike.$anonfun$flatMap$1(TraversableLike.scala:245)
	at scala.collection.immutable.List.foreach(List.scala:392)
	at scala.collection.TraversableLike.flatMap(TraversableLike.scala:245)
	at scala.collection.TraversableLike.flatMap$(TraversableLike.scala:242)
	at scala.collection.immutable.List.flatMap(List.scala:355)
	at org.apache.spark.sql.execution.datasources.DataSource$.checkAndGlobPathIfNecessary(DataSource.scala:746)
	at org.apache.spark.sql.execution.datasources.DataSource.checkAndGlobPathIfNecessary(DataSource.scala:575)
	at org.apache.spark.sql.execution.datasources.DataSource.resolveRelation(DataSource.scala:398)
	at org.apache.spark.sql.hive.HiveMetastoreCatalog.$anonfun$convertToLogicalRelation$5(HiveMetastoreCatalog.scala:248)
	at scala.Option.getOrElse(Option.scala:189)
	at org.apache.spark.sql.hive.HiveMetastoreCatalog.$anonfun$convertToLogicalRelation$4(HiveMetastoreCatalog.scala:238)
	at org.apache.spark.sql.hive.HiveMetastoreCatalog.withTableCreationLock(HiveMetastoreCatalog.scala:58)
	at org.apache.spark.sql.hive.HiveMetastoreCatalog.convertToLogicalRelation(HiveMetastoreCatalog.scala:231)
	at org.apache.spark.sql.hive.HiveMetastoreCatalog.convert(HiveMetastoreCatalog.scala:137)
	at org.apache.spark.sql.hive.RelationConversions$$anonfun$apply$4.applyOrElse(HiveStrategies.scala:220)
	at org.apache.spark.sql.hive.RelationConversions$$anonfun$apply$4.applyOrElse(HiveStrategies.scala:207)
	at org.apache.spark.sql.catalyst.plans.logical.AnalysisHelper.$anonfun$resolveOperatorsDown$2(AnalysisHelper.scala:108)
	at org.apache.spark.sql.catalyst.trees.CurrentOrigin$.withOrigin(TreeNode.scala:72)
	at org.apache.spark.sql.catalyst.plans.logical.AnalysisHelper.$anonfun$resolveOperatorsDown$1(AnalysisHelper.scala:108)
	at org.apache.spark.sql.catalyst.plans.logical.AnalysisHelper$.allowInvokingTransformsInAnalyzer(AnalysisHelper.scala:194)
	at org.apache.spark.sql.catalyst.plans.logical.AnalysisHelper.resolveOperatorsDown(AnalysisHelper.scala:106)
	at org.apache.spark.sql.catalyst.plans.logical.AnalysisHelper.resolveOperatorsDown$(AnalysisHelper.scala:104)
	at org.apache.spark.sql.catalyst.plans.logical.LogicalPlan.resolveOperatorsDown(LogicalPlan.scala:29)
	at org.apache.spark.sql.catalyst.plans.logical.AnalysisHelper.$anonfun$resolveOperatorsDown$4(AnalysisHelper.scala:113)
	at org.apache.spark.sql.catalyst.trees.TreeNode.$anonfun$mapChildren$1(TreeNode.scala:376)
	at org.apache.spark.sql.catalyst.trees.TreeNode.mapProductIterator(TreeNode.scala:214)
	at org.apache.spark.sql.catalyst.trees.TreeNode.mapChildren(TreeNode.scala:374)
	at org.apache.spark.sql.catalyst.trees.TreeNode.mapChildren(TreeNode.scala:327)
	at org.apache.spark.sql.catalyst.plans.logical.AnalysisHelper.$anonfun$resolveOperatorsDown$1(AnalysisHelper.scala:113)
	at org.apache.spark.sql.catalyst.plans.logical.AnalysisHelper$.allowInvokingTransformsInAnalyzer(AnalysisHelper.scala:194)
	at org.apache.spark.sql.catalyst.plans.logical.AnalysisHelper.resolveOperatorsDown(AnalysisHelper.scala:106)
	at org.apache.spark.sql.catalyst.plans.logical.AnalysisHelper.resolveOperatorsDown$(AnalysisHelper.scala:104)
	at org.apache.spark.sql.catalyst.plans.logical.LogicalPlan.resolveOperatorsDown(LogicalPlan.scala:29)
	at org.apache.spark.sql.catalyst.plans.logical.AnalysisHelper.resolveOperators(AnalysisHelper.scala:73)
	at org.apache.spark.sql.catalyst.plans.logical.AnalysisHelper.resolveOperators$(AnalysisHelper.scala:72)
	at org.apache.spark.sql.catalyst.plans.logical.LogicalPlan.resolveOperators(LogicalPlan.scala:29)
	at org.apache.spark.sql.hive.RelationConversions.apply(HiveStrategies.scala:207)
	at org.apache.spark.sql.hive.RelationConversions.apply(HiveStrategies.scala:191)
	at org.apache.spark.sql.catalyst.rules.RuleExecutor.$anonfun$execute$2(RuleExecutor.scala:130)
	at scala.collection.IndexedSeqOptimized.foldLeft(IndexedSeqOptimized.scala:60)
	at scala.collection.IndexedSeqOptimized.foldLeft$(IndexedSeqOptimized.scala:68)
	at scala.collection.mutable.ArrayBuffer.foldLeft(ArrayBuffer.scala:49)
	at org.apache.spark.sql.catalyst.rules.RuleExecutor.$anonfun$execute$1(RuleExecutor.scala:127)
	at org.apache.spark.sql.catalyst.rules.RuleExecutor.$anonfun$execute$1$adapted(RuleExecutor.scala:119)
	at scala.collection.immutable.List.foreach(List.scala:392)
	at org.apache.spark.sql.catalyst.rules.RuleExecutor.execute(RuleExecutor.scala:119)
	at org.apache.spark.sql.catalyst.analysis.Analyzer.org$apache$spark$sql$catalyst$analysis$Analyzer$$executeSameContext(Analyzer.scala:168)
	at org.apache.spark.sql.catalyst.analysis.Analyzer.execute(Analyzer.scala:162)
	at org.apache.spark.sql.catalyst.analysis.Analyzer.execute(Analyzer.scala:122)
	at org.apache.spark.sql.catalyst.rules.RuleExecutor.$anonfun$executeAndTrack$1(RuleExecutor.scala:98)
	at org.apache.spark.sql.catalyst.QueryPlanningTracker$.withTracker(QueryPlanningTracker.scala:88)
	at org.apache.spark.sql.catalyst.rules.RuleExecutor.executeAndTrack(RuleExecutor.scala:98)
	at org.apache.spark.sql.catalyst.analysis.Analyzer.$anonfun$executeAndCheck$1(Analyzer.scala:146)
	at org.apache.spark.sql.catalyst.plans.logical.AnalysisHelper$.markInAnalyzer(AnalysisHelper.scala:201)
	at org.apache.spark.sql.catalyst.analysis.Analyzer.executeAndCheck(Analyzer.scala:145)
	at org.apache.spark.sql.hive.test.TestHiveQueryExecution.analyzed$lzycompute(TestHive.scala:606)
	at org.apache.spark.sql.hive.test.TestHiveQueryExecution.analyzed(TestHive.scala:589)
	at org.apache.spark.sql.execution.QueryExecution.assertAnalyzed(QueryExecution.scala:55)
	at org.apache.spark.sql.Dataset$.ofRows(Dataset.scala:87)
	at org.apache.spark.sql.SparkSession.table(SparkSession.scala:589)
	at org.apache.spark.sql.execution.command.DropTableCommand.run(ddl.scala:241)
	at org.apache.spark.sql.execution.command.ExecutedCommandExec.sideEffectResult$lzycompute(commands.scala:70)
	at org.apache.spark.sql.execution.command.ExecutedCommandExec.sideEffectResult(commands.scala:68)
	at org.apache.spark.sql.execution.command.ExecutedCommandExec.executeCollect(commands.scala:79)
	at org.apache.spark.sql.Dataset.$anonfun$logicalPlan$1(Dataset.scala:226)
	at org.apache.spark.sql.Dataset.$anonfun$withAction$1(Dataset.scala:3477)
	at org.apache.spark.sql.execution.SQLExecution$.$anonfun$withNewExecutionId$4(SQLExecution.scala:100)
	at org.apache.spark.sql.execution.SQLExecution$.withSQLConfPropagated(SQLExecution.scala:160)
	at org.apache.spark.sql.execution.SQLExecution$.withNewExecutionId(SQLExecution.scala:87)
	at org.apache.spark.sql.Dataset.withAction(Dataset.scala:3473)
	at org.apache.spark.sql.Dataset.<init>(Dataset.scala:226)
	at org.apache.spark.sql.Dataset$.ofRows(Dataset.scala:88)
	at org.apache.spark.sql.hive.test.TestHiveSparkSession.sql(TestHive.scala:238)
	at org.apache.spark.sql.test.SQLTestUtilsBase.$anonfun$withTable$2(SQLTestUtils.scala:291)
	at scala.collection.IndexedSeqOptimized.foreach(IndexedSeqOptimized.scala:36)
	at scala.collection.IndexedSeqOptimized.foreach$(IndexedSeqOptimized.scala:33)
	at scala.collection.mutable.WrappedArray.foreach(WrappedArray.scala:38)
	at org.apache.spark.sql.test.SQLTestUtilsBase.$anonfun$withTable$1(SQLTestUtils.scala:290)
	at org.apache.spark.util.Utils$.tryWithSafeFinally(Utils.scala:1386)
	at org.apache.spark.sql.test.SQLTestUtilsBase.withTable(SQLTestUtils.scala:290)
	at org.apache.spark.sql.test.SQLTestUtilsBase.withTable$(SQLTestUtils.scala:288)
	at org.apache.spark.sql.execution.datasources.parquet.ParquetCompatibilityTest.withTable(ParquetCompatibilityTest.scala:35)
	at org.apache.spark.sql.hive.ParquetHiveCompatibilitySuite.testParquetHiveCompatibility(ParquetHiveCompatibilitySuite.scala:47)
	at org.apache.spark.sql.hive.ParquetHiveCompatibilitySuite.$anonfun$new$7(ParquetHiveCompatibilitySuite.scala:142)
	at scala.runtime.java8.JFunction0$mcV$sp.apply(JFunction0$mcV$sp.java:23)
	at org.scalatest.OutcomeOf.outcomeOf(OutcomeOf.scala:85)
	at org.scalatest.OutcomeOf.outcomeOf$(OutcomeOf.scala:83)
	at org.scalatest.OutcomeOf$.outcomeOf(OutcomeOf.scala:104)
	at org.scalatest.Transformer.apply(Transformer.scala:22)
	at org.scalatest.Transformer.apply(Transformer.scala:20)
	at org.scalatest.FunSuiteLike$$anon$1.apply(FunSuiteLike.scala:186)
	at org.apache.spark.SparkFunSuite.withFixture(SparkFunSuite.scala:149)
	at org.scalatest.FunSuiteLike.invokeWithFixture$1(FunSuiteLike.scala:184)
	at org.scalatest.FunSuiteLike.$anonfun$runTest$1(FunSuiteLike.scala:196)
	at org.scalatest.SuperEngine.runTestImpl(Engine.scala:286)
	at org.scalatest.FunSuiteLike.runTest(FunSuiteLike.scala:196)
	at org.scalatest.FunSuiteLike.runTest$(FunSuiteLike.scala:178)
	at org.apache.spark.SparkFunSuite.org$scalatest$BeforeAndAfterEach$$super$runTest(SparkFunSuite.scala:56)
	at org.scalatest.BeforeAndAfterEach.runTest(BeforeAndAfterEach.scala:221)
	at org.scalatest.BeforeAndAfterEach.runTest$(BeforeAndAfterEach.scala:214)
	at org.apache.spark.SparkFunSuite.runTest(SparkFunSuite.scala:56)
	at org.scalatest.FunSuiteLike.$anonfun$runTests$1(FunSuiteLike.scala:229)
	at org.scalatest.SuperEngine.$anonfun$runTestsInBranch$1(Engine.scala:393)
	at scala.collection.immutable.List.foreach(List.scala:392)
	at org.scalatest.SuperEngine.traverseSubNodes$1(Engine.scala:381)
	at org.scalatest.SuperEngine.runTestsInBranch(Engine.scala:376)
	at org.scalatest.SuperEngine.runTestsImpl(Engine.scala:458)
	at org.scalatest.FunSuiteLike.runTests(FunSuiteLike.scala:229)
	at org.scalatest.FunSuiteLike.runTests$(FunSuiteLike.scala:228)
	at org.scalatest.FunSuite.runTests(FunSuite.scala:1560)
	at org.scalatest.Suite.run(Suite.scala:1124)
	at org.scalatest.Suite.run$(Suite.scala:1106)
	at org.scalatest.FunSuite.org$scalatest$FunSuiteLike$$super$run(FunSuite.scala:1560)
	at org.scalatest.FunSuiteLike.$anonfun$run$1(FunSuiteLike.scala:233)
	at org.scalatest.SuperEngine.runImpl(Engine.scala:518)
	at org.scalatest.FunSuiteLike.run(FunSuiteLike.scala:233)
	at org.scalatest.FunSuiteLike.run$(FunSuiteLike.scala:232)
	at org.apache.spark.SparkFunSuite.org$scalatest$BeforeAndAfterAll$$super$run(SparkFunSuite.scala:56)
	at org.scalatest.BeforeAndAfterAll.liftedTree1$1(BeforeAndAfterAll.scala:213)
	at org.scalatest.BeforeAndAfterAll.run(BeforeAndAfterAll.scala:210)
	at org.scalatest.BeforeAndAfterAll.run$(BeforeAndAfterAll.scala:208)
	at org.apache.spark.SparkFunSuite.run(SparkFunSuite.scala:56)
	at org.scalatest.tools.Framework.org$scalatest$tools$Framework$$runSuite(Framework.scala:317)
	at org.scalatest.tools.Framework$ScalaTestTask.execute(Framework.scala:510)
	at sbt.ForkMain$Run$2.call(ForkMain.java:296)
	at sbt.ForkMain$Run$2.call(ForkMain.java:286)
	at java.util.concurrent.FutureTask.run(FutureTask.java:266)
	at java.util.concurrent.ThreadPoolExecutor.runWorker(ThreadPoolExecutor.java:1149)
	at java.util.concurrent.ThreadPoolExecutor$Worker.run(ThreadPoolExecutor.java:624)
	at java.lang.Thread.run(Thread.java:748)
[info] - SPARK-16344: array of struct with a single field named 'array_element' (1 second, 298 milliseconds)
07:48:39.791 WARN org.apache.hadoop.hive.conf.HiveConf: HiveConf of name hive.internal.ss.authz.settings.applied.marker does not exist
07:48:39.791 WARN org.apache.hadoop.hive.conf.HiveConf: HiveConf of name hive.stats.jdbc.timeout does not exist
07:48:39.791 WARN org.apache.hadoop.hive.conf.HiveConf: HiveConf of name hive.stats.retries.wait does not exist
07:48:39.874 WARN org.apache.hadoop.hive.conf.HiveConf: HiveConf of name hive.internal.ss.authz.settings.applied.marker does not exist
07:48:39.874 WARN org.apache.hadoop.hive.conf.HiveConf: HiveConf of name hive.stats.jdbc.timeout does not exist
07:48:39.874 WARN org.apache.hadoop.hive.conf.HiveConf: HiveConf of name hive.stats.retries.wait does not exist
[info] Test run started
[info] Test org.apache.spark.sql.hive.JavaDataFrameSuite.testUDAF started
[info] Test org.apache.spark.sql.hive.JavaDataFrameSuite.saveTableAndQueryIt started
[info] Test run finished: 0 failed, 0 ignored, 2 total, 2.313s
[info] Test run started
[info] Test org.apache.spark.sql.hive.JavaMetastoreDataSourcesSuite.saveTableAndQueryIt started
07:48:42.676 WARN org.apache.spark.sql.hive.test.TestHiveExternalCatalog: Couldn't find corresponding Hive SerDe for data source provider org.apache.spark.sql.json. Persisting data source table `default`.`javasavedtable` into Hive metastore in Spark SQL specific format, which is NOT compatible with Hive.
[info] Test run finished: 0 failed, 0 ignored, 1 total, 0.61s
07:48:43.046 WARN io.netty.util.concurrent.SingleThreadEventExecutor: An event executor terminated with non-empty task queue (2)
[info] ScalaTest
[info] Run completed in 1 hour, 29 minutes, 18 seconds.
[info] Total number of tests run: 2593
[info] Suites: completed 125, aborted 0
[info] Tests: succeeded 2593, failed 0, canceled 0, ignored 594, pending 0
[info] All tests passed.
[info] Passed: Total 2596, Failed 0, Errors 0, Passed 2596, Ignored 594
[error] (hive-thriftserver/test:test) sbt.TestsFailedException: Tests unsuccessful
[error] Total time: 5405 s, completed Dec 12, 2019 7:49:16 AM
[error] running /home/jenkins/workspace/NewSparkPullRequestBuilder/build/sbt -Phadoop-2.7 -Phive-2.3 -Pkinesis-asl -Pspark-ganglia-lgpl -Phive-thriftserver -Pkubernetes -Phadoop-cloud -Pmesos -Phive -Pyarn -Dtest.exclude.tags=org.apache.spark.tags.ExtendedHiveTest,org.apache.spark.tags.ExtendedYarnTest test ; received return code 1
Attempting to post to Github...
 > Post successful.
Build step 'Execute shell' marked build as failure
Archiving artifacts
Recording test results
Finished: FAILURE