FailedConsole Output

Skipping 20,313 KB.. Full Log
in the corrupted file: file:/home/jenkins/workspace/NewSparkPullRequestBuilder/target/tmp/spark-14ebcd4f-7bc1-436c-b07d-38f73202bea0/second/part-00000-3f88621e-5202-4ccb-b356-9b668c32c38f-c000.json
org.apache.orc.FileFormatException: Malformed ORC file file:/home/jenkins/workspace/NewSparkPullRequestBuilder/target/tmp/spark-14ebcd4f-7bc1-436c-b07d-38f73202bea0/second/part-00000-3f88621e-5202-4ccb-b356-9b668c32c38f-c000.json. Invalid postscript.
	at org.apache.orc.impl.ReaderImpl.ensureOrcFooter(ReaderImpl.java:274)
	at org.apache.orc.impl.ReaderImpl.extractFileTail(ReaderImpl.java:581)
	at org.apache.orc.impl.ReaderImpl.<init>(ReaderImpl.java:369)
	at org.apache.hadoop.hive.ql.io.orc.ReaderImpl.<init>(ReaderImpl.java:63)
	at org.apache.hadoop.hive.ql.io.orc.OrcFile.createReader(OrcFile.java:55)
	at org.apache.spark.sql.hive.orc.OrcFileOperator$.$anonfun$getFileReader$3(OrcFileOperator.scala:76)
	at scala.collection.Iterator$$anon$10.next(Iterator.scala:459)
	at scala.collection.TraversableOnce.collectFirst(TraversableOnce.scala:148)
	at scala.collection.TraversableOnce.collectFirst$(TraversableOnce.scala:135)
	at scala.collection.AbstractIterator.collectFirst(Iterator.scala:1429)
	at org.apache.spark.sql.hive.orc.OrcFileOperator$.getFileReader(OrcFileOperator.scala:87)
	at org.apache.spark.sql.hive.orc.OrcFileOperator$.$anonfun$readSchema$1(OrcFileOperator.scala:96)
	at scala.collection.Iterator$$anon$10.next(Iterator.scala:459)
	at scala.collection.TraversableOnce.collectFirst(TraversableOnce.scala:148)
	at scala.collection.TraversableOnce.collectFirst$(TraversableOnce.scala:135)
	at scala.collection.AbstractIterator.collectFirst(Iterator.scala:1429)
	at org.apache.spark.sql.hive.orc.OrcFileOperator$.readSchema(OrcFileOperator.scala:96)
	at org.apache.spark.sql.hive.orc.OrcFileFormat.$anonfun$buildReader$2(OrcFileFormat.scala:163)
	at org.apache.spark.sql.execution.datasources.FileFormat$$anon$1.apply(FileFormat.scala:147)
	at org.apache.spark.sql.execution.datasources.FileFormat$$anon$1.apply(FileFormat.scala:132)
	at org.apache.spark.sql.execution.datasources.FileScanRDD$$anon$1.org$apache$spark$sql$execution$datasources$FileScanRDD$$anon$$readCurrentFile(FileScanRDD.scala:116)
	at org.apache.spark.sql.execution.datasources.FileScanRDD$$anon$1$$anon$2.internalIter$lzycompute(FileScanRDD.scala:141)
	at org.apache.spark.sql.execution.datasources.FileScanRDD$$anon$1$$anon$2.internalIter(FileScanRDD.scala:141)
	at org.apache.spark.sql.execution.datasources.FileScanRDD$$anon$1$$anon$2.getNext(FileScanRDD.scala:145)
	at org.apache.spark.util.NextIterator.hasNext(NextIterator.scala:73)
	at org.apache.spark.sql.execution.datasources.FileScanRDD$$anon$1.hasNext(FileScanRDD.scala:93)
	at org.apache.spark.sql.execution.datasources.FileScanRDD$$anon$1.nextIterator(FileScanRDD.scala:173)
	at org.apache.spark.sql.execution.datasources.FileScanRDD$$anon$1.hasNext(FileScanRDD.scala:93)
	at org.apache.spark.sql.execution.datasources.FileScanRDD$$anon$1.nextIterator(FileScanRDD.scala:173)
	at org.apache.spark.sql.execution.datasources.FileScanRDD$$anon$1.hasNext(FileScanRDD.scala:93)
	at scala.collection.Iterator$$anon$10.hasNext(Iterator.scala:458)
	at org.apache.spark.sql.catalyst.expressions.GeneratedClass$GeneratedIteratorForCodegenStage1.agg_doAggregateWithoutKey_0$(generated.java:33)
	at org.apache.spark.sql.catalyst.expressions.GeneratedClass$GeneratedIteratorForCodegenStage1.processNext(generated.java:63)
	at org.apache.spark.sql.execution.BufferedRowIterator.hasNext(BufferedRowIterator.java:43)
	at org.apache.spark.sql.execution.WholeStageCodegenExec$$anon$1.hasNext(WholeStageCodegenExec.scala:726)
	at scala.collection.Iterator$$anon$10.hasNext(Iterator.scala:458)
	at org.apache.spark.shuffle.sort.BypassMergeSortShuffleWriter.write(BypassMergeSortShuffleWriter.java:132)
	at org.apache.spark.shuffle.ShuffleWriteProcessor.write(ShuffleWriteProcessor.scala:59)
	at org.apache.spark.scheduler.ShuffleMapTask.runTask(ShuffleMapTask.scala:99)
	at org.apache.spark.scheduler.ShuffleMapTask.runTask(ShuffleMapTask.scala:52)
	at org.apache.spark.scheduler.Task.run(Task.scala:127)
	at org.apache.spark.executor.Executor$TaskRunner.$anonfun$run$3(Executor.scala:441)
	at org.apache.spark.util.Utils$.tryWithSafeFinally(Utils.scala:1377)
	at org.apache.spark.executor.Executor$TaskRunner.run(Executor.scala:444)
	at java.util.concurrent.ThreadPoolExecutor.runWorker(ThreadPoolExecutor.java:1149)
	at java.util.concurrent.ThreadPoolExecutor$Worker.run(ThreadPoolExecutor.java:624)
	at java.lang.Thread.run(Thread.java:748)
07:56:21.838 ERROR org.apache.spark.executor.Executor: Exception in task 0.0 in stage 11862.0 (TID 21674)
org.apache.spark.SparkException: Could not read footer for file: file:/home/jenkins/workspace/NewSparkPullRequestBuilder/target/tmp/spark-0cf5e6a8-a627-4c94-9bec-16f02b372efe/third/part-00000-f1bb5beb-f7b1-46fd-9c16-2c522619f4e6-c000.json
	at org.apache.spark.sql.hive.orc.OrcFileOperator$.$anonfun$getFileReader$3(OrcFileOperator.scala:83)
	at scala.collection.Iterator$$anon$10.next(Iterator.scala:459)
	at scala.collection.TraversableOnce.collectFirst(TraversableOnce.scala:148)
	at scala.collection.TraversableOnce.collectFirst$(TraversableOnce.scala:135)
	at scala.collection.AbstractIterator.collectFirst(Iterator.scala:1429)
	at org.apache.spark.sql.hive.orc.OrcFileOperator$.getFileReader(OrcFileOperator.scala:87)
	at org.apache.spark.sql.hive.orc.OrcFileOperator$.$anonfun$readSchema$1(OrcFileOperator.scala:96)
	at scala.collection.Iterator$$anon$10.next(Iterator.scala:459)
	at scala.collection.TraversableOnce.collectFirst(TraversableOnce.scala:148)
	at scala.collection.TraversableOnce.collectFirst$(TraversableOnce.scala:135)
	at scala.collection.AbstractIterator.collectFirst(Iterator.scala:1429)
	at org.apache.spark.sql.hive.orc.OrcFileOperator$.readSchema(OrcFileOperator.scala:96)
	at org.apache.spark.sql.hive.orc.OrcFileFormat.$anonfun$buildReader$2(OrcFileFormat.scala:163)
	at org.apache.spark.sql.execution.datasources.FileFormat$$anon$1.apply(FileFormat.scala:147)
	at org.apache.spark.sql.execution.datasources.FileFormat$$anon$1.apply(FileFormat.scala:132)
	at org.apache.spark.sql.execution.datasources.FileScanRDD$$anon$1.org$apache$spark$sql$execution$datasources$FileScanRDD$$anon$$readCurrentFile(FileScanRDD.scala:116)
	at org.apache.spark.sql.execution.datasources.FileScanRDD$$anon$1.nextIterator(FileScanRDD.scala:169)
	at org.apache.spark.sql.execution.datasources.FileScanRDD$$anon$1.hasNext(FileScanRDD.scala:93)
	at scala.collection.Iterator$$anon$10.hasNext(Iterator.scala:458)
	at scala.collection.Iterator$$anon$10.hasNext(Iterator.scala:458)
	at scala.collection.Iterator$$anon$10.hasNext(Iterator.scala:458)
	at org.apache.spark.util.Utils$.getIteratorSize(Utils.scala:1804)
	at org.apache.spark.rdd.RDD.$anonfun$count$1(RDD.scala:1227)
	at org.apache.spark.rdd.RDD.$anonfun$count$1$adapted(RDD.scala:1227)
	at org.apache.spark.SparkContext.$anonfun$runJob$5(SparkContext.scala:2156)
	at org.apache.spark.scheduler.ResultTask.runTask(ResultTask.scala:90)
	at org.apache.spark.scheduler.Task.run(Task.scala:127)
	at org.apache.spark.executor.Executor$TaskRunner.$anonfun$run$3(Executor.scala:441)
	at org.apache.spark.util.Utils$.tryWithSafeFinally(Utils.scala:1377)
	at org.apache.spark.executor.Executor$TaskRunner.run(Executor.scala:444)
	at java.util.concurrent.ThreadPoolExecutor.runWorker(ThreadPoolExecutor.java:1149)
	at java.util.concurrent.ThreadPoolExecutor$Worker.run(ThreadPoolExecutor.java:624)
	at java.lang.Thread.run(Thread.java:748)
Caused by: org.apache.orc.FileFormatException: Malformed ORC file file:/home/jenkins/workspace/NewSparkPullRequestBuilder/target/tmp/spark-0cf5e6a8-a627-4c94-9bec-16f02b372efe/third/part-00000-f1bb5beb-f7b1-46fd-9c16-2c522619f4e6-c000.json. Invalid postscript.
	at org.apache.orc.impl.ReaderImpl.ensureOrcFooter(ReaderImpl.java:274)
	at org.apache.orc.impl.ReaderImpl.extractFileTail(ReaderImpl.java:581)
	at org.apache.orc.impl.ReaderImpl.<init>(ReaderImpl.java:369)
	at org.apache.hadoop.hive.ql.io.orc.ReaderImpl.<init>(ReaderImpl.java:63)
	at org.apache.hadoop.hive.ql.io.orc.OrcFile.createReader(OrcFile.java:55)
	at org.apache.spark.sql.hive.orc.OrcFileOperator$.$anonfun$getFileReader$3(OrcFileOperator.scala:76)
	... 32 more
07:56:21.842 WARN org.apache.spark.scheduler.TaskSetManager: Lost task 0.0 in stage 11862.0 (TID 21674, amp-jenkins-worker-02.amp, executor driver): org.apache.spark.SparkException: Could not read footer for file: file:/home/jenkins/workspace/NewSparkPullRequestBuilder/target/tmp/spark-0cf5e6a8-a627-4c94-9bec-16f02b372efe/third/part-00000-f1bb5beb-f7b1-46fd-9c16-2c522619f4e6-c000.json
	at org.apache.spark.sql.hive.orc.OrcFileOperator$.$anonfun$getFileReader$3(OrcFileOperator.scala:83)
	at scala.collection.Iterator$$anon$10.next(Iterator.scala:459)
	at scala.collection.TraversableOnce.collectFirst(TraversableOnce.scala:148)
	at scala.collection.TraversableOnce.collectFirst$(TraversableOnce.scala:135)
	at scala.collection.AbstractIterator.collectFirst(Iterator.scala:1429)
	at org.apache.spark.sql.hive.orc.OrcFileOperator$.getFileReader(OrcFileOperator.scala:87)
	at org.apache.spark.sql.hive.orc.OrcFileOperator$.$anonfun$readSchema$1(OrcFileOperator.scala:96)
	at scala.collection.Iterator$$anon$10.next(Iterator.scala:459)
	at scala.collection.TraversableOnce.collectFirst(TraversableOnce.scala:148)
	at scala.collection.TraversableOnce.collectFirst$(TraversableOnce.scala:135)
	at scala.collection.AbstractIterator.collectFirst(Iterator.scala:1429)
	at org.apache.spark.sql.hive.orc.OrcFileOperator$.readSchema(OrcFileOperator.scala:96)
	at org.apache.spark.sql.hive.orc.OrcFileFormat.$anonfun$buildReader$2(OrcFileFormat.scala:163)
	at org.apache.spark.sql.execution.datasources.FileFormat$$anon$1.apply(FileFormat.scala:147)
	at org.apache.spark.sql.execution.datasources.FileFormat$$anon$1.apply(FileFormat.scala:132)
	at org.apache.spark.sql.execution.datasources.FileScanRDD$$anon$1.org$apache$spark$sql$execution$datasources$FileScanRDD$$anon$$readCurrentFile(FileScanRDD.scala:116)
	at org.apache.spark.sql.execution.datasources.FileScanRDD$$anon$1.nextIterator(FileScanRDD.scala:169)
	at org.apache.spark.sql.execution.datasources.FileScanRDD$$anon$1.hasNext(FileScanRDD.scala:93)
	at scala.collection.Iterator$$anon$10.hasNext(Iterator.scala:458)
	at scala.collection.Iterator$$anon$10.hasNext(Iterator.scala:458)
	at scala.collection.Iterator$$anon$10.hasNext(Iterator.scala:458)
	at org.apache.spark.util.Utils$.getIteratorSize(Utils.scala:1804)
	at org.apache.spark.rdd.RDD.$anonfun$count$1(RDD.scala:1227)
	at org.apache.spark.rdd.RDD.$anonfun$count$1$adapted(RDD.scala:1227)
	at org.apache.spark.SparkContext.$anonfun$runJob$5(SparkContext.scala:2156)
	at org.apache.spark.scheduler.ResultTask.runTask(ResultTask.scala:90)
	at org.apache.spark.scheduler.Task.run(Task.scala:127)
	at org.apache.spark.executor.Executor$TaskRunner.$anonfun$run$3(Executor.scala:441)
	at org.apache.spark.util.Utils$.tryWithSafeFinally(Utils.scala:1377)
	at org.apache.spark.executor.Executor$TaskRunner.run(Executor.scala:444)
	at java.util.concurrent.ThreadPoolExecutor.runWorker(ThreadPoolExecutor.java:1149)
	at java.util.concurrent.ThreadPoolExecutor$Worker.run(ThreadPoolExecutor.java:624)
	at java.lang.Thread.run(Thread.java:748)
Caused by: org.apache.orc.FileFormatException: Malformed ORC file file:/home/jenkins/workspace/NewSparkPullRequestBuilder/target/tmp/spark-0cf5e6a8-a627-4c94-9bec-16f02b372efe/third/part-00000-f1bb5beb-f7b1-46fd-9c16-2c522619f4e6-c000.json. Invalid postscript.
	at org.apache.orc.impl.ReaderImpl.ensureOrcFooter(ReaderImpl.java:274)
	at org.apache.orc.impl.ReaderImpl.extractFileTail(ReaderImpl.java:581)
	at org.apache.orc.impl.ReaderImpl.<init>(ReaderImpl.java:369)
	at org.apache.hadoop.hive.ql.io.orc.ReaderImpl.<init>(ReaderImpl.java:63)
	at org.apache.hadoop.hive.ql.io.orc.OrcFile.createReader(OrcFile.java:55)
	at org.apache.spark.sql.hive.orc.OrcFileOperator$.$anonfun$getFileReader$3(OrcFileOperator.scala:76)
	... 32 more

07:56:21.843 ERROR org.apache.spark.scheduler.TaskSetManager: Task 0 in stage 11862.0 failed 1 times; aborting job
07:56:22.725 ERROR org.apache.spark.executor.Executor: Exception in task 0.0 in stage 11866.0 (TID 21678)
org.apache.spark.SparkException: Could not read footer for file: file:/home/jenkins/workspace/NewSparkPullRequestBuilder/target/tmp/spark-94ea4ff4-e04d-4b2e-a91b-cf9e6c12adc3/third/part-00000-23abbff5-310b-42e6-a0c5-f78886c1e270-c000.json
	at org.apache.spark.sql.hive.orc.OrcFileOperator$.$anonfun$getFileReader$3(OrcFileOperator.scala:83)
	at scala.collection.Iterator$$anon$10.next(Iterator.scala:459)
	at scala.collection.TraversableOnce.collectFirst(TraversableOnce.scala:148)
	at scala.collection.TraversableOnce.collectFirst$(TraversableOnce.scala:135)
	at scala.collection.AbstractIterator.collectFirst(Iterator.scala:1429)
	at org.apache.spark.sql.hive.orc.OrcFileOperator$.getFileReader(OrcFileOperator.scala:87)
	at org.apache.spark.sql.hive.orc.OrcFileOperator$.$anonfun$readSchema$1(OrcFileOperator.scala:96)
	at scala.collection.Iterator$$anon$10.next(Iterator.scala:459)
	at scala.collection.TraversableOnce.collectFirst(TraversableOnce.scala:148)
	at scala.collection.TraversableOnce.collectFirst$(TraversableOnce.scala:135)
	at scala.collection.AbstractIterator.collectFirst(Iterator.scala:1429)
	at org.apache.spark.sql.hive.orc.OrcFileOperator$.readSchema(OrcFileOperator.scala:96)
	at org.apache.spark.sql.hive.orc.OrcFileFormat.$anonfun$buildReader$2(OrcFileFormat.scala:163)
	at org.apache.spark.sql.execution.datasources.FileFormat$$anon$1.apply(FileFormat.scala:147)
	at org.apache.spark.sql.execution.datasources.FileFormat$$anon$1.apply(FileFormat.scala:132)
	at org.apache.spark.sql.execution.datasources.FileScanRDD$$anon$1.org$apache$spark$sql$execution$datasources$FileScanRDD$$anon$$readCurrentFile(FileScanRDD.scala:116)
	at org.apache.spark.sql.execution.datasources.FileScanRDD$$anon$1.nextIterator(FileScanRDD.scala:169)
	at org.apache.spark.sql.execution.datasources.FileScanRDD$$anon$1.hasNext(FileScanRDD.scala:93)
	at scala.collection.Iterator$$anon$10.hasNext(Iterator.scala:458)
	at scala.collection.Iterator$$anon$10.hasNext(Iterator.scala:458)
	at scala.collection.Iterator$$anon$10.hasNext(Iterator.scala:458)
	at org.apache.spark.util.Utils$.getIteratorSize(Utils.scala:1804)
	at org.apache.spark.rdd.RDD.$anonfun$count$1(RDD.scala:1227)
	at org.apache.spark.rdd.RDD.$anonfun$count$1$adapted(RDD.scala:1227)
	at org.apache.spark.SparkContext.$anonfun$runJob$5(SparkContext.scala:2156)
	at org.apache.spark.scheduler.ResultTask.runTask(ResultTask.scala:90)
	at org.apache.spark.scheduler.Task.run(Task.scala:127)
	at org.apache.spark.executor.Executor$TaskRunner.$anonfun$run$3(Executor.scala:441)
	at org.apache.spark.util.Utils$.tryWithSafeFinally(Utils.scala:1377)
	at org.apache.spark.executor.Executor$TaskRunner.run(Executor.scala:444)
	at java.util.concurrent.ThreadPoolExecutor.runWorker(ThreadPoolExecutor.java:1149)
	at java.util.concurrent.ThreadPoolExecutor$Worker.run(ThreadPoolExecutor.java:624)
	at java.lang.Thread.run(Thread.java:748)
Caused by: org.apache.orc.FileFormatException: Malformed ORC file file:/home/jenkins/workspace/NewSparkPullRequestBuilder/target/tmp/spark-94ea4ff4-e04d-4b2e-a91b-cf9e6c12adc3/third/part-00000-23abbff5-310b-42e6-a0c5-f78886c1e270-c000.json. Invalid postscript.
	at org.apache.orc.impl.ReaderImpl.ensureOrcFooter(ReaderImpl.java:274)
	at org.apache.orc.impl.ReaderImpl.extractFileTail(ReaderImpl.java:581)
	at org.apache.orc.impl.ReaderImpl.<init>(ReaderImpl.java:369)
	at org.apache.hadoop.hive.ql.io.orc.ReaderImpl.<init>(ReaderImpl.java:63)
	at org.apache.hadoop.hive.ql.io.orc.OrcFile.createReader(OrcFile.java:55)
	at org.apache.spark.sql.hive.orc.OrcFileOperator$.$anonfun$getFileReader$3(OrcFileOperator.scala:76)
	... 32 more
07:56:22.727 WARN org.apache.spark.scheduler.TaskSetManager: Lost task 0.0 in stage 11866.0 (TID 21678, amp-jenkins-worker-02.amp, executor driver): org.apache.spark.SparkException: Could not read footer for file: file:/home/jenkins/workspace/NewSparkPullRequestBuilder/target/tmp/spark-94ea4ff4-e04d-4b2e-a91b-cf9e6c12adc3/third/part-00000-23abbff5-310b-42e6-a0c5-f78886c1e270-c000.json
	at org.apache.spark.sql.hive.orc.OrcFileOperator$.$anonfun$getFileReader$3(OrcFileOperator.scala:83)
	at scala.collection.Iterator$$anon$10.next(Iterator.scala:459)
	at scala.collection.TraversableOnce.collectFirst(TraversableOnce.scala:148)
	at scala.collection.TraversableOnce.collectFirst$(TraversableOnce.scala:135)
	at scala.collection.AbstractIterator.collectFirst(Iterator.scala:1429)
	at org.apache.spark.sql.hive.orc.OrcFileOperator$.getFileReader(OrcFileOperator.scala:87)
	at org.apache.spark.sql.hive.orc.OrcFileOperator$.$anonfun$readSchema$1(OrcFileOperator.scala:96)
	at scala.collection.Iterator$$anon$10.next(Iterator.scala:459)
	at scala.collection.TraversableOnce.collectFirst(TraversableOnce.scala:148)
	at scala.collection.TraversableOnce.collectFirst$(TraversableOnce.scala:135)
	at scala.collection.AbstractIterator.collectFirst(Iterator.scala:1429)
	at org.apache.spark.sql.hive.orc.OrcFileOperator$.readSchema(OrcFileOperator.scala:96)
	at org.apache.spark.sql.hive.orc.OrcFileFormat.$anonfun$buildReader$2(OrcFileFormat.scala:163)
	at org.apache.spark.sql.execution.datasources.FileFormat$$anon$1.apply(FileFormat.scala:147)
	at org.apache.spark.sql.execution.datasources.FileFormat$$anon$1.apply(FileFormat.scala:132)
	at org.apache.spark.sql.execution.datasources.FileScanRDD$$anon$1.org$apache$spark$sql$execution$datasources$FileScanRDD$$anon$$readCurrentFile(FileScanRDD.scala:116)
	at org.apache.spark.sql.execution.datasources.FileScanRDD$$anon$1.nextIterator(FileScanRDD.scala:169)
	at org.apache.spark.sql.execution.datasources.FileScanRDD$$anon$1.hasNext(FileScanRDD.scala:93)
	at scala.collection.Iterator$$anon$10.hasNext(Iterator.scala:458)
	at scala.collection.Iterator$$anon$10.hasNext(Iterator.scala:458)
	at scala.collection.Iterator$$anon$10.hasNext(Iterator.scala:458)
	at org.apache.spark.util.Utils$.getIteratorSize(Utils.scala:1804)
	at org.apache.spark.rdd.RDD.$anonfun$count$1(RDD.scala:1227)
	at org.apache.spark.rdd.RDD.$anonfun$count$1$adapted(RDD.scala:1227)
	at org.apache.spark.SparkContext.$anonfun$runJob$5(SparkContext.scala:2156)
	at org.apache.spark.scheduler.ResultTask.runTask(ResultTask.scala:90)
	at org.apache.spark.scheduler.Task.run(Task.scala:127)
	at org.apache.spark.executor.Executor$TaskRunner.$anonfun$run$3(Executor.scala:441)
	at org.apache.spark.util.Utils$.tryWithSafeFinally(Utils.scala:1377)
	at org.apache.spark.executor.Executor$TaskRunner.run(Executor.scala:444)
	at java.util.concurrent.ThreadPoolExecutor.runWorker(ThreadPoolExecutor.java:1149)
	at java.util.concurrent.ThreadPoolExecutor$Worker.run(ThreadPoolExecutor.java:624)
	at java.lang.Thread.run(Thread.java:748)
Caused by: org.apache.orc.FileFormatException: Malformed ORC file file:/home/jenkins/workspace/NewSparkPullRequestBuilder/target/tmp/spark-94ea4ff4-e04d-4b2e-a91b-cf9e6c12adc3/third/part-00000-23abbff5-310b-42e6-a0c5-f78886c1e270-c000.json. Invalid postscript.
	at org.apache.orc.impl.ReaderImpl.ensureOrcFooter(ReaderImpl.java:274)
	at org.apache.orc.impl.ReaderImpl.extractFileTail(ReaderImpl.java:581)
	at org.apache.orc.impl.ReaderImpl.<init>(ReaderImpl.java:369)
	at org.apache.hadoop.hive.ql.io.orc.ReaderImpl.<init>(ReaderImpl.java:63)
	at org.apache.hadoop.hive.ql.io.orc.OrcFile.createReader(OrcFile.java:55)
	at org.apache.spark.sql.hive.orc.OrcFileOperator$.$anonfun$getFileReader$3(OrcFileOperator.scala:76)
	... 32 more

07:56:22.727 ERROR org.apache.spark.scheduler.TaskSetManager: Task 0 in stage 11866.0 failed 1 times; aborting job
07:56:23.965 ERROR org.apache.spark.executor.Executor: Exception in task 0.0 in stage 11871.0 (TID 21683)
org.apache.spark.SparkException: Could not read footer for file: file:/home/jenkins/workspace/NewSparkPullRequestBuilder/target/tmp/spark-2dc462fd-1478-44ae-a36b-22fca03ff786/first/part-00000-d64f4930-87ac-443a-b0ed-1f07320e2740-c000.json
	at org.apache.spark.sql.hive.orc.OrcFileOperator$.$anonfun$getFileReader$3(OrcFileOperator.scala:83)
	at scala.collection.Iterator$$anon$10.next(Iterator.scala:459)
	at scala.collection.TraversableOnce.collectFirst(TraversableOnce.scala:148)
	at scala.collection.TraversableOnce.collectFirst$(TraversableOnce.scala:135)
	at scala.collection.AbstractIterator.collectFirst(Iterator.scala:1429)
	at org.apache.spark.sql.hive.orc.OrcFileOperator$.getFileReader(OrcFileOperator.scala:87)
	at org.apache.spark.sql.hive.orc.OrcFileOperator$.$anonfun$readSchema$1(OrcFileOperator.scala:96)
	at scala.collection.Iterator$$anon$10.next(Iterator.scala:459)
	at scala.collection.TraversableOnce.collectFirst(TraversableOnce.scala:148)
	at scala.collection.TraversableOnce.collectFirst$(TraversableOnce.scala:135)
	at scala.collection.AbstractIterator.collectFirst(Iterator.scala:1429)
	at org.apache.spark.sql.hive.orc.OrcFileOperator$.readSchema(OrcFileOperator.scala:96)
	at org.apache.spark.sql.hive.orc.OrcFileFormat.$anonfun$buildReader$2(OrcFileFormat.scala:163)
	at org.apache.spark.sql.execution.datasources.FileFormat$$anon$1.apply(FileFormat.scala:147)
	at org.apache.spark.sql.execution.datasources.FileFormat$$anon$1.apply(FileFormat.scala:132)
	at org.apache.spark.sql.execution.datasources.FileScanRDD$$anon$1.org$apache$spark$sql$execution$datasources$FileScanRDD$$anon$$readCurrentFile(FileScanRDD.scala:116)
	at org.apache.spark.sql.execution.datasources.FileScanRDD$$anon$1.nextIterator(FileScanRDD.scala:169)
	at org.apache.spark.sql.execution.datasources.FileScanRDD$$anon$1.hasNext(FileScanRDD.scala:93)
	at scala.collection.Iterator$$anon$10.hasNext(Iterator.scala:458)
	at org.apache.spark.sql.catalyst.expressions.GeneratedClass$GeneratedIteratorForCodegenStage1.agg_doAggregateWithoutKey_0$(generated.java:33)
	at org.apache.spark.sql.catalyst.expressions.GeneratedClass$GeneratedIteratorForCodegenStage1.processNext(generated.java:63)
	at org.apache.spark.sql.execution.BufferedRowIterator.hasNext(BufferedRowIterator.java:43)
	at org.apache.spark.sql.execution.WholeStageCodegenExec$$anon$1.hasNext(WholeStageCodegenExec.scala:726)
	at scala.collection.Iterator$$anon$10.hasNext(Iterator.scala:458)
	at org.apache.spark.shuffle.sort.BypassMergeSortShuffleWriter.write(BypassMergeSortShuffleWriter.java:132)
	at org.apache.spark.shuffle.ShuffleWriteProcessor.write(ShuffleWriteProcessor.scala:59)
	at org.apache.spark.scheduler.ShuffleMapTask.runTask(ShuffleMapTask.scala:99)
	at org.apache.spark.scheduler.ShuffleMapTask.runTask(ShuffleMapTask.scala:52)
	at org.apache.spark.scheduler.Task.run(Task.scala:127)
	at org.apache.spark.executor.Executor$TaskRunner.$anonfun$run$3(Executor.scala:441)
	at org.apache.spark.util.Utils$.tryWithSafeFinally(Utils.scala:1377)
	at org.apache.spark.executor.Executor$TaskRunner.run(Executor.scala:444)
	at java.util.concurrent.ThreadPoolExecutor.runWorker(ThreadPoolExecutor.java:1149)
	at java.util.concurrent.ThreadPoolExecutor$Worker.run(ThreadPoolExecutor.java:624)
	at java.lang.Thread.run(Thread.java:748)
Caused by: org.apache.orc.FileFormatException: Malformed ORC file file:/home/jenkins/workspace/NewSparkPullRequestBuilder/target/tmp/spark-2dc462fd-1478-44ae-a36b-22fca03ff786/first/part-00000-d64f4930-87ac-443a-b0ed-1f07320e2740-c000.json. Invalid postscript.
	at org.apache.orc.impl.ReaderImpl.ensureOrcFooter(ReaderImpl.java:274)
	at org.apache.orc.impl.ReaderImpl.extractFileTail(ReaderImpl.java:581)
	at org.apache.orc.impl.ReaderImpl.<init>(ReaderImpl.java:369)
	at org.apache.hadoop.hive.ql.io.orc.ReaderImpl.<init>(ReaderImpl.java:63)
	at org.apache.hadoop.hive.ql.io.orc.OrcFile.createReader(OrcFile.java:55)
	at org.apache.spark.sql.hive.orc.OrcFileOperator$.$anonfun$getFileReader$3(OrcFileOperator.scala:76)
	... 34 more
07:56:23.978 WARN org.apache.spark.scheduler.TaskSetManager: Lost task 0.0 in stage 11871.0 (TID 21683, amp-jenkins-worker-02.amp, executor driver): org.apache.spark.SparkException: Could not read footer for file: file:/home/jenkins/workspace/NewSparkPullRequestBuilder/target/tmp/spark-2dc462fd-1478-44ae-a36b-22fca03ff786/first/part-00000-d64f4930-87ac-443a-b0ed-1f07320e2740-c000.json
	at org.apache.spark.sql.hive.orc.OrcFileOperator$.$anonfun$getFileReader$3(OrcFileOperator.scala:83)
	at scala.collection.Iterator$$anon$10.next(Iterator.scala:459)
	at scala.collection.TraversableOnce.collectFirst(TraversableOnce.scala:148)
	at scala.collection.TraversableOnce.collectFirst$(TraversableOnce.scala:135)
	at scala.collection.AbstractIterator.collectFirst(Iterator.scala:1429)
	at org.apache.spark.sql.hive.orc.OrcFileOperator$.getFileReader(OrcFileOperator.scala:87)
	at org.apache.spark.sql.hive.orc.OrcFileOperator$.$anonfun$readSchema$1(OrcFileOperator.scala:96)
	at scala.collection.Iterator$$anon$10.next(Iterator.scala:459)
	at scala.collection.TraversableOnce.collectFirst(TraversableOnce.scala:148)
	at scala.collection.TraversableOnce.collectFirst$(TraversableOnce.scala:135)
	at scala.collection.AbstractIterator.collectFirst(Iterator.scala:1429)
	at org.apache.spark.sql.hive.orc.OrcFileOperator$.readSchema(OrcFileOperator.scala:96)
	at org.apache.spark.sql.hive.orc.OrcFileFormat.$anonfun$buildReader$2(OrcFileFormat.scala:163)
	at org.apache.spark.sql.execution.datasources.FileFormat$$anon$1.apply(FileFormat.scala:147)
	at org.apache.spark.sql.execution.datasources.FileFormat$$anon$1.apply(FileFormat.scala:132)
	at org.apache.spark.sql.execution.datasources.FileScanRDD$$anon$1.org$apache$spark$sql$execution$datasources$FileScanRDD$$anon$$readCurrentFile(FileScanRDD.scala:116)
	at org.apache.spark.sql.execution.datasources.FileScanRDD$$anon$1.nextIterator(FileScanRDD.scala:169)
	at org.apache.spark.sql.execution.datasources.FileScanRDD$$anon$1.hasNext(FileScanRDD.scala:93)
	at scala.collection.Iterator$$anon$10.hasNext(Iterator.scala:458)
	at org.apache.spark.sql.catalyst.expressions.GeneratedClass$GeneratedIteratorForCodegenStage1.agg_doAggregateWithoutKey_0$(generated.java:33)
	at org.apache.spark.sql.catalyst.expressions.GeneratedClass$GeneratedIteratorForCodegenStage1.processNext(generated.java:63)
	at org.apache.spark.sql.execution.BufferedRowIterator.hasNext(BufferedRowIterator.java:43)
	at org.apache.spark.sql.execution.WholeStageCodegenExec$$anon$1.hasNext(WholeStageCodegenExec.scala:726)
	at scala.collection.Iterator$$anon$10.hasNext(Iterator.scala:458)
	at org.apache.spark.shuffle.sort.BypassMergeSortShuffleWriter.write(BypassMergeSortShuffleWriter.java:132)
	at org.apache.spark.shuffle.ShuffleWriteProcessor.write(ShuffleWriteProcessor.scala:59)
	at org.apache.spark.scheduler.ShuffleMapTask.runTask(ShuffleMapTask.scala:99)
	at org.apache.spark.scheduler.ShuffleMapTask.runTask(ShuffleMapTask.scala:52)
	at org.apache.spark.scheduler.Task.run(Task.scala:127)
	at org.apache.spark.executor.Executor$TaskRunner.$anonfun$run$3(Executor.scala:441)
	at org.apache.spark.util.Utils$.tryWithSafeFinally(Utils.scala:1377)
	at org.apache.spark.executor.Executor$TaskRunner.run(Executor.scala:444)
	at java.util.concurrent.ThreadPoolExecutor.runWorker(ThreadPoolExecutor.java:1149)
	at java.util.concurrent.ThreadPoolExecutor$Worker.run(ThreadPoolExecutor.java:624)
	at java.lang.Thread.run(Thread.java:748)
Caused by: org.apache.orc.FileFormatException: Malformed ORC file file:/home/jenkins/workspace/NewSparkPullRequestBuilder/target/tmp/spark-2dc462fd-1478-44ae-a36b-22fca03ff786/first/part-00000-d64f4930-87ac-443a-b0ed-1f07320e2740-c000.json. Invalid postscript.
	at org.apache.orc.impl.ReaderImpl.ensureOrcFooter(ReaderImpl.java:274)
	at org.apache.orc.impl.ReaderImpl.extractFileTail(ReaderImpl.java:581)
	at org.apache.orc.impl.ReaderImpl.<init>(ReaderImpl.java:369)
	at org.apache.hadoop.hive.ql.io.orc.ReaderImpl.<init>(ReaderImpl.java:63)
	at org.apache.hadoop.hive.ql.io.orc.OrcFile.createReader(OrcFile.java:55)
	at org.apache.spark.sql.hive.orc.OrcFileOperator$.$anonfun$getFileReader$3(OrcFileOperator.scala:76)
	... 34 more

07:56:23.978 ERROR org.apache.spark.scheduler.TaskSetManager: Task 0 in stage 11871.0 failed 1 times; aborting job
[info] - Enabling/disabling ignoreCorruptFiles (6 seconds, 119 milliseconds)
[info] - SPARK-27160 Predicate pushdown correctness on DecimalType for ORC (1 second, 871 milliseconds)
[info] - SPARK-8501: Avoids discovery schema from empty ORC files (1 second, 72 milliseconds)
07:56:28.705 ERROR org.apache.hadoop.hive.ql.io.AcidUtils: Failed to get files with ID; using regular API: Only supported for DFS; got class org.apache.hadoop.hive.ql.io.ProxyLocalFileSystem
07:56:28.797 ERROR org.apache.hadoop.hive.ql.io.AcidUtils: Failed to get files with ID; using regular API: Only supported for DFS; got class org.apache.hadoop.hive.ql.io.ProxyLocalFileSystem
[info] - Verify the ORC conversion parameter: CONVERT_METASTORE_ORC (2 seconds, 64 milliseconds)
[info] - converted ORC table supports resolving mixed case field (1 second, 742 milliseconds)
[info] - SPARK-20728 Make ORCFileFormat configurable between sql/hive and sql/core (615 milliseconds)
[info] - SPARK-22267 Spark SQL incorrectly reads ORC files when column order is different (1 second, 566 milliseconds)
[info] - SPARK-19809 NullPointerException on zero-size ORC file (797 milliseconds)
[info] - SPARK-23340 Empty float/double array columns raise EOFException !!! IGNORED !!!
07:56:33.776 WARN org.apache.hadoop.hive.metastore.HiveMetaStore: Location: file:/home/jenkins/workspace/NewSparkPullRequestBuilder/target/tmp/warehouse-2afab2e3-d7dd-429a-bb50-79cde4c2fa44/spark_26437 specified for non-external table:spark_26437
07:56:34.672 ERROR org.apache.hadoop.hive.ql.io.AcidUtils: Failed to get files with ID; using regular API: Only supported for DFS; got class org.apache.hadoop.hive.ql.io.ProxyLocalFileSystem
07:56:34.787 ERROR org.apache.hadoop.hive.ql.io.AcidUtils: Failed to get files with ID; using regular API: Only supported for DFS; got class org.apache.hadoop.hive.ql.io.ProxyLocalFileSystem
[info] - SPARK-26437 Can not query decimal type when value is 0 (1 second, 242 milliseconds)
07:56:35.030 WARN org.apache.hadoop.hive.metastore.HiveMetaStore: Location: file:/home/jenkins/workspace/NewSparkPullRequestBuilder/target/tmp/warehouse-2afab2e3-d7dd-429a-bb50-79cde4c2fa44/dummy_orc_partitioned specified for non-external table:dummy_orc_partitioned
07:56:36.555 WARN org.apache.hadoop.hive.metastore.HiveMetaStore: Location: file:/home/jenkins/workspace/NewSparkPullRequestBuilder/target/tmp/warehouse-2afab2e3-d7dd-429a-bb50-79cde4c2fa44/dummy_orc_partitioned specified for non-external table:dummy_orc_partitioned
[info] - SPARK-28573 ORC conversation could be applied for partitioned table insertion (3 seconds, 606 milliseconds)
07:56:38.733 WARN org.apache.hadoop.hive.conf.HiveConf: HiveConf of name hive.internal.ss.authz.settings.applied.marker does not exist
07:56:38.733 WARN org.apache.hadoop.hive.conf.HiveConf: HiveConf of name hive.stats.jdbc.timeout does not exist
07:56:38.733 WARN org.apache.hadoop.hive.conf.HiveConf: HiveConf of name hive.stats.retries.wait does not exist
07:56:38.867 WARN org.apache.hadoop.hive.conf.HiveConf: HiveConf of name hive.internal.ss.authz.settings.applied.marker does not exist
07:56:38.867 WARN org.apache.hadoop.hive.conf.HiveConf: HiveConf of name hive.stats.jdbc.timeout does not exist
07:56:38.867 WARN org.apache.hadoop.hive.conf.HiveConf: HiveConf of name hive.stats.retries.wait does not exist
[info] HiveOrcPartitionDiscoverySuite:
[info] - read partitioned table - normal case (1 second, 782 milliseconds)
[info] - read partitioned table - with nulls (1 second, 758 milliseconds)
[info] - SPARK-27162: handle pathfilter configuration correctly (863 milliseconds)
07:56:43.369 WARN org.apache.hadoop.hive.conf.HiveConf: HiveConf of name hive.internal.ss.authz.settings.applied.marker does not exist
07:56:43.369 WARN org.apache.hadoop.hive.conf.HiveConf: HiveConf of name hive.stats.jdbc.timeout does not exist
07:56:43.369 WARN org.apache.hadoop.hive.conf.HiveConf: HiveConf of name hive.stats.retries.wait does not exist
07:56:43.464 WARN org.apache.hadoop.hive.conf.HiveConf: HiveConf of name hive.internal.ss.authz.settings.applied.marker does not exist
07:56:43.464 WARN org.apache.hadoop.hive.conf.HiveConf: HiveConf of name hive.stats.jdbc.timeout does not exist
07:56:43.465 WARN org.apache.hadoop.hive.conf.HiveConf: HiveConf of name hive.stats.retries.wait does not exist
[info] PruneFileSourcePartitionsSuite:
[info] - PruneFileSourcePartitions should not change the output of LogicalRelation (344 milliseconds)
[info] - SPARK-20986 Reset table's statistics after PruneFileSourcePartitions rule (1 second, 807 milliseconds)
[info] - SPARK-26576 Broadcast hint not applied to partitioned table (1 second, 333 milliseconds)
07:56:47.094 WARN org.apache.hadoop.hive.conf.HiveConf: HiveConf of name hive.internal.ss.authz.settings.applied.marker does not exist
07:56:47.097 WARN org.apache.hadoop.hive.conf.HiveConf: HiveConf of name hive.stats.jdbc.timeout does not exist
07:56:47.098 WARN org.apache.hadoop.hive.conf.HiveConf: HiveConf of name hive.stats.retries.wait does not exist
07:56:47.222 WARN org.apache.hadoop.hive.conf.HiveConf: HiveConf of name hive.internal.ss.authz.settings.applied.marker does not exist
07:56:47.222 WARN org.apache.hadoop.hive.conf.HiveConf: HiveConf of name hive.stats.jdbc.timeout does not exist
07:56:47.223 WARN org.apache.hadoop.hive.conf.HiveConf: HiveConf of name hive.stats.retries.wait does not exist
[info] HiveOrcFilterSuite:
[info] - filter pushdown - integer (887 milliseconds)
[info] - filter pushdown - long (765 milliseconds)
[info] - filter pushdown - float (752 milliseconds)
[info] - filter pushdown - double (786 milliseconds)
[info] - filter pushdown - string (793 milliseconds)
[info] - filter pushdown - boolean (796 milliseconds)
[info] - filter pushdown - decimal (984 milliseconds)
[info] - filter pushdown - timestamp (876 milliseconds)
[info] - filter pushdown - combinations with logical operators (479 milliseconds)
[info] - no filter pushdown - non-supported types (1 second, 215 milliseconds)
[info] - SPARK-12218 and SPARK-25699 Converting conjunctions into ORC SearchArguments (3 milliseconds)
[info] - SPARK-27699 Converting disjunctions into ORC SearchArguments (1 millisecond)
07:56:55.689 WARN org.apache.hadoop.hive.conf.HiveConf: HiveConf of name hive.internal.ss.authz.settings.applied.marker does not exist
07:56:55.689 WARN org.apache.hadoop.hive.conf.HiveConf: HiveConf of name hive.stats.jdbc.timeout does not exist
07:56:55.689 WARN org.apache.hadoop.hive.conf.HiveConf: HiveConf of name hive.stats.retries.wait does not exist
07:56:55.775 WARN org.apache.hadoop.hive.conf.HiveConf: HiveConf of name hive.internal.ss.authz.settings.applied.marker does not exist
07:56:55.775 WARN org.apache.hadoop.hive.conf.HiveConf: HiveConf of name hive.stats.jdbc.timeout does not exist
07:56:55.775 WARN org.apache.hadoop.hive.conf.HiveConf: HiveConf of name hive.stats.retries.wait does not exist
[info] ParquetHiveCompatibilitySuite:
07:56:57.988 WARN org.apache.spark.sql.execution.command.DropTableCommand: org.apache.spark.sql.AnalysisException: Path does not exist: file:/home/jenkins/workspace/NewSparkPullRequestBuilder/target/tmp/spark-564a0f53-d38e-4c6a-a93f-0082a2f89412;
org.apache.spark.sql.AnalysisException: Path does not exist: file:/home/jenkins/workspace/NewSparkPullRequestBuilder/target/tmp/spark-564a0f53-d38e-4c6a-a93f-0082a2f89412;
	at org.apache.spark.sql.execution.datasources.DataSource$.$anonfun$checkAndGlobPathIfNecessary$1(DataSource.scala:759)
	at scala.collection.TraversableLike.$anonfun$flatMap$1(TraversableLike.scala:245)
	at scala.collection.immutable.List.foreach(List.scala:392)
	at scala.collection.TraversableLike.flatMap(TraversableLike.scala:245)
	at scala.collection.TraversableLike.flatMap$(TraversableLike.scala:242)
	at scala.collection.immutable.List.flatMap(List.scala:355)
	at org.apache.spark.sql.execution.datasources.DataSource$.checkAndGlobPathIfNecessary(DataSource.scala:746)
	at org.apache.spark.sql.execution.datasources.DataSource.checkAndGlobPathIfNecessary(DataSource.scala:575)
	at org.apache.spark.sql.execution.datasources.DataSource.resolveRelation(DataSource.scala:398)
	at org.apache.spark.sql.hive.HiveMetastoreCatalog.$anonfun$convertToLogicalRelation$5(HiveMetastoreCatalog.scala:248)
	at scala.Option.getOrElse(Option.scala:189)
	at org.apache.spark.sql.hive.HiveMetastoreCatalog.$anonfun$convertToLogicalRelation$4(HiveMetastoreCatalog.scala:238)
	at org.apache.spark.sql.hive.HiveMetastoreCatalog.withTableCreationLock(HiveMetastoreCatalog.scala:58)
	at org.apache.spark.sql.hive.HiveMetastoreCatalog.convertToLogicalRelation(HiveMetastoreCatalog.scala:231)
	at org.apache.spark.sql.hive.HiveMetastoreCatalog.convert(HiveMetastoreCatalog.scala:137)
	at org.apache.spark.sql.hive.RelationConversions$$anonfun$apply$4.applyOrElse(HiveStrategies.scala:220)
	at org.apache.spark.sql.hive.RelationConversions$$anonfun$apply$4.applyOrElse(HiveStrategies.scala:207)
	at org.apache.spark.sql.catalyst.plans.logical.AnalysisHelper.$anonfun$resolveOperatorsDown$2(AnalysisHelper.scala:108)
	at org.apache.spark.sql.catalyst.trees.CurrentOrigin$.withOrigin(TreeNode.scala:72)
	at org.apache.spark.sql.catalyst.plans.logical.AnalysisHelper.$anonfun$resolveOperatorsDown$1(AnalysisHelper.scala:108)
	at org.apache.spark.sql.catalyst.plans.logical.AnalysisHelper$.allowInvokingTransformsInAnalyzer(AnalysisHelper.scala:194)
	at org.apache.spark.sql.catalyst.plans.logical.AnalysisHelper.resolveOperatorsDown(AnalysisHelper.scala:106)
	at org.apache.spark.sql.catalyst.plans.logical.AnalysisHelper.resolveOperatorsDown$(AnalysisHelper.scala:104)
	at org.apache.spark.sql.catalyst.plans.logical.LogicalPlan.resolveOperatorsDown(LogicalPlan.scala:29)
	at org.apache.spark.sql.catalyst.plans.logical.AnalysisHelper.$anonfun$resolveOperatorsDown$4(AnalysisHelper.scala:113)
	at org.apache.spark.sql.catalyst.trees.TreeNode.$anonfun$mapChildren$1(TreeNode.scala:376)
	at org.apache.spark.sql.catalyst.trees.TreeNode.mapProductIterator(TreeNode.scala:214)
	at org.apache.spark.sql.catalyst.trees.TreeNode.mapChildren(TreeNode.scala:374)
	at org.apache.spark.sql.catalyst.trees.TreeNode.mapChildren(TreeNode.scala:327)
	at org.apache.spark.sql.catalyst.plans.logical.AnalysisHelper.$anonfun$resolveOperatorsDown$1(AnalysisHelper.scala:113)
	at org.apache.spark.sql.catalyst.plans.logical.AnalysisHelper$.allowInvokingTransformsInAnalyzer(AnalysisHelper.scala:194)
	at org.apache.spark.sql.catalyst.plans.logical.AnalysisHelper.resolveOperatorsDown(AnalysisHelper.scala:106)
	at org.apache.spark.sql.catalyst.plans.logical.AnalysisHelper.resolveOperatorsDown$(AnalysisHelper.scala:104)
	at org.apache.spark.sql.catalyst.plans.logical.LogicalPlan.resolveOperatorsDown(LogicalPlan.scala:29)
	at org.apache.spark.sql.catalyst.plans.logical.AnalysisHelper.resolveOperators(AnalysisHelper.scala:73)
	at org.apache.spark.sql.catalyst.plans.logical.AnalysisHelper.resolveOperators$(AnalysisHelper.scala:72)
	at org.apache.spark.sql.catalyst.plans.logical.LogicalPlan.resolveOperators(LogicalPlan.scala:29)
	at org.apache.spark.sql.hive.RelationConversions.apply(HiveStrategies.scala:207)
	at org.apache.spark.sql.hive.RelationConversions.apply(HiveStrategies.scala:191)
	at org.apache.spark.sql.catalyst.rules.RuleExecutor.$anonfun$execute$2(RuleExecutor.scala:130)
	at scala.collection.IndexedSeqOptimized.foldLeft(IndexedSeqOptimized.scala:60)
	at scala.collection.IndexedSeqOptimized.foldLeft$(IndexedSeqOptimized.scala:68)
	at scala.collection.mutable.ArrayBuffer.foldLeft(ArrayBuffer.scala:49)
	at org.apache.spark.sql.catalyst.rules.RuleExecutor.$anonfun$execute$1(RuleExecutor.scala:127)
	at org.apache.spark.sql.catalyst.rules.RuleExecutor.$anonfun$execute$1$adapted(RuleExecutor.scala:119)
	at scala.collection.immutable.List.foreach(List.scala:392)
	at org.apache.spark.sql.catalyst.rules.RuleExecutor.execute(RuleExecutor.scala:119)
	at org.apache.spark.sql.catalyst.analysis.Analyzer.org$apache$spark$sql$catalyst$analysis$Analyzer$$executeSameContext(Analyzer.scala:168)
	at org.apache.spark.sql.catalyst.analysis.Analyzer.execute(Analyzer.scala:162)
	at org.apache.spark.sql.catalyst.analysis.Analyzer.execute(Analyzer.scala:122)
	at org.apache.spark.sql.catalyst.rules.RuleExecutor.$anonfun$executeAndTrack$1(RuleExecutor.scala:98)
	at org.apache.spark.sql.catalyst.QueryPlanningTracker$.withTracker(QueryPlanningTracker.scala:88)
	at org.apache.spark.sql.catalyst.rules.RuleExecutor.executeAndTrack(RuleExecutor.scala:98)
	at org.apache.spark.sql.catalyst.analysis.Analyzer.$anonfun$executeAndCheck$1(Analyzer.scala:146)
	at org.apache.spark.sql.catalyst.plans.logical.AnalysisHelper$.markInAnalyzer(AnalysisHelper.scala:201)
	at org.apache.spark.sql.catalyst.analysis.Analyzer.executeAndCheck(Analyzer.scala:145)
	at org.apache.spark.sql.hive.test.TestHiveQueryExecution.analyzed$lzycompute(TestHive.scala:606)
	at org.apache.spark.sql.hive.test.TestHiveQueryExecution.analyzed(TestHive.scala:589)
	at org.apache.spark.sql.execution.QueryExecution.assertAnalyzed(QueryExecution.scala:58)
	at org.apache.spark.sql.Dataset$.ofRows(Dataset.scala:87)
	at org.apache.spark.sql.SparkSession.table(SparkSession.scala:589)
	at org.apache.spark.sql.execution.command.DropTableCommand.run(ddl.scala:241)
	at org.apache.spark.sql.execution.command.ExecutedCommandExec.sideEffectResult$lzycompute(commands.scala:70)
	at org.apache.spark.sql.execution.command.ExecutedCommandExec.sideEffectResult(commands.scala:68)
	at org.apache.spark.sql.execution.command.ExecutedCommandExec.executeCollect(commands.scala:79)
	at org.apache.spark.sql.Dataset.$anonfun$logicalPlan$1(Dataset.scala:226)
	at org.apache.spark.sql.Dataset.$anonfun$withAction$1(Dataset.scala:3478)
	at org.apache.spark.sql.execution.SQLExecution$.$anonfun$withNewExecutionId$4(SQLExecution.scala:100)
	at org.apache.spark.sql.execution.SQLExecution$.withSQLConfPropagated(SQLExecution.scala:160)
	at org.apache.spark.sql.execution.SQLExecution$.withNewExecutionId(SQLExecution.scala:87)
	at org.apache.spark.sql.Dataset.withAction(Dataset.scala:3474)
	at org.apache.spark.sql.Dataset.<init>(Dataset.scala:226)
	at org.apache.spark.sql.Dataset$.ofRows(Dataset.scala:88)
	at org.apache.spark.sql.hive.test.TestHiveSparkSession.sql(TestHive.scala:238)
	at org.apache.spark.sql.test.SQLTestUtilsBase.$anonfun$withTable$2(SQLTestUtils.scala:291)
	at scala.collection.IndexedSeqOptimized.foreach(IndexedSeqOptimized.scala:36)
	at scala.collection.IndexedSeqOptimized.foreach$(IndexedSeqOptimized.scala:33)
	at scala.collection.mutable.WrappedArray.foreach(WrappedArray.scala:38)
	at org.apache.spark.sql.test.SQLTestUtilsBase.$anonfun$withTable$1(SQLTestUtils.scala:290)
	at org.apache.spark.util.Utils$.tryWithSafeFinally(Utils.scala:1386)
	at org.apache.spark.sql.test.SQLTestUtilsBase.withTable(SQLTestUtils.scala:290)
	at org.apache.spark.sql.test.SQLTestUtilsBase.withTable$(SQLTestUtils.scala:288)
	at org.apache.spark.sql.execution.datasources.parquet.ParquetCompatibilityTest.withTable(ParquetCompatibilityTest.scala:35)
	at org.apache.spark.sql.hive.ParquetHiveCompatibilitySuite.testParquetHiveCompatibility(ParquetHiveCompatibilitySuite.scala:47)
	at org.apache.spark.sql.hive.ParquetHiveCompatibilitySuite.$anonfun$new$1(ParquetHiveCompatibilitySuite.scala:94)
	at scala.runtime.java8.JFunction0$mcV$sp.apply(JFunction0$mcV$sp.java:23)
	at org.scalatest.OutcomeOf.outcomeOf(OutcomeOf.scala:85)
	at org.scalatest.OutcomeOf.outcomeOf$(OutcomeOf.scala:83)
	at org.scalatest.OutcomeOf$.outcomeOf(OutcomeOf.scala:104)
	at org.scalatest.Transformer.apply(Transformer.scala:22)
	at org.scalatest.Transformer.apply(Transformer.scala:20)
	at org.scalatest.FunSuiteLike$$anon$1.apply(FunSuiteLike.scala:186)
	at org.apache.spark.SparkFunSuite.withFixture(SparkFunSuite.scala:149)
	at org.scalatest.FunSuiteLike.invokeWithFixture$1(FunSuiteLike.scala:184)
	at org.scalatest.FunSuiteLike.$anonfun$runTest$1(FunSuiteLike.scala:196)
	at org.scalatest.SuperEngine.runTestImpl(Engine.scala:286)
	at org.scalatest.FunSuiteLike.runTest(FunSuiteLike.scala:196)
	at org.scalatest.FunSuiteLike.runTest$(FunSuiteLike.scala:178)
	at org.apache.spark.SparkFunSuite.org$scalatest$BeforeAndAfterEach$$super$runTest(SparkFunSuite.scala:56)
	at org.scalatest.BeforeAndAfterEach.runTest(BeforeAndAfterEach.scala:221)
	at org.scalatest.BeforeAndAfterEach.runTest$(BeforeAndAfterEach.scala:214)
	at org.apache.spark.SparkFunSuite.runTest(SparkFunSuite.scala:56)
	at org.scalatest.FunSuiteLike.$anonfun$runTests$1(FunSuiteLike.scala:229)
	at org.scalatest.SuperEngine.$anonfun$runTestsInBranch$1(Engine.scala:393)
	at scala.collection.immutable.List.foreach(List.scala:392)
	at org.scalatest.SuperEngine.traverseSubNodes$1(Engine.scala:381)
	at org.scalatest.SuperEngine.runTestsInBranch(Engine.scala:376)
	at org.scalatest.SuperEngine.runTestsImpl(Engine.scala:458)
	at org.scalatest.FunSuiteLike.runTests(FunSuiteLike.scala:229)
	at org.scalatest.FunSuiteLike.runTests$(FunSuiteLike.scala:228)
	at org.scalatest.FunSuite.runTests(FunSuite.scala:1560)
	at org.scalatest.Suite.run(Suite.scala:1124)
	at org.scalatest.Suite.run$(Suite.scala:1106)
	at org.scalatest.FunSuite.org$scalatest$FunSuiteLike$$super$run(FunSuite.scala:1560)
	at org.scalatest.FunSuiteLike.$anonfun$run$1(FunSuiteLike.scala:233)
	at org.scalatest.SuperEngine.runImpl(Engine.scala:518)
	at org.scalatest.FunSuiteLike.run(FunSuiteLike.scala:233)
	at org.scalatest.FunSuiteLike.run$(FunSuiteLike.scala:232)
	at org.apache.spark.SparkFunSuite.org$scalatest$BeforeAndAfterAll$$super$run(SparkFunSuite.scala:56)
	at org.scalatest.BeforeAndAfterAll.liftedTree1$1(BeforeAndAfterAll.scala:213)
	at org.scalatest.BeforeAndAfterAll.run(BeforeAndAfterAll.scala:210)
	at org.scalatest.BeforeAndAfterAll.run$(BeforeAndAfterAll.scala:208)
	at org.apache.spark.SparkFunSuite.run(SparkFunSuite.scala:56)
	at org.scalatest.tools.Framework.org$scalatest$tools$Framework$$runSuite(Framework.scala:317)
	at org.scalatest.tools.Framework$ScalaTestTask.execute(Framework.scala:510)
	at sbt.ForkMain$Run$2.call(ForkMain.java:296)
	at sbt.ForkMain$Run$2.call(ForkMain.java:286)
	at java.util.concurrent.FutureTask.run(FutureTask.java:266)
	at java.util.concurrent.ThreadPoolExecutor.runWorker(ThreadPoolExecutor.java:1149)
	at java.util.concurrent.ThreadPoolExecutor$Worker.run(ThreadPoolExecutor.java:624)
	at java.lang.Thread.run(Thread.java:748)
[info] - simple primitives (2 seconds, 257 milliseconds)
07:56:59.401 WARN org.apache.spark.sql.execution.command.DropTableCommand: org.apache.spark.sql.AnalysisException: Path does not exist: file:/home/jenkins/workspace/NewSparkPullRequestBuilder/target/tmp/spark-4413b238-e0a3-434e-a4f4-f2f5b2dc024a;
org.apache.spark.sql.AnalysisException: Path does not exist: file:/home/jenkins/workspace/NewSparkPullRequestBuilder/target/tmp/spark-4413b238-e0a3-434e-a4f4-f2f5b2dc024a;
	at org.apache.spark.sql.execution.datasources.DataSource$.$anonfun$checkAndGlobPathIfNecessary$1(DataSource.scala:759)
	at scala.collection.TraversableLike.$anonfun$flatMap$1(TraversableLike.scala:245)
	at scala.collection.immutable.List.foreach(List.scala:392)
	at scala.collection.TraversableLike.flatMap(TraversableLike.scala:245)
	at scala.collection.TraversableLike.flatMap$(TraversableLike.scala:242)
	at scala.collection.immutable.List.flatMap(List.scala:355)
	at org.apache.spark.sql.execution.datasources.DataSource$.checkAndGlobPathIfNecessary(DataSource.scala:746)
	at org.apache.spark.sql.execution.datasources.DataSource.checkAndGlobPathIfNecessary(DataSource.scala:575)
	at org.apache.spark.sql.execution.datasources.DataSource.resolveRelation(DataSource.scala:398)
	at org.apache.spark.sql.hive.HiveMetastoreCatalog.$anonfun$convertToLogicalRelation$5(HiveMetastoreCatalog.scala:248)
	at scala.Option.getOrElse(Option.scala:189)
	at org.apache.spark.sql.hive.HiveMetastoreCatalog.$anonfun$convertToLogicalRelation$4(HiveMetastoreCatalog.scala:238)
	at org.apache.spark.sql.hive.HiveMetastoreCatalog.withTableCreationLock(HiveMetastoreCatalog.scala:58)
	at org.apache.spark.sql.hive.HiveMetastoreCatalog.convertToLogicalRelation(HiveMetastoreCatalog.scala:231)
	at org.apache.spark.sql.hive.HiveMetastoreCatalog.convert(HiveMetastoreCatalog.scala:137)
	at org.apache.spark.sql.hive.RelationConversions$$anonfun$apply$4.applyOrElse(HiveStrategies.scala:220)
	at org.apache.spark.sql.hive.RelationConversions$$anonfun$apply$4.applyOrElse(HiveStrategies.scala:207)
	at org.apache.spark.sql.catalyst.plans.logical.AnalysisHelper.$anonfun$resolveOperatorsDown$2(AnalysisHelper.scala:108)
	at org.apache.spark.sql.catalyst.trees.CurrentOrigin$.withOrigin(TreeNode.scala:72)
	at org.apache.spark.sql.catalyst.plans.logical.AnalysisHelper.$anonfun$resolveOperatorsDown$1(AnalysisHelper.scala:108)
	at org.apache.spark.sql.catalyst.plans.logical.AnalysisHelper$.allowInvokingTransformsInAnalyzer(AnalysisHelper.scala:194)
	at org.apache.spark.sql.catalyst.plans.logical.AnalysisHelper.resolveOperatorsDown(AnalysisHelper.scala:106)
	at org.apache.spark.sql.catalyst.plans.logical.AnalysisHelper.resolveOperatorsDown$(AnalysisHelper.scala:104)
	at org.apache.spark.sql.catalyst.plans.logical.LogicalPlan.resolveOperatorsDown(LogicalPlan.scala:29)
	at org.apache.spark.sql.catalyst.plans.logical.AnalysisHelper.$anonfun$resolveOperatorsDown$4(AnalysisHelper.scala:113)
	at org.apache.spark.sql.catalyst.trees.TreeNode.$anonfun$mapChildren$1(TreeNode.scala:376)
	at org.apache.spark.sql.catalyst.trees.TreeNode.mapProductIterator(TreeNode.scala:214)
	at org.apache.spark.sql.catalyst.trees.TreeNode.mapChildren(TreeNode.scala:374)
	at org.apache.spark.sql.catalyst.trees.TreeNode.mapChildren(TreeNode.scala:327)
	at org.apache.spark.sql.catalyst.plans.logical.AnalysisHelper.$anonfun$resolveOperatorsDown$1(AnalysisHelper.scala:113)
	at org.apache.spark.sql.catalyst.plans.logical.AnalysisHelper$.allowInvokingTransformsInAnalyzer(AnalysisHelper.scala:194)
	at org.apache.spark.sql.catalyst.plans.logical.AnalysisHelper.resolveOperatorsDown(AnalysisHelper.scala:106)
	at org.apache.spark.sql.catalyst.plans.logical.AnalysisHelper.resolveOperatorsDown$(AnalysisHelper.scala:104)
	at org.apache.spark.sql.catalyst.plans.logical.LogicalPlan.resolveOperatorsDown(LogicalPlan.scala:29)
	at org.apache.spark.sql.catalyst.plans.logical.AnalysisHelper.resolveOperators(AnalysisHelper.scala:73)
	at org.apache.spark.sql.catalyst.plans.logical.AnalysisHelper.resolveOperators$(AnalysisHelper.scala:72)
	at org.apache.spark.sql.catalyst.plans.logical.LogicalPlan.resolveOperators(LogicalPlan.scala:29)
	at org.apache.spark.sql.hive.RelationConversions.apply(HiveStrategies.scala:207)
	at org.apache.spark.sql.hive.RelationConversions.apply(HiveStrategies.scala:191)
	at org.apache.spark.sql.catalyst.rules.RuleExecutor.$anonfun$execute$2(RuleExecutor.scala:130)
	at scala.collection.IndexedSeqOptimized.foldLeft(IndexedSeqOptimized.scala:60)
	at scala.collection.IndexedSeqOptimized.foldLeft$(IndexedSeqOptimized.scala:68)
	at scala.collection.mutable.ArrayBuffer.foldLeft(ArrayBuffer.scala:49)
	at org.apache.spark.sql.catalyst.rules.RuleExecutor.$anonfun$execute$1(RuleExecutor.scala:127)
	at org.apache.spark.sql.catalyst.rules.RuleExecutor.$anonfun$execute$1$adapted(RuleExecutor.scala:119)
	at scala.collection.immutable.List.foreach(List.scala:392)
	at org.apache.spark.sql.catalyst.rules.RuleExecutor.execute(RuleExecutor.scala:119)
	at org.apache.spark.sql.catalyst.analysis.Analyzer.org$apache$spark$sql$catalyst$analysis$Analyzer$$executeSameContext(Analyzer.scala:168)
	at org.apache.spark.sql.catalyst.analysis.Analyzer.execute(Analyzer.scala:162)
	at org.apache.spark.sql.catalyst.analysis.Analyzer.execute(Analyzer.scala:122)
	at org.apache.spark.sql.catalyst.rules.RuleExecutor.$anonfun$executeAndTrack$1(RuleExecutor.scala:98)
	at org.apache.spark.sql.catalyst.QueryPlanningTracker$.withTracker(QueryPlanningTracker.scala:88)
	at org.apache.spark.sql.catalyst.rules.RuleExecutor.executeAndTrack(RuleExecutor.scala:98)
	at org.apache.spark.sql.catalyst.analysis.Analyzer.$anonfun$executeAndCheck$1(Analyzer.scala:146)
	at org.apache.spark.sql.catalyst.plans.logical.AnalysisHelper$.markInAnalyzer(AnalysisHelper.scala:201)
	at org.apache.spark.sql.catalyst.analysis.Analyzer.executeAndCheck(Analyzer.scala:145)
	at org.apache.spark.sql.hive.test.TestHiveQueryExecution.analyzed$lzycompute(TestHive.scala:606)
	at org.apache.spark.sql.hive.test.TestHiveQueryExecution.analyzed(TestHive.scala:589)
	at org.apache.spark.sql.execution.QueryExecution.assertAnalyzed(QueryExecution.scala:58)
	at org.apache.spark.sql.Dataset$.ofRows(Dataset.scala:87)
	at org.apache.spark.sql.SparkSession.table(SparkSession.scala:589)
	at org.apache.spark.sql.execution.command.DropTableCommand.run(ddl.scala:241)
	at org.apache.spark.sql.execution.command.ExecutedCommandExec.sideEffectResult$lzycompute(commands.scala:70)
	at org.apache.spark.sql.execution.command.ExecutedCommandExec.sideEffectResult(commands.scala:68)
	at org.apache.spark.sql.execution.command.ExecutedCommandExec.executeCollect(commands.scala:79)
	at org.apache.spark.sql.Dataset.$anonfun$logicalPlan$1(Dataset.scala:226)
	at org.apache.spark.sql.Dataset.$anonfun$withAction$1(Dataset.scala:3478)
	at org.apache.spark.sql.execution.SQLExecution$.$anonfun$withNewExecutionId$4(SQLExecution.scala:100)
	at org.apache.spark.sql.execution.SQLExecution$.withSQLConfPropagated(SQLExecution.scala:160)
	at org.apache.spark.sql.execution.SQLExecution$.withNewExecutionId(SQLExecution.scala:87)
	at org.apache.spark.sql.Dataset.withAction(Dataset.scala:3474)
	at org.apache.spark.sql.Dataset.<init>(Dataset.scala:226)
	at org.apache.spark.sql.Dataset$.ofRows(Dataset.scala:88)
	at org.apache.spark.sql.hive.test.TestHiveSparkSession.sql(TestHive.scala:238)
	at org.apache.spark.sql.test.SQLTestUtilsBase.$anonfun$withTable$2(SQLTestUtils.scala:291)
	at scala.collection.IndexedSeqOptimized.foreach(IndexedSeqOptimized.scala:36)
	at scala.collection.IndexedSeqOptimized.foreach$(IndexedSeqOptimized.scala:33)
	at scala.collection.mutable.WrappedArray.foreach(WrappedArray.scala:38)
	at org.apache.spark.sql.test.SQLTestUtilsBase.$anonfun$withTable$1(SQLTestUtils.scala:290)
	at org.apache.spark.util.Utils$.tryWithSafeFinally(Utils.scala:1386)
	at org.apache.spark.sql.test.SQLTestUtilsBase.withTable(SQLTestUtils.scala:290)
	at org.apache.spark.sql.test.SQLTestUtilsBase.withTable$(SQLTestUtils.scala:288)
	at org.apache.spark.sql.execution.datasources.parquet.ParquetCompatibilityTest.withTable(ParquetCompatibilityTest.scala:35)
	at org.apache.spark.sql.hive.ParquetHiveCompatibilitySuite.testParquetHiveCompatibility(ParquetHiveCompatibilitySuite.scala:47)
	at org.apache.spark.sql.hive.ParquetHiveCompatibilitySuite.$anonfun$new$2(ParquetHiveCompatibilitySuite.scala:98)
	at scala.runtime.java8.JFunction0$mcV$sp.apply(JFunction0$mcV$sp.java:23)
	at org.scalatest.OutcomeOf.outcomeOf(OutcomeOf.scala:85)
	at org.scalatest.OutcomeOf.outcomeOf$(OutcomeOf.scala:83)
	at org.scalatest.OutcomeOf$.outcomeOf(OutcomeOf.scala:104)
	at org.scalatest.Transformer.apply(Transformer.scala:22)
	at org.scalatest.Transformer.apply(Transformer.scala:20)
	at org.scalatest.FunSuiteLike$$anon$1.apply(FunSuiteLike.scala:186)
	at org.apache.spark.SparkFunSuite.withFixture(SparkFunSuite.scala:149)
	at org.scalatest.FunSuiteLike.invokeWithFixture$1(FunSuiteLike.scala:184)
	at org.scalatest.FunSuiteLike.$anonfun$runTest$1(FunSuiteLike.scala:196)
	at org.scalatest.SuperEngine.runTestImpl(Engine.scala:286)
	at org.scalatest.FunSuiteLike.runTest(FunSuiteLike.scala:196)
	at org.scalatest.FunSuiteLike.runTest$(FunSuiteLike.scala:178)
	at org.apache.spark.SparkFunSuite.org$scalatest$BeforeAndAfterEach$$super$runTest(SparkFunSuite.scala:56)
	at org.scalatest.BeforeAndAfterEach.runTest(BeforeAndAfterEach.scala:221)
	at org.scalatest.BeforeAndAfterEach.runTest$(BeforeAndAfterEach.scala:214)
	at org.apache.spark.SparkFunSuite.runTest(SparkFunSuite.scala:56)
	at org.scalatest.FunSuiteLike.$anonfun$runTests$1(FunSuiteLike.scala:229)
	at org.scalatest.SuperEngine.$anonfun$runTestsInBranch$1(Engine.scala:393)
	at scala.collection.immutable.List.foreach(List.scala:392)
	at org.scalatest.SuperEngine.traverseSubNodes$1(Engine.scala:381)
	at org.scalatest.SuperEngine.runTestsInBranch(Engine.scala:376)
	at org.scalatest.SuperEngine.runTestsImpl(Engine.scala:458)
	at org.scalatest.FunSuiteLike.runTests(FunSuiteLike.scala:229)
	at org.scalatest.FunSuiteLike.runTests$(FunSuiteLike.scala:228)
	at org.scalatest.FunSuite.runTests(FunSuite.scala:1560)
	at org.scalatest.Suite.run(Suite.scala:1124)
	at org.scalatest.Suite.run$(Suite.scala:1106)
	at org.scalatest.FunSuite.org$scalatest$FunSuiteLike$$super$run(FunSuite.scala:1560)
	at org.scalatest.FunSuiteLike.$anonfun$run$1(FunSuiteLike.scala:233)
	at org.scalatest.SuperEngine.runImpl(Engine.scala:518)
	at org.scalatest.FunSuiteLike.run(FunSuiteLike.scala:233)
	at org.scalatest.FunSuiteLike.run$(FunSuiteLike.scala:232)
	at org.apache.spark.SparkFunSuite.org$scalatest$BeforeAndAfterAll$$super$run(SparkFunSuite.scala:56)
	at org.scalatest.BeforeAndAfterAll.liftedTree1$1(BeforeAndAfterAll.scala:213)
	at org.scalatest.BeforeAndAfterAll.run(BeforeAndAfterAll.scala:210)
	at org.scalatest.BeforeAndAfterAll.run$(BeforeAndAfterAll.scala:208)
	at org.apache.spark.SparkFunSuite.run(SparkFunSuite.scala:56)
	at org.scalatest.tools.Framework.org$scalatest$tools$Framework$$runSuite(Framework.scala:317)
	at org.scalatest.tools.Framework$ScalaTestTask.execute(Framework.scala:510)
	at sbt.ForkMain$Run$2.call(ForkMain.java:296)
	at sbt.ForkMain$Run$2.call(ForkMain.java:286)
	at java.util.concurrent.FutureTask.run(FutureTask.java:266)
	at java.util.concurrent.ThreadPoolExecutor.runWorker(ThreadPoolExecutor.java:1149)
	at java.util.concurrent.ThreadPoolExecutor$Worker.run(ThreadPoolExecutor.java:624)
	at java.lang.Thread.run(Thread.java:748)
[info] - SPARK-10177 timestamp (1 second, 396 milliseconds)
07:57:01.021 WARN org.apache.spark.sql.execution.command.DropTableCommand: org.apache.spark.sql.AnalysisException: Path does not exist: file:/home/jenkins/workspace/NewSparkPullRequestBuilder/target/tmp/spark-d2af1796-7177-455d-a99f-4d802f8e2b39;
org.apache.spark.sql.AnalysisException: Path does not exist: file:/home/jenkins/workspace/NewSparkPullRequestBuilder/target/tmp/spark-d2af1796-7177-455d-a99f-4d802f8e2b39;
	at org.apache.spark.sql.execution.datasources.DataSource$.$anonfun$checkAndGlobPathIfNecessary$1(DataSource.scala:759)
	at scala.collection.TraversableLike.$anonfun$flatMap$1(TraversableLike.scala:245)
	at scala.collection.immutable.List.foreach(List.scala:392)
	at scala.collection.TraversableLike.flatMap(TraversableLike.scala:245)
	at scala.collection.TraversableLike.flatMap$(TraversableLike.scala:242)
	at scala.collection.immutable.List.flatMap(List.scala:355)
	at org.apache.spark.sql.execution.datasources.DataSource$.checkAndGlobPathIfNecessary(DataSource.scala:746)
	at org.apache.spark.sql.execution.datasources.DataSource.checkAndGlobPathIfNecessary(DataSource.scala:575)
	at org.apache.spark.sql.execution.datasources.DataSource.resolveRelation(DataSource.scala:398)
	at org.apache.spark.sql.hive.HiveMetastoreCatalog.$anonfun$convertToLogicalRelation$5(HiveMetastoreCatalog.scala:248)
	at scala.Option.getOrElse(Option.scala:189)
	at org.apache.spark.sql.hive.HiveMetastoreCatalog.$anonfun$convertToLogicalRelation$4(HiveMetastoreCatalog.scala:238)
	at org.apache.spark.sql.hive.HiveMetastoreCatalog.withTableCreationLock(HiveMetastoreCatalog.scala:58)
	at org.apache.spark.sql.hive.HiveMetastoreCatalog.convertToLogicalRelation(HiveMetastoreCatalog.scala:231)
	at org.apache.spark.sql.hive.HiveMetastoreCatalog.convert(HiveMetastoreCatalog.scala:137)
	at org.apache.spark.sql.hive.RelationConversions$$anonfun$apply$4.applyOrElse(HiveStrategies.scala:220)
	at org.apache.spark.sql.hive.RelationConversions$$anonfun$apply$4.applyOrElse(HiveStrategies.scala:207)
	at org.apache.spark.sql.catalyst.plans.logical.AnalysisHelper.$anonfun$resolveOperatorsDown$2(AnalysisHelper.scala:108)
	at org.apache.spark.sql.catalyst.trees.CurrentOrigin$.withOrigin(TreeNode.scala:72)
	at org.apache.spark.sql.catalyst.plans.logical.AnalysisHelper.$anonfun$resolveOperatorsDown$1(AnalysisHelper.scala:108)
	at org.apache.spark.sql.catalyst.plans.logical.AnalysisHelper$.allowInvokingTransformsInAnalyzer(AnalysisHelper.scala:194)
	at org.apache.spark.sql.catalyst.plans.logical.AnalysisHelper.resolveOperatorsDown(AnalysisHelper.scala:106)
	at org.apache.spark.sql.catalyst.plans.logical.AnalysisHelper.resolveOperatorsDown$(AnalysisHelper.scala:104)
	at org.apache.spark.sql.catalyst.plans.logical.LogicalPlan.resolveOperatorsDown(LogicalPlan.scala:29)
	at org.apache.spark.sql.catalyst.plans.logical.AnalysisHelper.$anonfun$resolveOperatorsDown$4(AnalysisHelper.scala:113)
	at org.apache.spark.sql.catalyst.trees.TreeNode.$anonfun$mapChildren$1(TreeNode.scala:376)
	at org.apache.spark.sql.catalyst.trees.TreeNode.mapProductIterator(TreeNode.scala:214)
	at org.apache.spark.sql.catalyst.trees.TreeNode.mapChildren(TreeNode.scala:374)
	at org.apache.spark.sql.catalyst.trees.TreeNode.mapChildren(TreeNode.scala:327)
	at org.apache.spark.sql.catalyst.plans.logical.AnalysisHelper.$anonfun$resolveOperatorsDown$1(AnalysisHelper.scala:113)
	at org.apache.spark.sql.catalyst.plans.logical.AnalysisHelper$.allowInvokingTransformsInAnalyzer(AnalysisHelper.scala:194)
	at org.apache.spark.sql.catalyst.plans.logical.AnalysisHelper.resolveOperatorsDown(AnalysisHelper.scala:106)
	at org.apache.spark.sql.catalyst.plans.logical.AnalysisHelper.resolveOperatorsDown$(AnalysisHelper.scala:104)
	at org.apache.spark.sql.catalyst.plans.logical.LogicalPlan.resolveOperatorsDown(LogicalPlan.scala:29)
	at org.apache.spark.sql.catalyst.plans.logical.AnalysisHelper.resolveOperators(AnalysisHelper.scala:73)
	at org.apache.spark.sql.catalyst.plans.logical.AnalysisHelper.resolveOperators$(AnalysisHelper.scala:72)
	at org.apache.spark.sql.catalyst.plans.logical.LogicalPlan.resolveOperators(LogicalPlan.scala:29)
	at org.apache.spark.sql.hive.RelationConversions.apply(HiveStrategies.scala:207)
	at org.apache.spark.sql.hive.RelationConversions.apply(HiveStrategies.scala:191)
	at org.apache.spark.sql.catalyst.rules.RuleExecutor.$anonfun$execute$2(RuleExecutor.scala:130)
	at scala.collection.IndexedSeqOptimized.foldLeft(IndexedSeqOptimized.scala:60)
	at scala.collection.IndexedSeqOptimized.foldLeft$(IndexedSeqOptimized.scala:68)
	at scala.collection.mutable.ArrayBuffer.foldLeft(ArrayBuffer.scala:49)
	at org.apache.spark.sql.catalyst.rules.RuleExecutor.$anonfun$execute$1(RuleExecutor.scala:127)
	at org.apache.spark.sql.catalyst.rules.RuleExecutor.$anonfun$execute$1$adapted(RuleExecutor.scala:119)
	at scala.collection.immutable.List.foreach(List.scala:392)
	at org.apache.spark.sql.catalyst.rules.RuleExecutor.execute(RuleExecutor.scala:119)
	at org.apache.spark.sql.catalyst.analysis.Analyzer.org$apache$spark$sql$catalyst$analysis$Analyzer$$executeSameContext(Analyzer.scala:168)
	at org.apache.spark.sql.catalyst.analysis.Analyzer.execute(Analyzer.scala:162)
	at org.apache.spark.sql.catalyst.analysis.Analyzer.execute(Analyzer.scala:122)
	at org.apache.spark.sql.catalyst.rules.RuleExecutor.$anonfun$executeAndTrack$1(RuleExecutor.scala:98)
	at org.apache.spark.sql.catalyst.QueryPlanningTracker$.withTracker(QueryPlanningTracker.scala:88)
	at org.apache.spark.sql.catalyst.rules.RuleExecutor.executeAndTrack(RuleExecutor.scala:98)
	at org.apache.spark.sql.catalyst.analysis.Analyzer.$anonfun$executeAndCheck$1(Analyzer.scala:146)
	at org.apache.spark.sql.catalyst.plans.logical.AnalysisHelper$.markInAnalyzer(AnalysisHelper.scala:201)
	at org.apache.spark.sql.catalyst.analysis.Analyzer.executeAndCheck(Analyzer.scala:145)
	at org.apache.spark.sql.hive.test.TestHiveQueryExecution.analyzed$lzycompute(TestHive.scala:606)
	at org.apache.spark.sql.hive.test.TestHiveQueryExecution.analyzed(TestHive.scala:589)
	at org.apache.spark.sql.execution.QueryExecution.assertAnalyzed(QueryExecution.scala:58)
	at org.apache.spark.sql.Dataset$.ofRows(Dataset.scala:87)
	at org.apache.spark.sql.SparkSession.table(SparkSession.scala:589)
	at org.apache.spark.sql.execution.command.DropTableCommand.run(ddl.scala:241)
	at org.apache.spark.sql.execution.command.ExecutedCommandExec.sideEffectResult$lzycompute(commands.scala:70)
	at org.apache.spark.sql.execution.command.ExecutedCommandExec.sideEffectResult(commands.scala:68)
	at org.apache.spark.sql.execution.command.ExecutedCommandExec.executeCollect(commands.scala:79)
	at org.apache.spark.sql.Dataset.$anonfun$logicalPlan$1(Dataset.scala:226)
	at org.apache.spark.sql.Dataset.$anonfun$withAction$1(Dataset.scala:3478)
	at org.apache.spark.sql.execution.SQLExecution$.$anonfun$withNewExecutionId$4(SQLExecution.scala:100)
	at org.apache.spark.sql.execution.SQLExecution$.withSQLConfPropagated(SQLExecution.scala:160)
	at org.apache.spark.sql.execution.SQLExecution$.withNewExecutionId(SQLExecution.scala:87)
	at org.apache.spark.sql.Dataset.withAction(Dataset.scala:3474)
	at org.apache.spark.sql.Dataset.<init>(Dataset.scala:226)
	at org.apache.spark.sql.Dataset$.ofRows(Dataset.scala:88)
	at org.apache.spark.sql.hive.test.TestHiveSparkSession.sql(TestHive.scala:238)
	at org.apache.spark.sql.test.SQLTestUtilsBase.$anonfun$withTable$2(SQLTestUtils.scala:291)
	at scala.collection.IndexedSeqOptimized.foreach(IndexedSeqOptimized.scala:36)
	at scala.collection.IndexedSeqOptimized.foreach$(IndexedSeqOptimized.scala:33)
	at scala.collection.mutable.WrappedArray.foreach(WrappedArray.scala:38)
	at org.apache.spark.sql.test.SQLTestUtilsBase.$anonfun$withTable$1(SQLTestUtils.scala:290)
	at org.apache.spark.util.Utils$.tryWithSafeFinally(Utils.scala:1386)
	at org.apache.spark.sql.test.SQLTestUtilsBase.withTable(SQLTestUtils.scala:290)
	at org.apache.spark.sql.test.SQLTestUtilsBase.withTable$(SQLTestUtils.scala:288)
	at org.apache.spark.sql.execution.datasources.parquet.ParquetCompatibilityTest.withTable(ParquetCompatibilityTest.scala:35)
	at org.apache.spark.sql.hive.ParquetHiveCompatibilitySuite.testParquetHiveCompatibility(ParquetHiveCompatibilitySuite.scala:47)
	at org.apache.spark.sql.hive.ParquetHiveCompatibilitySuite.$anonfun$new$3(ParquetHiveCompatibilitySuite.scala:111)
	at scala.runtime.java8.JFunction0$mcV$sp.apply(JFunction0$mcV$sp.java:23)
	at org.scalatest.OutcomeOf.outcomeOf(OutcomeOf.scala:85)
	at org.scalatest.OutcomeOf.outcomeOf$(OutcomeOf.scala:83)
	at org.scalatest.OutcomeOf$.outcomeOf(OutcomeOf.scala:104)
	at org.scalatest.Transformer.apply(Transformer.scala:22)
	at org.scalatest.Transformer.apply(Transformer.scala:20)
	at org.scalatest.FunSuiteLike$$anon$1.apply(FunSuiteLike.scala:186)
	at org.apache.spark.SparkFunSuite.withFixture(SparkFunSuite.scala:149)
	at org.scalatest.FunSuiteLike.invokeWithFixture$1(FunSuiteLike.scala:184)
	at org.scalatest.FunSuiteLike.$anonfun$runTest$1(FunSuiteLike.scala:196)
	at org.scalatest.SuperEngine.runTestImpl(Engine.scala:286)
	at org.scalatest.FunSuiteLike.runTest(FunSuiteLike.scala:196)
	at org.scalatest.FunSuiteLike.runTest$(FunSuiteLike.scala:178)
	at org.apache.spark.SparkFunSuite.org$scalatest$BeforeAndAfterEach$$super$runTest(SparkFunSuite.scala:56)
	at org.scalatest.BeforeAndAfterEach.runTest(BeforeAndAfterEach.scala:221)
	at org.scalatest.BeforeAndAfterEach.runTest$(BeforeAndAfterEach.scala:214)
	at org.apache.spark.SparkFunSuite.runTest(SparkFunSuite.scala:56)
	at org.scalatest.FunSuiteLike.$anonfun$runTests$1(FunSuiteLike.scala:229)
	at org.scalatest.SuperEngine.$anonfun$runTestsInBranch$1(Engine.scala:393)
	at scala.collection.immutable.List.foreach(List.scala:392)
	at org.scalatest.SuperEngine.traverseSubNodes$1(Engine.scala:381)
	at org.scalatest.SuperEngine.runTestsInBranch(Engine.scala:376)
	at org.scalatest.SuperEngine.runTestsImpl(Engine.scala:458)
	at org.scalatest.FunSuiteLike.runTests(FunSuiteLike.scala:229)
	at org.scalatest.FunSuiteLike.runTests$(FunSuiteLike.scala:228)
	at org.scalatest.FunSuite.runTests(FunSuite.scala:1560)
	at org.scalatest.Suite.run(Suite.scala:1124)
	at org.scalatest.Suite.run$(Suite.scala:1106)
	at org.scalatest.FunSuite.org$scalatest$FunSuiteLike$$super$run(FunSuite.scala:1560)
	at org.scalatest.FunSuiteLike.$anonfun$run$1(FunSuiteLike.scala:233)
	at org.scalatest.SuperEngine.runImpl(Engine.scala:518)
	at org.scalatest.FunSuiteLike.run(FunSuiteLike.scala:233)
	at org.scalatest.FunSuiteLike.run$(FunSuiteLike.scala:232)
	at org.apache.spark.SparkFunSuite.org$scalatest$BeforeAndAfterAll$$super$run(SparkFunSuite.scala:56)
	at org.scalatest.BeforeAndAfterAll.liftedTree1$1(BeforeAndAfterAll.scala:213)
	at org.scalatest.BeforeAndAfterAll.run(BeforeAndAfterAll.scala:210)
	at org.scalatest.BeforeAndAfterAll.run$(BeforeAndAfterAll.scala:208)
	at org.apache.spark.SparkFunSuite.run(SparkFunSuite.scala:56)
	at org.scalatest.tools.Framework.org$scalatest$tools$Framework$$runSuite(Framework.scala:317)
	at org.scalatest.tools.Framework$ScalaTestTask.execute(Framework.scala:510)
	at sbt.ForkMain$Run$2.call(ForkMain.java:296)
	at sbt.ForkMain$Run$2.call(ForkMain.java:286)
	at java.util.concurrent.FutureTask.run(FutureTask.java:266)
	at java.util.concurrent.ThreadPoolExecutor.runWorker(ThreadPoolExecutor.java:1149)
	at java.util.concurrent.ThreadPoolExecutor$Worker.run(ThreadPoolExecutor.java:624)
	at java.lang.Thread.run(Thread.java:748)
[info] - array (1 second, 655 milliseconds)
07:57:02.606 WARN org.apache.spark.sql.execution.command.DropTableCommand: org.apache.spark.sql.AnalysisException: Path does not exist: file:/home/jenkins/workspace/NewSparkPullRequestBuilder/target/tmp/spark-5fd9a784-ffb9-400b-b44a-1defc0b94364;
org.apache.spark.sql.AnalysisException: Path does not exist: file:/home/jenkins/workspace/NewSparkPullRequestBuilder/target/tmp/spark-5fd9a784-ffb9-400b-b44a-1defc0b94364;
	at org.apache.spark.sql.execution.datasources.DataSource$.$anonfun$checkAndGlobPathIfNecessary$1(DataSource.scala:759)
	at scala.collection.TraversableLike.$anonfun$flatMap$1(TraversableLike.scala:245)
	at scala.collection.immutable.List.foreach(List.scala:392)
	at scala.collection.TraversableLike.flatMap(TraversableLike.scala:245)
	at scala.collection.TraversableLike.flatMap$(TraversableLike.scala:242)
	at scala.collection.immutable.List.flatMap(List.scala:355)
	at org.apache.spark.sql.execution.datasources.DataSource$.checkAndGlobPathIfNecessary(DataSource.scala:746)
	at org.apache.spark.sql.execution.datasources.DataSource.checkAndGlobPathIfNecessary(DataSource.scala:575)
	at org.apache.spark.sql.execution.datasources.DataSource.resolveRelation(DataSource.scala:398)
	at org.apache.spark.sql.hive.HiveMetastoreCatalog.$anonfun$convertToLogicalRelation$5(HiveMetastoreCatalog.scala:248)
	at scala.Option.getOrElse(Option.scala:189)
	at org.apache.spark.sql.hive.HiveMetastoreCatalog.$anonfun$convertToLogicalRelation$4(HiveMetastoreCatalog.scala:238)
	at org.apache.spark.sql.hive.HiveMetastoreCatalog.withTableCreationLock(HiveMetastoreCatalog.scala:58)
	at org.apache.spark.sql.hive.HiveMetastoreCatalog.convertToLogicalRelation(HiveMetastoreCatalog.scala:231)
	at org.apache.spark.sql.hive.HiveMetastoreCatalog.convert(HiveMetastoreCatalog.scala:137)
	at org.apache.spark.sql.hive.RelationConversions$$anonfun$apply$4.applyOrElse(HiveStrategies.scala:220)
	at org.apache.spark.sql.hive.RelationConversions$$anonfun$apply$4.applyOrElse(HiveStrategies.scala:207)
	at org.apache.spark.sql.catalyst.plans.logical.AnalysisHelper.$anonfun$resolveOperatorsDown$2(AnalysisHelper.scala:108)
	at org.apache.spark.sql.catalyst.trees.CurrentOrigin$.withOrigin(TreeNode.scala:72)
	at org.apache.spark.sql.catalyst.plans.logical.AnalysisHelper.$anonfun$resolveOperatorsDown$1(AnalysisHelper.scala:108)
	at org.apache.spark.sql.catalyst.plans.logical.AnalysisHelper$.allowInvokingTransformsInAnalyzer(AnalysisHelper.scala:194)
	at org.apache.spark.sql.catalyst.plans.logical.AnalysisHelper.resolveOperatorsDown(AnalysisHelper.scala:106)
	at org.apache.spark.sql.catalyst.plans.logical.AnalysisHelper.resolveOperatorsDown$(AnalysisHelper.scala:104)
	at org.apache.spark.sql.catalyst.plans.logical.LogicalPlan.resolveOperatorsDown(LogicalPlan.scala:29)
	at org.apache.spark.sql.catalyst.plans.logical.AnalysisHelper.$anonfun$resolveOperatorsDown$4(AnalysisHelper.scala:113)
	at org.apache.spark.sql.catalyst.trees.TreeNode.$anonfun$mapChildren$1(TreeNode.scala:376)
	at org.apache.spark.sql.catalyst.trees.TreeNode.mapProductIterator(TreeNode.scala:214)
	at org.apache.spark.sql.catalyst.trees.TreeNode.mapChildren(TreeNode.scala:374)
	at org.apache.spark.sql.catalyst.trees.TreeNode.mapChildren(TreeNode.scala:327)
	at org.apache.spark.sql.catalyst.plans.logical.AnalysisHelper.$anonfun$resolveOperatorsDown$1(AnalysisHelper.scala:113)
	at org.apache.spark.sql.catalyst.plans.logical.AnalysisHelper$.allowInvokingTransformsInAnalyzer(AnalysisHelper.scala:194)
	at org.apache.spark.sql.catalyst.plans.logical.AnalysisHelper.resolveOperatorsDown(AnalysisHelper.scala:106)
	at org.apache.spark.sql.catalyst.plans.logical.AnalysisHelper.resolveOperatorsDown$(AnalysisHelper.scala:104)
	at org.apache.spark.sql.catalyst.plans.logical.LogicalPlan.resolveOperatorsDown(LogicalPlan.scala:29)
	at org.apache.spark.sql.catalyst.plans.logical.AnalysisHelper.resolveOperators(AnalysisHelper.scala:73)
	at org.apache.spark.sql.catalyst.plans.logical.AnalysisHelper.resolveOperators$(AnalysisHelper.scala:72)
	at org.apache.spark.sql.catalyst.plans.logical.LogicalPlan.resolveOperators(LogicalPlan.scala:29)
	at org.apache.spark.sql.hive.RelationConversions.apply(HiveStrategies.scala:207)
	at org.apache.spark.sql.hive.RelationConversions.apply(HiveStrategies.scala:191)
	at org.apache.spark.sql.catalyst.rules.RuleExecutor.$anonfun$execute$2(RuleExecutor.scala:130)
	at scala.collection.IndexedSeqOptimized.foldLeft(IndexedSeqOptimized.scala:60)
	at scala.collection.IndexedSeqOptimized.foldLeft$(IndexedSeqOptimized.scala:68)
	at scala.collection.mutable.ArrayBuffer.foldLeft(ArrayBuffer.scala:49)
	at org.apache.spark.sql.catalyst.rules.RuleExecutor.$anonfun$execute$1(RuleExecutor.scala:127)
	at org.apache.spark.sql.catalyst.rules.RuleExecutor.$anonfun$execute$1$adapted(RuleExecutor.scala:119)
	at scala.collection.immutable.List.foreach(List.scala:392)
	at org.apache.spark.sql.catalyst.rules.RuleExecutor.execute(RuleExecutor.scala:119)
	at org.apache.spark.sql.catalyst.analysis.Analyzer.org$apache$spark$sql$catalyst$analysis$Analyzer$$executeSameContext(Analyzer.scala:168)
	at org.apache.spark.sql.catalyst.analysis.Analyzer.execute(Analyzer.scala:162)
	at org.apache.spark.sql.catalyst.analysis.Analyzer.execute(Analyzer.scala:122)
	at org.apache.spark.sql.catalyst.rules.RuleExecutor.$anonfun$executeAndTrack$1(RuleExecutor.scala:98)
	at org.apache.spark.sql.catalyst.QueryPlanningTracker$.withTracker(QueryPlanningTracker.scala:88)
	at org.apache.spark.sql.catalyst.rules.RuleExecutor.executeAndTrack(RuleExecutor.scala:98)
	at org.apache.spark.sql.catalyst.analysis.Analyzer.$anonfun$executeAndCheck$1(Analyzer.scala:146)
	at org.apache.spark.sql.catalyst.plans.logical.AnalysisHelper$.markInAnalyzer(AnalysisHelper.scala:201)
	at org.apache.spark.sql.catalyst.analysis.Analyzer.executeAndCheck(Analyzer.scala:145)
	at org.apache.spark.sql.hive.test.TestHiveQueryExecution.analyzed$lzycompute(TestHive.scala:606)
	at org.apache.spark.sql.hive.test.TestHiveQueryExecution.analyzed(TestHive.scala:589)
	at org.apache.spark.sql.execution.QueryExecution.assertAnalyzed(QueryExecution.scala:58)
	at org.apache.spark.sql.Dataset$.ofRows(Dataset.scala:87)
	at org.apache.spark.sql.SparkSession.table(SparkSession.scala:589)
	at org.apache.spark.sql.execution.command.DropTableCommand.run(ddl.scala:241)
	at org.apache.spark.sql.execution.command.ExecutedCommandExec.sideEffectResult$lzycompute(commands.scala:70)
	at org.apache.spark.sql.execution.command.ExecutedCommandExec.sideEffectResult(commands.scala:68)
	at org.apache.spark.sql.execution.command.ExecutedCommandExec.executeCollect(commands.scala:79)
	at org.apache.spark.sql.Dataset.$anonfun$logicalPlan$1(Dataset.scala:226)
	at org.apache.spark.sql.Dataset.$anonfun$withAction$1(Dataset.scala:3478)
	at org.apache.spark.sql.execution.SQLExecution$.$anonfun$withNewExecutionId$4(SQLExecution.scala:100)
	at org.apache.spark.sql.execution.SQLExecution$.withSQLConfPropagated(SQLExecution.scala:160)
	at org.apache.spark.sql.execution.SQLExecution$.withNewExecutionId(SQLExecution.scala:87)
	at org.apache.spark.sql.Dataset.withAction(Dataset.scala:3474)
	at org.apache.spark.sql.Dataset.<init>(Dataset.scala:226)
	at org.apache.spark.sql.Dataset$.ofRows(Dataset.scala:88)
	at org.apache.spark.sql.hive.test.TestHiveSparkSession.sql(TestHive.scala:238)
	at org.apache.spark.sql.test.SQLTestUtilsBase.$anonfun$withTable$2(SQLTestUtils.scala:291)
	at scala.collection.IndexedSeqOptimized.foreach(IndexedSeqOptimized.scala:36)
	at scala.collection.IndexedSeqOptimized.foreach$(IndexedSeqOptimized.scala:33)
	at scala.collection.mutable.WrappedArray.foreach(WrappedArray.scala:38)
	at org.apache.spark.sql.test.SQLTestUtilsBase.$anonfun$withTable$1(SQLTestUtils.scala:290)
	at org.apache.spark.util.Utils$.tryWithSafeFinally(Utils.scala:1386)
	at org.apache.spark.sql.test.SQLTestUtilsBase.withTable(SQLTestUtils.scala:290)
	at org.apache.spark.sql.test.SQLTestUtilsBase.withTable$(SQLTestUtils.scala:288)
	at org.apache.spark.sql.execution.datasources.parquet.ParquetCompatibilityTest.withTable(ParquetCompatibilityTest.scala:35)
	at org.apache.spark.sql.hive.ParquetHiveCompatibilitySuite.testParquetHiveCompatibility(ParquetHiveCompatibilitySuite.scala:47)
	at org.apache.spark.sql.hive.ParquetHiveCompatibilitySuite.$anonfun$new$4(ParquetHiveCompatibilitySuite.scala:120)
	at scala.runtime.java8.JFunction0$mcV$sp.apply(JFunction0$mcV$sp.java:23)
	at org.scalatest.OutcomeOf.outcomeOf(OutcomeOf.scala:85)
	at org.scalatest.OutcomeOf.outcomeOf$(OutcomeOf.scala:83)
	at org.scalatest.OutcomeOf$.outcomeOf(OutcomeOf.scala:104)
	at org.scalatest.Transformer.apply(Transformer.scala:22)
	at org.scalatest.Transformer.apply(Transformer.scala:20)
	at org.scalatest.FunSuiteLike$$anon$1.apply(FunSuiteLike.scala:186)
	at org.apache.spark.SparkFunSuite.withFixture(SparkFunSuite.scala:149)
	at org.scalatest.FunSuiteLike.invokeWithFixture$1(FunSuiteLike.scala:184)
	at org.scalatest.FunSuiteLike.$anonfun$runTest$1(FunSuiteLike.scala:196)
	at org.scalatest.SuperEngine.runTestImpl(Engine.scala:286)
	at org.scalatest.FunSuiteLike.runTest(FunSuiteLike.scala:196)
	at org.scalatest.FunSuiteLike.runTest$(FunSuiteLike.scala:178)
	at org.apache.spark.SparkFunSuite.org$scalatest$BeforeAndAfterEach$$super$runTest(SparkFunSuite.scala:56)
	at org.scalatest.BeforeAndAfterEach.runTest(BeforeAndAfterEach.scala:221)
	at org.scalatest.BeforeAndAfterEach.runTest$(BeforeAndAfterEach.scala:214)
	at org.apache.spark.SparkFunSuite.runTest(SparkFunSuite.scala:56)
	at org.scalatest.FunSuiteLike.$anonfun$runTests$1(FunSuiteLike.scala:229)
	at org.scalatest.SuperEngine.$anonfun$runTestsInBranch$1(Engine.scala:393)
	at scala.collection.immutable.List.foreach(List.scala:392)
	at org.scalatest.SuperEngine.traverseSubNodes$1(Engine.scala:381)
	at org.scalatest.SuperEngine.runTestsInBranch(Engine.scala:376)
	at org.scalatest.SuperEngine.runTestsImpl(Engine.scala:458)
	at org.scalatest.FunSuiteLike.runTests(FunSuiteLike.scala:229)
	at org.scalatest.FunSuiteLike.runTests$(FunSuiteLike.scala:228)
	at org.scalatest.FunSuite.runTests(FunSuite.scala:1560)
	at org.scalatest.Suite.run(Suite.scala:1124)
	at org.scalatest.Suite.run$(Suite.scala:1106)
	at org.scalatest.FunSuite.org$scalatest$FunSuiteLike$$super$run(FunSuite.scala:1560)
	at org.scalatest.FunSuiteLike.$anonfun$run$1(FunSuiteLike.scala:233)
	at org.scalatest.SuperEngine.runImpl(Engine.scala:518)
	at org.scalatest.FunSuiteLike.run(FunSuiteLike.scala:233)
	at org.scalatest.FunSuiteLike.run$(FunSuiteLike.scala:232)
	at org.apache.spark.SparkFunSuite.org$scalatest$BeforeAndAfterAll$$super$run(SparkFunSuite.scala:56)
	at org.scalatest.BeforeAndAfterAll.liftedTree1$1(BeforeAndAfterAll.scala:213)
	at org.scalatest.BeforeAndAfterAll.run(BeforeAndAfterAll.scala:210)
	at org.scalatest.BeforeAndAfterAll.run$(BeforeAndAfterAll.scala:208)
	at org.apache.spark.SparkFunSuite.run(SparkFunSuite.scala:56)
	at org.scalatest.tools.Framework.org$scalatest$tools$Framework$$runSuite(Framework.scala:317)
	at org.scalatest.tools.Framework$ScalaTestTask.execute(Framework.scala:510)
	at sbt.ForkMain$Run$2.call(ForkMain.java:296)
	at sbt.ForkMain$Run$2.call(ForkMain.java:286)
	at java.util.concurrent.FutureTask.run(FutureTask.java:266)
	at java.util.concurrent.ThreadPoolExecutor.runWorker(ThreadPoolExecutor.java:1149)
	at java.util.concurrent.ThreadPoolExecutor$Worker.run(ThreadPoolExecutor.java:624)
	at java.lang.Thread.run(Thread.java:748)
[info] - map (1 second, 579 milliseconds)
[info] - map entries with null keys !!! IGNORED !!!
07:57:04.201 WARN org.apache.spark.sql.execution.command.DropTableCommand: org.apache.spark.sql.AnalysisException: Path does not exist: file:/home/jenkins/workspace/NewSparkPullRequestBuilder/target/tmp/spark-2a0f4be6-fb57-4d2d-832a-3124ff535c38;
org.apache.spark.sql.AnalysisException: Path does not exist: file:/home/jenkins/workspace/NewSparkPullRequestBuilder/target/tmp/spark-2a0f4be6-fb57-4d2d-832a-3124ff535c38;
	at org.apache.spark.sql.execution.datasources.DataSource$.$anonfun$checkAndGlobPathIfNecessary$1(DataSource.scala:759)
	at scala.collection.TraversableLike.$anonfun$flatMap$1(TraversableLike.scala:245)
	at scala.collection.immutable.List.foreach(List.scala:392)
	at scala.collection.TraversableLike.flatMap(TraversableLike.scala:245)
	at scala.collection.TraversableLike.flatMap$(TraversableLike.scala:242)
	at scala.collection.immutable.List.flatMap(List.scala:355)
	at org.apache.spark.sql.execution.datasources.DataSource$.checkAndGlobPathIfNecessary(DataSource.scala:746)
	at org.apache.spark.sql.execution.datasources.DataSource.checkAndGlobPathIfNecessary(DataSource.scala:575)
	at org.apache.spark.sql.execution.datasources.DataSource.resolveRelation(DataSource.scala:398)
	at org.apache.spark.sql.hive.HiveMetastoreCatalog.$anonfun$convertToLogicalRelation$5(HiveMetastoreCatalog.scala:248)
	at scala.Option.getOrElse(Option.scala:189)
	at org.apache.spark.sql.hive.HiveMetastoreCatalog.$anonfun$convertToLogicalRelation$4(HiveMetastoreCatalog.scala:238)
	at org.apache.spark.sql.hive.HiveMetastoreCatalog.withTableCreationLock(HiveMetastoreCatalog.scala:58)
	at org.apache.spark.sql.hive.HiveMetastoreCatalog.convertToLogicalRelation(HiveMetastoreCatalog.scala:231)
	at org.apache.spark.sql.hive.HiveMetastoreCatalog.convert(HiveMetastoreCatalog.scala:137)
	at org.apache.spark.sql.hive.RelationConversions$$anonfun$apply$4.applyOrElse(HiveStrategies.scala:220)
	at org.apache.spark.sql.hive.RelationConversions$$anonfun$apply$4.applyOrElse(HiveStrategies.scala:207)
	at org.apache.spark.sql.catalyst.plans.logical.AnalysisHelper.$anonfun$resolveOperatorsDown$2(AnalysisHelper.scala:108)
	at org.apache.spark.sql.catalyst.trees.CurrentOrigin$.withOrigin(TreeNode.scala:72)
	at org.apache.spark.sql.catalyst.plans.logical.AnalysisHelper.$anonfun$resolveOperatorsDown$1(AnalysisHelper.scala:108)
	at org.apache.spark.sql.catalyst.plans.logical.AnalysisHelper$.allowInvokingTransformsInAnalyzer(AnalysisHelper.scala:194)
	at org.apache.spark.sql.catalyst.plans.logical.AnalysisHelper.resolveOperatorsDown(AnalysisHelper.scala:106)
	at org.apache.spark.sql.catalyst.plans.logical.AnalysisHelper.resolveOperatorsDown$(AnalysisHelper.scala:104)
	at org.apache.spark.sql.catalyst.plans.logical.LogicalPlan.resolveOperatorsDown(LogicalPlan.scala:29)
	at org.apache.spark.sql.catalyst.plans.logical.AnalysisHelper.$anonfun$resolveOperatorsDown$4(AnalysisHelper.scala:113)
	at org.apache.spark.sql.catalyst.trees.TreeNode.$anonfun$mapChildren$1(TreeNode.scala:376)
	at org.apache.spark.sql.catalyst.trees.TreeNode.mapProductIterator(TreeNode.scala:214)
	at org.apache.spark.sql.catalyst.trees.TreeNode.mapChildren(TreeNode.scala:374)
	at org.apache.spark.sql.catalyst.trees.TreeNode.mapChildren(TreeNode.scala:327)
	at org.apache.spark.sql.catalyst.plans.logical.AnalysisHelper.$anonfun$resolveOperatorsDown$1(AnalysisHelper.scala:113)
	at org.apache.spark.sql.catalyst.plans.logical.AnalysisHelper$.allowInvokingTransformsInAnalyzer(AnalysisHelper.scala:194)
	at org.apache.spark.sql.catalyst.plans.logical.AnalysisHelper.resolveOperatorsDown(AnalysisHelper.scala:106)
	at org.apache.spark.sql.catalyst.plans.logical.AnalysisHelper.resolveOperatorsDown$(AnalysisHelper.scala:104)
	at org.apache.spark.sql.catalyst.plans.logical.LogicalPlan.resolveOperatorsDown(LogicalPlan.scala:29)
	at org.apache.spark.sql.catalyst.plans.logical.AnalysisHelper.resolveOperators(AnalysisHelper.scala:73)
	at org.apache.spark.sql.catalyst.plans.logical.AnalysisHelper.resolveOperators$(AnalysisHelper.scala:72)
	at org.apache.spark.sql.catalyst.plans.logical.LogicalPlan.resolveOperators(LogicalPlan.scala:29)
	at org.apache.spark.sql.hive.RelationConversions.apply(HiveStrategies.scala:207)
	at org.apache.spark.sql.hive.RelationConversions.apply(HiveStrategies.scala:191)
	at org.apache.spark.sql.catalyst.rules.RuleExecutor.$anonfun$execute$2(RuleExecutor.scala:130)
	at scala.collection.IndexedSeqOptimized.foldLeft(IndexedSeqOptimized.scala:60)
	at scala.collection.IndexedSeqOptimized.foldLeft$(IndexedSeqOptimized.scala:68)
	at scala.collection.mutable.ArrayBuffer.foldLeft(ArrayBuffer.scala:49)
	at org.apache.spark.sql.catalyst.rules.RuleExecutor.$anonfun$execute$1(RuleExecutor.scala:127)
	at org.apache.spark.sql.catalyst.rules.RuleExecutor.$anonfun$execute$1$adapted(RuleExecutor.scala:119)
	at scala.collection.immutable.List.foreach(List.scala:392)
	at org.apache.spark.sql.catalyst.rules.RuleExecutor.execute(RuleExecutor.scala:119)
	at org.apache.spark.sql.catalyst.analysis.Analyzer.org$apache$spark$sql$catalyst$analysis$Analyzer$$executeSameContext(Analyzer.scala:168)
	at org.apache.spark.sql.catalyst.analysis.Analyzer.execute(Analyzer.scala:162)
	at org.apache.spark.sql.catalyst.analysis.Analyzer.execute(Analyzer.scala:122)
	at org.apache.spark.sql.catalyst.rules.RuleExecutor.$anonfun$executeAndTrack$1(RuleExecutor.scala:98)
	at org.apache.spark.sql.catalyst.QueryPlanningTracker$.withTracker(QueryPlanningTracker.scala:88)
	at org.apache.spark.sql.catalyst.rules.RuleExecutor.executeAndTrack(RuleExecutor.scala:98)
	at org.apache.spark.sql.catalyst.analysis.Analyzer.$anonfun$executeAndCheck$1(Analyzer.scala:146)
	at org.apache.spark.sql.catalyst.plans.logical.AnalysisHelper$.markInAnalyzer(AnalysisHelper.scala:201)
	at org.apache.spark.sql.catalyst.analysis.Analyzer.executeAndCheck(Analyzer.scala:145)
	at org.apache.spark.sql.hive.test.TestHiveQueryExecution.analyzed$lzycompute(TestHive.scala:606)
	at org.apache.spark.sql.hive.test.TestHiveQueryExecution.analyzed(TestHive.scala:589)
	at org.apache.spark.sql.execution.QueryExecution.assertAnalyzed(QueryExecution.scala:58)
	at org.apache.spark.sql.Dataset$.ofRows(Dataset.scala:87)
	at org.apache.spark.sql.SparkSession.table(SparkSession.scala:589)
	at org.apache.spark.sql.execution.command.DropTableCommand.run(ddl.scala:241)
	at org.apache.spark.sql.execution.command.ExecutedCommandExec.sideEffectResult$lzycompute(commands.scala:70)
	at org.apache.spark.sql.execution.command.ExecutedCommandExec.sideEffectResult(commands.scala:68)
	at org.apache.spark.sql.execution.command.ExecutedCommandExec.executeCollect(commands.scala:79)
	at org.apache.spark.sql.Dataset.$anonfun$logicalPlan$1(Dataset.scala:226)
	at org.apache.spark.sql.Dataset.$anonfun$withAction$1(Dataset.scala:3478)
	at org.apache.spark.sql.execution.SQLExecution$.$anonfun$withNewExecutionId$4(SQLExecution.scala:100)
	at org.apache.spark.sql.execution.SQLExecution$.withSQLConfPropagated(SQLExecution.scala:160)
	at org.apache.spark.sql.execution.SQLExecution$.withNewExecutionId(SQLExecution.scala:87)
	at org.apache.spark.sql.Dataset.withAction(Dataset.scala:3474)
	at org.apache.spark.sql.Dataset.<init>(Dataset.scala:226)
	at org.apache.spark.sql.Dataset$.ofRows(Dataset.scala:88)
	at org.apache.spark.sql.hive.test.TestHiveSparkSession.sql(TestHive.scala:238)
	at org.apache.spark.sql.test.SQLTestUtilsBase.$anonfun$withTable$2(SQLTestUtils.scala:291)
	at scala.collection.IndexedSeqOptimized.foreach(IndexedSeqOptimized.scala:36)
	at scala.collection.IndexedSeqOptimized.foreach$(IndexedSeqOptimized.scala:33)
	at scala.collection.mutable.WrappedArray.foreach(WrappedArray.scala:38)
	at org.apache.spark.sql.test.SQLTestUtilsBase.$anonfun$withTable$1(SQLTestUtils.scala:290)
	at org.apache.spark.util.Utils$.tryWithSafeFinally(Utils.scala:1386)
	at org.apache.spark.sql.test.SQLTestUtilsBase.withTable(SQLTestUtils.scala:290)
	at org.apache.spark.sql.test.SQLTestUtilsBase.withTable$(SQLTestUtils.scala:288)
	at org.apache.spark.sql.execution.datasources.parquet.ParquetCompatibilityTest.withTable(ParquetCompatibilityTest.scala:35)
	at org.apache.spark.sql.hive.ParquetHiveCompatibilitySuite.testParquetHiveCompatibility(ParquetHiveCompatibilitySuite.scala:47)
	at org.apache.spark.sql.hive.ParquetHiveCompatibilitySuite.$anonfun$new$6(ParquetHiveCompatibilitySuite.scala:136)
	at scala.runtime.java8.JFunction0$mcV$sp.apply(JFunction0$mcV$sp.java:23)
	at org.scalatest.OutcomeOf.outcomeOf(OutcomeOf.scala:85)
	at org.scalatest.OutcomeOf.outcomeOf$(OutcomeOf.scala:83)
	at org.scalatest.OutcomeOf$.outcomeOf(OutcomeOf.scala:104)
	at org.scalatest.Transformer.apply(Transformer.scala:22)
	at org.scalatest.Transformer.apply(Transformer.scala:20)
	at org.scalatest.FunSuiteLike$$anon$1.apply(FunSuiteLike.scala:186)
	at org.apache.spark.SparkFunSuite.withFixture(SparkFunSuite.scala:149)
	at org.scalatest.FunSuiteLike.invokeWithFixture$1(FunSuiteLike.scala:184)
	at org.scalatest.FunSuiteLike.$anonfun$runTest$1(FunSuiteLike.scala:196)
	at org.scalatest.SuperEngine.runTestImpl(Engine.scala:286)
	at org.scalatest.FunSuiteLike.runTest(FunSuiteLike.scala:196)
	at org.scalatest.FunSuiteLike.runTest$(FunSuiteLike.scala:178)
	at org.apache.spark.SparkFunSuite.org$scalatest$BeforeAndAfterEach$$super$runTest(SparkFunSuite.scala:56)
	at org.scalatest.BeforeAndAfterEach.runTest(BeforeAndAfterEach.scala:221)
	at org.scalatest.BeforeAndAfterEach.runTest$(BeforeAndAfterEach.scala:214)
	at org.apache.spark.SparkFunSuite.runTest(SparkFunSuite.scala:56)
	at org.scalatest.FunSuiteLike.$anonfun$runTests$1(FunSuiteLike.scala:229)
	at org.scalatest.SuperEngine.$anonfun$runTestsInBranch$1(Engine.scala:393)
	at scala.collection.immutable.List.foreach(List.scala:392)
	at org.scalatest.SuperEngine.traverseSubNodes$1(Engine.scala:381)
	at org.scalatest.SuperEngine.runTestsInBranch(Engine.scala:376)
	at org.scalatest.SuperEngine.runTestsImpl(Engine.scala:458)
	at org.scalatest.FunSuiteLike.runTests(FunSuiteLike.scala:229)
	at org.scalatest.FunSuiteLike.runTests$(FunSuiteLike.scala:228)
	at org.scalatest.FunSuite.runTests(FunSuite.scala:1560)
	at org.scalatest.Suite.run(Suite.scala:1124)
	at org.scalatest.Suite.run$(Suite.scala:1106)
	at org.scalatest.FunSuite.org$scalatest$FunSuiteLike$$super$run(FunSuite.scala:1560)
	at org.scalatest.FunSuiteLike.$anonfun$run$1(FunSuiteLike.scala:233)
	at org.scalatest.SuperEngine.runImpl(Engine.scala:518)
	at org.scalatest.FunSuiteLike.run(FunSuiteLike.scala:233)
	at org.scalatest.FunSuiteLike.run$(FunSuiteLike.scala:232)
	at org.apache.spark.SparkFunSuite.org$scalatest$BeforeAndAfterAll$$super$run(SparkFunSuite.scala:56)
	at org.scalatest.BeforeAndAfterAll.liftedTree1$1(BeforeAndAfterAll.scala:213)
	at org.scalatest.BeforeAndAfterAll.run(BeforeAndAfterAll.scala:210)
	at org.scalatest.BeforeAndAfterAll.run$(BeforeAndAfterAll.scala:208)
	at org.apache.spark.SparkFunSuite.run(SparkFunSuite.scala:56)
	at org.scalatest.tools.Framework.org$scalatest$tools$Framework$$runSuite(Framework.scala:317)
	at org.scalatest.tools.Framework$ScalaTestTask.execute(Framework.scala:510)
	at sbt.ForkMain$Run$2.call(ForkMain.java:296)
	at sbt.ForkMain$Run$2.call(ForkMain.java:286)
	at java.util.concurrent.FutureTask.run(FutureTask.java:266)
	at java.util.concurrent.ThreadPoolExecutor.runWorker(ThreadPoolExecutor.java:1149)
	at java.util.concurrent.ThreadPoolExecutor$Worker.run(ThreadPoolExecutor.java:624)
	at java.lang.Thread.run(Thread.java:748)
[info] - struct (1 second, 582 milliseconds)
07:57:05.786 WARN org.apache.spark.sql.execution.command.DropTableCommand: org.apache.spark.sql.AnalysisException: Path does not exist: file:/home/jenkins/workspace/NewSparkPullRequestBuilder/target/tmp/spark-8684dd14-c966-4659-8418-72f3d0272764;
org.apache.spark.sql.AnalysisException: Path does not exist: file:/home/jenkins/workspace/NewSparkPullRequestBuilder/target/tmp/spark-8684dd14-c966-4659-8418-72f3d0272764;
	at org.apache.spark.sql.execution.datasources.DataSource$.$anonfun$checkAndGlobPathIfNecessary$1(DataSource.scala:759)
	at scala.collection.TraversableLike.$anonfun$flatMap$1(TraversableLike.scala:245)
	at scala.collection.immutable.List.foreach(List.scala:392)
	at scala.collection.TraversableLike.flatMap(TraversableLike.scala:245)
	at scala.collection.TraversableLike.flatMap$(TraversableLike.scala:242)
	at scala.collection.immutable.List.flatMap(List.scala:355)
	at org.apache.spark.sql.execution.datasources.DataSource$.checkAndGlobPathIfNecessary(DataSource.scala:746)
	at org.apache.spark.sql.execution.datasources.DataSource.checkAndGlobPathIfNecessary(DataSource.scala:575)
	at org.apache.spark.sql.execution.datasources.DataSource.resolveRelation(DataSource.scala:398)
	at org.apache.spark.sql.hive.HiveMetastoreCatalog.$anonfun$convertToLogicalRelation$5(HiveMetastoreCatalog.scala:248)
	at scala.Option.getOrElse(Option.scala:189)
	at org.apache.spark.sql.hive.HiveMetastoreCatalog.$anonfun$convertToLogicalRelation$4(HiveMetastoreCatalog.scala:238)
	at org.apache.spark.sql.hive.HiveMetastoreCatalog.withTableCreationLock(HiveMetastoreCatalog.scala:58)
	at org.apache.spark.sql.hive.HiveMetastoreCatalog.convertToLogicalRelation(HiveMetastoreCatalog.scala:231)
	at org.apache.spark.sql.hive.HiveMetastoreCatalog.convert(HiveMetastoreCatalog.scala:137)
	at org.apache.spark.sql.hive.RelationConversions$$anonfun$apply$4.applyOrElse(HiveStrategies.scala:220)
	at org.apache.spark.sql.hive.RelationConversions$$anonfun$apply$4.applyOrElse(HiveStrategies.scala:207)
	at org.apache.spark.sql.catalyst.plans.logical.AnalysisHelper.$anonfun$resolveOperatorsDown$2(AnalysisHelper.scala:108)
	at org.apache.spark.sql.catalyst.trees.CurrentOrigin$.withOrigin(TreeNode.scala:72)
	at org.apache.spark.sql.catalyst.plans.logical.AnalysisHelper.$anonfun$resolveOperatorsDown$1(AnalysisHelper.scala:108)
	at org.apache.spark.sql.catalyst.plans.logical.AnalysisHelper$.allowInvokingTransformsInAnalyzer(AnalysisHelper.scala:194)
	at org.apache.spark.sql.catalyst.plans.logical.AnalysisHelper.resolveOperatorsDown(AnalysisHelper.scala:106)
	at org.apache.spark.sql.catalyst.plans.logical.AnalysisHelper.resolveOperatorsDown$(AnalysisHelper.scala:104)
	at org.apache.spark.sql.catalyst.plans.logical.LogicalPlan.resolveOperatorsDown(LogicalPlan.scala:29)
	at org.apache.spark.sql.catalyst.plans.logical.AnalysisHelper.$anonfun$resolveOperatorsDown$4(AnalysisHelper.scala:113)
	at org.apache.spark.sql.catalyst.trees.TreeNode.$anonfun$mapChildren$1(TreeNode.scala:376)
	at org.apache.spark.sql.catalyst.trees.TreeNode.mapProductIterator(TreeNode.scala:214)
	at org.apache.spark.sql.catalyst.trees.TreeNode.mapChildren(TreeNode.scala:374)
	at org.apache.spark.sql.catalyst.trees.TreeNode.mapChildren(TreeNode.scala:327)
	at org.apache.spark.sql.catalyst.plans.logical.AnalysisHelper.$anonfun$resolveOperatorsDown$1(AnalysisHelper.scala:113)
	at org.apache.spark.sql.catalyst.plans.logical.AnalysisHelper$.allowInvokingTransformsInAnalyzer(AnalysisHelper.scala:194)
	at org.apache.spark.sql.catalyst.plans.logical.AnalysisHelper.resolveOperatorsDown(AnalysisHelper.scala:106)
	at org.apache.spark.sql.catalyst.plans.logical.AnalysisHelper.resolveOperatorsDown$(AnalysisHelper.scala:104)
	at org.apache.spark.sql.catalyst.plans.logical.LogicalPlan.resolveOperatorsDown(LogicalPlan.scala:29)
	at org.apache.spark.sql.catalyst.plans.logical.AnalysisHelper.resolveOperators(AnalysisHelper.scala:73)
	at org.apache.spark.sql.catalyst.plans.logical.AnalysisHelper.resolveOperators$(AnalysisHelper.scala:72)
	at org.apache.spark.sql.catalyst.plans.logical.LogicalPlan.resolveOperators(LogicalPlan.scala:29)
	at org.apache.spark.sql.hive.RelationConversions.apply(HiveStrategies.scala:207)
	at org.apache.spark.sql.hive.RelationConversions.apply(HiveStrategies.scala:191)
	at org.apache.spark.sql.catalyst.rules.RuleExecutor.$anonfun$execute$2(RuleExecutor.scala:130)
	at scala.collection.IndexedSeqOptimized.foldLeft(IndexedSeqOptimized.scala:60)
	at scala.collection.IndexedSeqOptimized.foldLeft$(IndexedSeqOptimized.scala:68)
	at scala.collection.mutable.ArrayBuffer.foldLeft(ArrayBuffer.scala:49)
	at org.apache.spark.sql.catalyst.rules.RuleExecutor.$anonfun$execute$1(RuleExecutor.scala:127)
	at org.apache.spark.sql.catalyst.rules.RuleExecutor.$anonfun$execute$1$adapted(RuleExecutor.scala:119)
	at scala.collection.immutable.List.foreach(List.scala:392)
	at org.apache.spark.sql.catalyst.rules.RuleExecutor.execute(RuleExecutor.scala:119)
	at org.apache.spark.sql.catalyst.analysis.Analyzer.org$apache$spark$sql$catalyst$analysis$Analyzer$$executeSameContext(Analyzer.scala:168)
	at org.apache.spark.sql.catalyst.analysis.Analyzer.execute(Analyzer.scala:162)
	at org.apache.spark.sql.catalyst.analysis.Analyzer.execute(Analyzer.scala:122)
	at org.apache.spark.sql.catalyst.rules.RuleExecutor.$anonfun$executeAndTrack$1(RuleExecutor.scala:98)
	at org.apache.spark.sql.catalyst.QueryPlanningTracker$.withTracker(QueryPlanningTracker.scala:88)
	at org.apache.spark.sql.catalyst.rules.RuleExecutor.executeAndTrack(RuleExecutor.scala:98)
	at org.apache.spark.sql.catalyst.analysis.Analyzer.$anonfun$executeAndCheck$1(Analyzer.scala:146)
	at org.apache.spark.sql.catalyst.plans.logical.AnalysisHelper$.markInAnalyzer(AnalysisHelper.scala:201)
	at org.apache.spark.sql.catalyst.analysis.Analyzer.executeAndCheck(Analyzer.scala:145)
	at org.apache.spark.sql.hive.test.TestHiveQueryExecution.analyzed$lzycompute(TestHive.scala:606)
	at org.apache.spark.sql.hive.test.TestHiveQueryExecution.analyzed(TestHive.scala:589)
	at org.apache.spark.sql.execution.QueryExecution.assertAnalyzed(QueryExecution.scala:58)
	at org.apache.spark.sql.Dataset$.ofRows(Dataset.scala:87)
	at org.apache.spark.sql.SparkSession.table(SparkSession.scala:589)
	at org.apache.spark.sql.execution.command.DropTableCommand.run(ddl.scala:241)
	at org.apache.spark.sql.execution.command.ExecutedCommandExec.sideEffectResult$lzycompute(commands.scala:70)
	at org.apache.spark.sql.execution.command.ExecutedCommandExec.sideEffectResult(commands.scala:68)
	at org.apache.spark.sql.execution.command.ExecutedCommandExec.executeCollect(commands.scala:79)
	at org.apache.spark.sql.Dataset.$anonfun$logicalPlan$1(Dataset.scala:226)
	at org.apache.spark.sql.Dataset.$anonfun$withAction$1(Dataset.scala:3478)
	at org.apache.spark.sql.execution.SQLExecution$.$anonfun$withNewExecutionId$4(SQLExecution.scala:100)
	at org.apache.spark.sql.execution.SQLExecution$.withSQLConfPropagated(SQLExecution.scala:160)
	at org.apache.spark.sql.execution.SQLExecution$.withNewExecutionId(SQLExecution.scala:87)
	at org.apache.spark.sql.Dataset.withAction(Dataset.scala:3474)
	at org.apache.spark.sql.Dataset.<init>(Dataset.scala:226)
	at org.apache.spark.sql.Dataset$.ofRows(Dataset.scala:88)
	at org.apache.spark.sql.hive.test.TestHiveSparkSession.sql(TestHive.scala:238)
	at org.apache.spark.sql.test.SQLTestUtilsBase.$anonfun$withTable$2(SQLTestUtils.scala:291)
	at scala.collection.IndexedSeqOptimized.foreach(IndexedSeqOptimized.scala:36)
	at scala.collection.IndexedSeqOptimized.foreach$(IndexedSeqOptimized.scala:33)
	at scala.collection.mutable.WrappedArray.foreach(WrappedArray.scala:38)
	at org.apache.spark.sql.test.SQLTestUtilsBase.$anonfun$withTable$1(SQLTestUtils.scala:290)
	at org.apache.spark.util.Utils$.tryWithSafeFinally(Utils.scala:1386)
	at org.apache.spark.sql.test.SQLTestUtilsBase.withTable(SQLTestUtils.scala:290)
	at org.apache.spark.sql.test.SQLTestUtilsBase.withTable$(SQLTestUtils.scala:288)
	at org.apache.spark.sql.execution.datasources.parquet.ParquetCompatibilityTest.withTable(ParquetCompatibilityTest.scala:35)
	at org.apache.spark.sql.hive.ParquetHiveCompatibilitySuite.testParquetHiveCompatibility(ParquetHiveCompatibilitySuite.scala:47)
	at org.apache.spark.sql.hive.ParquetHiveCompatibilitySuite.$anonfun$new$7(ParquetHiveCompatibilitySuite.scala:142)
	at scala.runtime.java8.JFunction0$mcV$sp.apply(JFunction0$mcV$sp.java:23)
	at org.scalatest.OutcomeOf.outcomeOf(OutcomeOf.scala:85)
	at org.scalatest.OutcomeOf.outcomeOf$(OutcomeOf.scala:83)
	at org.scalatest.OutcomeOf$.outcomeOf(OutcomeOf.scala:104)
	at org.scalatest.Transformer.apply(Transformer.scala:22)
	at org.scalatest.Transformer.apply(Transformer.scala:20)
	at org.scalatest.FunSuiteLike$$anon$1.apply(FunSuiteLike.scala:186)
	at org.apache.spark.SparkFunSuite.withFixture(SparkFunSuite.scala:149)
	at org.scalatest.FunSuiteLike.invokeWithFixture$1(FunSuiteLike.scala:184)
	at org.scalatest.FunSuiteLike.$anonfun$runTest$1(FunSuiteLike.scala:196)
	at org.scalatest.SuperEngine.runTestImpl(Engine.scala:286)
	at org.scalatest.FunSuiteLike.runTest(FunSuiteLike.scala:196)
	at org.scalatest.FunSuiteLike.runTest$(FunSuiteLike.scala:178)
	at org.apache.spark.SparkFunSuite.org$scalatest$BeforeAndAfterEach$$super$runTest(SparkFunSuite.scala:56)
	at org.scalatest.BeforeAndAfterEach.runTest(BeforeAndAfterEach.scala:221)
	at org.scalatest.BeforeAndAfterEach.runTest$(BeforeAndAfterEach.scala:214)
	at org.apache.spark.SparkFunSuite.runTest(SparkFunSuite.scala:56)
	at org.scalatest.FunSuiteLike.$anonfun$runTests$1(FunSuiteLike.scala:229)
	at org.scalatest.SuperEngine.$anonfun$runTestsInBranch$1(Engine.scala:393)
	at scala.collection.immutable.List.foreach(List.scala:392)
	at org.scalatest.SuperEngine.traverseSubNodes$1(Engine.scala:381)
	at org.scalatest.SuperEngine.runTestsInBranch(Engine.scala:376)
	at org.scalatest.SuperEngine.runTestsImpl(Engine.scala:458)
	at org.scalatest.FunSuiteLike.runTests(FunSuiteLike.scala:229)
	at org.scalatest.FunSuiteLike.runTests$(FunSuiteLike.scala:228)
	at org.scalatest.FunSuite.runTests(FunSuite.scala:1560)
	at org.scalatest.Suite.run(Suite.scala:1124)
	at org.scalatest.Suite.run$(Suite.scala:1106)
	at org.scalatest.FunSuite.org$scalatest$FunSuiteLike$$super$run(FunSuite.scala:1560)
	at org.scalatest.FunSuiteLike.$anonfun$run$1(FunSuiteLike.scala:233)
	at org.scalatest.SuperEngine.runImpl(Engine.scala:518)
	at org.scalatest.FunSuiteLike.run(FunSuiteLike.scala:233)
	at org.scalatest.FunSuiteLike.run$(FunSuiteLike.scala:232)
	at org.apache.spark.SparkFunSuite.org$scalatest$BeforeAndAfterAll$$super$run(SparkFunSuite.scala:56)
	at org.scalatest.BeforeAndAfterAll.liftedTree1$1(BeforeAndAfterAll.scala:213)
	at org.scalatest.BeforeAndAfterAll.run(BeforeAndAfterAll.scala:210)
	at org.scalatest.BeforeAndAfterAll.run$(BeforeAndAfterAll.scala:208)
	at org.apache.spark.SparkFunSuite.run(SparkFunSuite.scala:56)
	at org.scalatest.tools.Framework.org$scalatest$tools$Framework$$runSuite(Framework.scala:317)
	at org.scalatest.tools.Framework$ScalaTestTask.execute(Framework.scala:510)
	at sbt.ForkMain$Run$2.call(ForkMain.java:296)
	at sbt.ForkMain$Run$2.call(ForkMain.java:286)
	at java.util.concurrent.FutureTask.run(FutureTask.java:266)
	at java.util.concurrent.ThreadPoolExecutor.runWorker(ThreadPoolExecutor.java:1149)
	at java.util.concurrent.ThreadPoolExecutor$Worker.run(ThreadPoolExecutor.java:624)
	at java.lang.Thread.run(Thread.java:748)
[info] - SPARK-16344: array of struct with a single field named 'array_element' (1 second, 566 milliseconds)
07:57:05.925 WARN org.apache.hadoop.hive.conf.HiveConf: HiveConf of name hive.internal.ss.authz.settings.applied.marker does not exist
07:57:05.925 WARN org.apache.hadoop.hive.conf.HiveConf: HiveConf of name hive.stats.jdbc.timeout does not exist
07:57:05.925 WARN org.apache.hadoop.hive.conf.HiveConf: HiveConf of name hive.stats.retries.wait does not exist
07:57:06.031 WARN org.apache.hadoop.hive.conf.HiveConf: HiveConf of name hive.internal.ss.authz.settings.applied.marker does not exist
07:57:06.031 WARN org.apache.hadoop.hive.conf.HiveConf: HiveConf of name hive.stats.jdbc.timeout does not exist
07:57:06.031 WARN org.apache.hadoop.hive.conf.HiveConf: HiveConf of name hive.stats.retries.wait does not exist
[info] Test run started
[info] Test org.apache.spark.sql.hive.JavaDataFrameSuite.testUDAF started
[info] - subquery/exists-subquery/exists-joins-and-set-ops.sql (48 seconds, 80 milliseconds)
[info] Test org.apache.spark.sql.hive.JavaDataFrameSuite.saveTableAndQueryIt started
[info] - subquery/exists-subquery/exists-cte.sql (1 second, 908 milliseconds)
[info] Test run finished: 0 failed, 0 ignored, 2 total, 2.742s
[info] Test run started
[info] Test org.apache.spark.sql.hive.JavaMetastoreDataSourcesSuite.saveTableAndQueryIt started
07:57:09.306 WARN org.apache.spark.sql.hive.test.TestHiveExternalCatalog: Couldn't find corresponding Hive SerDe for data source provider org.apache.spark.sql.json. Persisting data source table `default`.`javasavedtable` into Hive metastore in Spark SQL specific format, which is NOT compatible with Hive.
[info] - subquery/exists-subquery/exists-within-and-or.sql (859 milliseconds)
[info] Test run finished: 0 failed, 0 ignored, 1 total, 0.68s
07:57:09.812 WARN io.netty.util.concurrent.SingleThreadEventExecutor: An event executor terminated with non-empty task queue (2)
[info] - subquery/exists-subquery/exists-aggregate.sql (6 seconds, 870 milliseconds)
[info] - subquery/exists-subquery/exists-having.sql (2 seconds, 100 milliseconds)
[info] - subquery/in-subquery/not-in-unit-tests-single-column.sql (947 milliseconds)
[info] - subquery/in-subquery/in-with-cte.sql (5 seconds, 629 milliseconds)
[info] - subquery/in-subquery/not-in-unit-tests-single-column-literal.sql (392 milliseconds)
[info] ScalaTest
[info] Run completed in 1 hour, 21 minutes, 24 seconds.
[info] Total number of tests run: 2596
[info] Suites: completed 125, aborted 0
[info] Tests: succeeded 2596, failed 0, canceled 0, ignored 594, pending 0
[info] All tests passed.
[info] Passed: Total 2599, Failed 0, Errors 0, Passed 2599, Ignored 594
[info] - subquery/in-subquery/in-joins.sql (1 minute, 54 seconds)
[info] - subquery/in-subquery/not-in-group-by.sql (6 seconds, 177 milliseconds)
[info] - subquery/in-subquery/not-in-unit-tests-multi-column-literal.sql (321 milliseconds)
[info] - subquery/in-subquery/in-having.sql (3 seconds, 334 milliseconds)
[info] - subquery/in-subquery/in-set-operations.sql !!! IGNORED !!!
[info] - subquery/in-subquery/in-basic.sql (578 milliseconds)
[info] - subquery/in-subquery/in-order-by.sql !!! IGNORED !!!
[info] - subquery/in-subquery/not-in-joins.sql (4 seconds, 286 milliseconds)
[info] - subquery/in-subquery/simple-in.sql !!! IGNORED !!!
[info] - subquery/in-subquery/in-multiple-columns.sql (1 second, 382 milliseconds)
[info] - subquery/in-subquery/in-group-by.sql !!! IGNORED !!!
[info] - subquery/in-subquery/not-in-unit-tests-multi-column.sql (811 milliseconds)
[info] - subquery/in-subquery/in-limit.sql !!! IGNORED !!!
[info] - Check if ThriftServer can work (79 milliseconds)
[info] ScalaTest
[info] Run completed in 1 hour, 23 minutes, 20 seconds.
[info] Total number of tests run: 416
[info] Suites: completed 15, aborted 1
[info] Tests: succeeded 415, failed 1, canceled 0, ignored 17, pending 0
[info] *** 1 SUITE ABORTED ***
[info] *** 1 TEST FAILED ***
[error] Error: Total 417, Failed 1, Errors 1, Passed 415, Ignored 17
[error] Failed tests:
[error] 	org.apache.spark.sql.hive.thriftserver.SparkMetadataOperationSuite
[error] Error during tests:
[error] 	org.apache.spark.sql.hive.thriftserver.ThriftServerWithSparkContextSuite
[error] (hive-thriftserver/test:test) sbt.TestsFailedException: Tests unsuccessful
[error] Total time: 5044 s, completed Dec 20, 2019 7:59:54 AM
[error] running /home/jenkins/workspace/NewSparkPullRequestBuilder/build/sbt -Phadoop-2.7 -Phive-2.3 -Pyarn -Pspark-ganglia-lgpl -Phive -Phive-thriftserver -Phadoop-cloud -Pkubernetes -Pkinesis-asl -Pmesos -Dtest.exclude.tags=org.apache.spark.tags.ExtendedHiveTest,org.apache.spark.tags.ExtendedYarnTest test ; received return code 1
Attempting to post to Github...
 > Post successful.
Build step 'Execute shell' marked build as failure
Archiving artifacts
Recording test results
Finished: FAILURE