FailedConsole Output

Skipping 20,429 KB.. Full Log
he.spark.sql.hive.orc.OrcFileFormat.$anonfun$buildReader$2(OrcFileFormat.scala:163)
	at org.apache.spark.sql.execution.datasources.FileFormat$$anon$1.apply(FileFormat.scala:147)
	at org.apache.spark.sql.execution.datasources.FileFormat$$anon$1.apply(FileFormat.scala:132)
	at org.apache.spark.sql.execution.datasources.FileScanRDD$$anon$1.org$apache$spark$sql$execution$datasources$FileScanRDD$$anon$$readCurrentFile(FileScanRDD.scala:116)
	at org.apache.spark.sql.execution.datasources.FileScanRDD$$anon$1$$anon$2.internalIter$lzycompute(FileScanRDD.scala:141)
	at org.apache.spark.sql.execution.datasources.FileScanRDD$$anon$1$$anon$2.internalIter(FileScanRDD.scala:141)
	at org.apache.spark.sql.execution.datasources.FileScanRDD$$anon$1$$anon$2.getNext(FileScanRDD.scala:145)
	at org.apache.spark.util.NextIterator.hasNext(NextIterator.scala:73)
	at org.apache.spark.sql.execution.datasources.FileScanRDD$$anon$1.hasNext(FileScanRDD.scala:93)
	at org.apache.spark.sql.execution.datasources.FileScanRDD$$anon$1.nextIterator(FileScanRDD.scala:173)
	at org.apache.spark.sql.execution.datasources.FileScanRDD$$anon$1.hasNext(FileScanRDD.scala:93)
	at org.apache.spark.sql.execution.datasources.FileScanRDD$$anon$1.nextIterator(FileScanRDD.scala:173)
	at org.apache.spark.sql.execution.datasources.FileScanRDD$$anon$1.hasNext(FileScanRDD.scala:93)
	at scala.collection.Iterator$$anon$10.hasNext(Iterator.scala:458)
	at org.apache.spark.sql.catalyst.expressions.GeneratedClass$GeneratedIteratorForCodegenStage1.agg_doAggregateWithoutKey_0$(generated.java:33)
	at org.apache.spark.sql.catalyst.expressions.GeneratedClass$GeneratedIteratorForCodegenStage1.processNext(generated.java:63)
	at org.apache.spark.sql.execution.BufferedRowIterator.hasNext(BufferedRowIterator.java:43)
	at org.apache.spark.sql.execution.WholeStageCodegenExec$$anon$1.hasNext(WholeStageCodegenExec.scala:726)
	at scala.collection.Iterator$$anon$10.hasNext(Iterator.scala:458)
	at org.apache.spark.shuffle.sort.BypassMergeSortShuffleWriter.write(BypassMergeSortShuffleWriter.java:132)
	at org.apache.spark.shuffle.ShuffleWriteProcessor.write(ShuffleWriteProcessor.scala:59)
	at org.apache.spark.scheduler.ShuffleMapTask.runTask(ShuffleMapTask.scala:99)
	at org.apache.spark.scheduler.ShuffleMapTask.runTask(ShuffleMapTask.scala:52)
	at org.apache.spark.scheduler.Task.run(Task.scala:127)
	at org.apache.spark.executor.Executor$TaskRunner.$anonfun$run$3(Executor.scala:441)
	at org.apache.spark.util.Utils$.tryWithSafeFinally(Utils.scala:1377)
	at org.apache.spark.executor.Executor$TaskRunner.run(Executor.scala:444)
	at java.util.concurrent.ThreadPoolExecutor.runWorker(ThreadPoolExecutor.java:1149)
	at java.util.concurrent.ThreadPoolExecutor$Worker.run(ThreadPoolExecutor.java:624)
	at java.lang.Thread.run(Thread.java:748)
08:46:59.158 ERROR org.apache.spark.executor.Executor: Exception in task 0.0 in stage 11870.0 (TID 21688)
org.apache.spark.SparkException: Could not read footer for file: file:/home/jenkins/workspace/NewSparkPullRequestBuilder/target/tmp/spark-099e3c0a-4dd3-45d3-81b6-2438a3e2bee6/third/part-00000-93340ba3-e0ea-4396-9641-d6d1bb822178-c000.json
	at org.apache.spark.sql.hive.orc.OrcFileOperator$.$anonfun$getFileReader$3(OrcFileOperator.scala:83)
	at scala.collection.Iterator$$anon$10.next(Iterator.scala:459)
	at scala.collection.TraversableOnce.collectFirst(TraversableOnce.scala:148)
	at scala.collection.TraversableOnce.collectFirst$(TraversableOnce.scala:135)
	at scala.collection.AbstractIterator.collectFirst(Iterator.scala:1429)
	at org.apache.spark.sql.hive.orc.OrcFileOperator$.getFileReader(OrcFileOperator.scala:87)
	at org.apache.spark.sql.hive.orc.OrcFileOperator$.$anonfun$readSchema$1(OrcFileOperator.scala:96)
	at scala.collection.Iterator$$anon$10.next(Iterator.scala:459)
	at scala.collection.TraversableOnce.collectFirst(TraversableOnce.scala:148)
	at scala.collection.TraversableOnce.collectFirst$(TraversableOnce.scala:135)
	at scala.collection.AbstractIterator.collectFirst(Iterator.scala:1429)
	at org.apache.spark.sql.hive.orc.OrcFileOperator$.readSchema(OrcFileOperator.scala:96)
	at org.apache.spark.sql.hive.orc.OrcFileFormat.$anonfun$buildReader$2(OrcFileFormat.scala:163)
	at org.apache.spark.sql.execution.datasources.FileFormat$$anon$1.apply(FileFormat.scala:147)
	at org.apache.spark.sql.execution.datasources.FileFormat$$anon$1.apply(FileFormat.scala:132)
	at org.apache.spark.sql.execution.datasources.FileScanRDD$$anon$1.org$apache$spark$sql$execution$datasources$FileScanRDD$$anon$$readCurrentFile(FileScanRDD.scala:116)
	at org.apache.spark.sql.execution.datasources.FileScanRDD$$anon$1.nextIterator(FileScanRDD.scala:169)
	at org.apache.spark.sql.execution.datasources.FileScanRDD$$anon$1.hasNext(FileScanRDD.scala:93)
	at scala.collection.Iterator$$anon$10.hasNext(Iterator.scala:458)
	at scala.collection.Iterator$$anon$10.hasNext(Iterator.scala:458)
	at scala.collection.Iterator$$anon$10.hasNext(Iterator.scala:458)
	at org.apache.spark.util.Utils$.getIteratorSize(Utils.scala:1804)
	at org.apache.spark.rdd.RDD.$anonfun$count$1(RDD.scala:1227)
	at org.apache.spark.rdd.RDD.$anonfun$count$1$adapted(RDD.scala:1227)
	at org.apache.spark.SparkContext.$anonfun$runJob$5(SparkContext.scala:2156)
	at org.apache.spark.scheduler.ResultTask.runTask(ResultTask.scala:90)
	at org.apache.spark.scheduler.Task.run(Task.scala:127)
	at org.apache.spark.executor.Executor$TaskRunner.$anonfun$run$3(Executor.scala:441)
	at org.apache.spark.util.Utils$.tryWithSafeFinally(Utils.scala:1377)
	at org.apache.spark.executor.Executor$TaskRunner.run(Executor.scala:444)
	at java.util.concurrent.ThreadPoolExecutor.runWorker(ThreadPoolExecutor.java:1149)
	at java.util.concurrent.ThreadPoolExecutor$Worker.run(ThreadPoolExecutor.java:624)
	at java.lang.Thread.run(Thread.java:748)
Caused by: org.apache.orc.FileFormatException: Malformed ORC file file:/home/jenkins/workspace/NewSparkPullRequestBuilder/target/tmp/spark-099e3c0a-4dd3-45d3-81b6-2438a3e2bee6/third/part-00000-93340ba3-e0ea-4396-9641-d6d1bb822178-c000.json. Invalid postscript.
	at org.apache.orc.impl.ReaderImpl.ensureOrcFooter(ReaderImpl.java:274)
	at org.apache.orc.impl.ReaderImpl.extractFileTail(ReaderImpl.java:581)
	at org.apache.orc.impl.ReaderImpl.<init>(ReaderImpl.java:369)
	at org.apache.hadoop.hive.ql.io.orc.ReaderImpl.<init>(ReaderImpl.java:63)
	at org.apache.hadoop.hive.ql.io.orc.OrcFile.createReader(OrcFile.java:55)
	at org.apache.spark.sql.hive.orc.OrcFileOperator$.$anonfun$getFileReader$3(OrcFileOperator.scala:76)
	... 32 more
08:46:59.162 WARN org.apache.spark.scheduler.TaskSetManager: Lost task 0.0 in stage 11870.0 (TID 21688, amp-jenkins-worker-02.amp, executor driver): org.apache.spark.SparkException: Could not read footer for file: file:/home/jenkins/workspace/NewSparkPullRequestBuilder/target/tmp/spark-099e3c0a-4dd3-45d3-81b6-2438a3e2bee6/third/part-00000-93340ba3-e0ea-4396-9641-d6d1bb822178-c000.json
	at org.apache.spark.sql.hive.orc.OrcFileOperator$.$anonfun$getFileReader$3(OrcFileOperator.scala:83)
	at scala.collection.Iterator$$anon$10.next(Iterator.scala:459)
	at scala.collection.TraversableOnce.collectFirst(TraversableOnce.scala:148)
	at scala.collection.TraversableOnce.collectFirst$(TraversableOnce.scala:135)
	at scala.collection.AbstractIterator.collectFirst(Iterator.scala:1429)
	at org.apache.spark.sql.hive.orc.OrcFileOperator$.getFileReader(OrcFileOperator.scala:87)
	at org.apache.spark.sql.hive.orc.OrcFileOperator$.$anonfun$readSchema$1(OrcFileOperator.scala:96)
	at scala.collection.Iterator$$anon$10.next(Iterator.scala:459)
	at scala.collection.TraversableOnce.collectFirst(TraversableOnce.scala:148)
	at scala.collection.TraversableOnce.collectFirst$(TraversableOnce.scala:135)
	at scala.collection.AbstractIterator.collectFirst(Iterator.scala:1429)
	at org.apache.spark.sql.hive.orc.OrcFileOperator$.readSchema(OrcFileOperator.scala:96)
	at org.apache.spark.sql.hive.orc.OrcFileFormat.$anonfun$buildReader$2(OrcFileFormat.scala:163)
	at org.apache.spark.sql.execution.datasources.FileFormat$$anon$1.apply(FileFormat.scala:147)
	at org.apache.spark.sql.execution.datasources.FileFormat$$anon$1.apply(FileFormat.scala:132)
	at org.apache.spark.sql.execution.datasources.FileScanRDD$$anon$1.org$apache$spark$sql$execution$datasources$FileScanRDD$$anon$$readCurrentFile(FileScanRDD.scala:116)
	at org.apache.spark.sql.execution.datasources.FileScanRDD$$anon$1.nextIterator(FileScanRDD.scala:169)
	at org.apache.spark.sql.execution.datasources.FileScanRDD$$anon$1.hasNext(FileScanRDD.scala:93)
	at scala.collection.Iterator$$anon$10.hasNext(Iterator.scala:458)
	at scala.collection.Iterator$$anon$10.hasNext(Iterator.scala:458)
	at scala.collection.Iterator$$anon$10.hasNext(Iterator.scala:458)
	at org.apache.spark.util.Utils$.getIteratorSize(Utils.scala:1804)
	at org.apache.spark.rdd.RDD.$anonfun$count$1(RDD.scala:1227)
	at org.apache.spark.rdd.RDD.$anonfun$count$1$adapted(RDD.scala:1227)
	at org.apache.spark.SparkContext.$anonfun$runJob$5(SparkContext.scala:2156)
	at org.apache.spark.scheduler.ResultTask.runTask(ResultTask.scala:90)
	at org.apache.spark.scheduler.Task.run(Task.scala:127)
	at org.apache.spark.executor.Executor$TaskRunner.$anonfun$run$3(Executor.scala:441)
	at org.apache.spark.util.Utils$.tryWithSafeFinally(Utils.scala:1377)
	at org.apache.spark.executor.Executor$TaskRunner.run(Executor.scala:444)
	at java.util.concurrent.ThreadPoolExecutor.runWorker(ThreadPoolExecutor.java:1149)
	at java.util.concurrent.ThreadPoolExecutor$Worker.run(ThreadPoolExecutor.java:624)
	at java.lang.Thread.run(Thread.java:748)
Caused by: org.apache.orc.FileFormatException: Malformed ORC file file:/home/jenkins/workspace/NewSparkPullRequestBuilder/target/tmp/spark-099e3c0a-4dd3-45d3-81b6-2438a3e2bee6/third/part-00000-93340ba3-e0ea-4396-9641-d6d1bb822178-c000.json. Invalid postscript.
	at org.apache.orc.impl.ReaderImpl.ensureOrcFooter(ReaderImpl.java:274)
	at org.apache.orc.impl.ReaderImpl.extractFileTail(ReaderImpl.java:581)
	at org.apache.orc.impl.ReaderImpl.<init>(ReaderImpl.java:369)
	at org.apache.hadoop.hive.ql.io.orc.ReaderImpl.<init>(ReaderImpl.java:63)
	at org.apache.hadoop.hive.ql.io.orc.OrcFile.createReader(OrcFile.java:55)
	at org.apache.spark.sql.hive.orc.OrcFileOperator$.$anonfun$getFileReader$3(OrcFileOperator.scala:76)
	... 32 more

08:46:59.162 ERROR org.apache.spark.scheduler.TaskSetManager: Task 0 in stage 11870.0 failed 1 times; aborting job
08:47:00.013 ERROR org.apache.spark.executor.Executor: Exception in task 0.0 in stage 11874.0 (TID 21692)
org.apache.spark.SparkException: Could not read footer for file: file:/home/jenkins/workspace/NewSparkPullRequestBuilder/target/tmp/spark-dc0c890d-22f2-4ee4-a5fb-6b8fbd305fa9/third/part-00000-55e5f88c-47c8-4564-841d-e564a2390c13-c000.json
	at org.apache.spark.sql.hive.orc.OrcFileOperator$.$anonfun$getFileReader$3(OrcFileOperator.scala:83)
	at scala.collection.Iterator$$anon$10.next(Iterator.scala:459)
	at scala.collection.TraversableOnce.collectFirst(TraversableOnce.scala:148)
	at scala.collection.TraversableOnce.collectFirst$(TraversableOnce.scala:135)
	at scala.collection.AbstractIterator.collectFirst(Iterator.scala:1429)
	at org.apache.spark.sql.hive.orc.OrcFileOperator$.getFileReader(OrcFileOperator.scala:87)
	at org.apache.spark.sql.hive.orc.OrcFileOperator$.$anonfun$readSchema$1(OrcFileOperator.scala:96)
	at scala.collection.Iterator$$anon$10.next(Iterator.scala:459)
	at scala.collection.TraversableOnce.collectFirst(TraversableOnce.scala:148)
	at scala.collection.TraversableOnce.collectFirst$(TraversableOnce.scala:135)
	at scala.collection.AbstractIterator.collectFirst(Iterator.scala:1429)
	at org.apache.spark.sql.hive.orc.OrcFileOperator$.readSchema(OrcFileOperator.scala:96)
	at org.apache.spark.sql.hive.orc.OrcFileFormat.$anonfun$buildReader$2(OrcFileFormat.scala:163)
	at org.apache.spark.sql.execution.datasources.FileFormat$$anon$1.apply(FileFormat.scala:147)
	at org.apache.spark.sql.execution.datasources.FileFormat$$anon$1.apply(FileFormat.scala:132)
	at org.apache.spark.sql.execution.datasources.FileScanRDD$$anon$1.org$apache$spark$sql$execution$datasources$FileScanRDD$$anon$$readCurrentFile(FileScanRDD.scala:116)
	at org.apache.spark.sql.execution.datasources.FileScanRDD$$anon$1.nextIterator(FileScanRDD.scala:169)
	at org.apache.spark.sql.execution.datasources.FileScanRDD$$anon$1.hasNext(FileScanRDD.scala:93)
	at scala.collection.Iterator$$anon$10.hasNext(Iterator.scala:458)
	at scala.collection.Iterator$$anon$10.hasNext(Iterator.scala:458)
	at scala.collection.Iterator$$anon$10.hasNext(Iterator.scala:458)
	at org.apache.spark.util.Utils$.getIteratorSize(Utils.scala:1804)
	at org.apache.spark.rdd.RDD.$anonfun$count$1(RDD.scala:1227)
	at org.apache.spark.rdd.RDD.$anonfun$count$1$adapted(RDD.scala:1227)
	at org.apache.spark.SparkContext.$anonfun$runJob$5(SparkContext.scala:2156)
	at org.apache.spark.scheduler.ResultTask.runTask(ResultTask.scala:90)
	at org.apache.spark.scheduler.Task.run(Task.scala:127)
	at org.apache.spark.executor.Executor$TaskRunner.$anonfun$run$3(Executor.scala:441)
	at org.apache.spark.util.Utils$.tryWithSafeFinally(Utils.scala:1377)
	at org.apache.spark.executor.Executor$TaskRunner.run(Executor.scala:444)
	at java.util.concurrent.ThreadPoolExecutor.runWorker(ThreadPoolExecutor.java:1149)
	at java.util.concurrent.ThreadPoolExecutor$Worker.run(ThreadPoolExecutor.java:624)
	at java.lang.Thread.run(Thread.java:748)
Caused by: org.apache.orc.FileFormatException: Malformed ORC file file:/home/jenkins/workspace/NewSparkPullRequestBuilder/target/tmp/spark-dc0c890d-22f2-4ee4-a5fb-6b8fbd305fa9/third/part-00000-55e5f88c-47c8-4564-841d-e564a2390c13-c000.json. Invalid postscript.
	at org.apache.orc.impl.ReaderImpl.ensureOrcFooter(ReaderImpl.java:274)
	at org.apache.orc.impl.ReaderImpl.extractFileTail(ReaderImpl.java:581)
	at org.apache.orc.impl.ReaderImpl.<init>(ReaderImpl.java:369)
	at org.apache.hadoop.hive.ql.io.orc.ReaderImpl.<init>(ReaderImpl.java:63)
	at org.apache.hadoop.hive.ql.io.orc.OrcFile.createReader(OrcFile.java:55)
	at org.apache.spark.sql.hive.orc.OrcFileOperator$.$anonfun$getFileReader$3(OrcFileOperator.scala:76)
	... 32 more
08:47:00.016 WARN org.apache.spark.scheduler.TaskSetManager: Lost task 0.0 in stage 11874.0 (TID 21692, amp-jenkins-worker-02.amp, executor driver): org.apache.spark.SparkException: Could not read footer for file: file:/home/jenkins/workspace/NewSparkPullRequestBuilder/target/tmp/spark-dc0c890d-22f2-4ee4-a5fb-6b8fbd305fa9/third/part-00000-55e5f88c-47c8-4564-841d-e564a2390c13-c000.json
	at org.apache.spark.sql.hive.orc.OrcFileOperator$.$anonfun$getFileReader$3(OrcFileOperator.scala:83)
	at scala.collection.Iterator$$anon$10.next(Iterator.scala:459)
	at scala.collection.TraversableOnce.collectFirst(TraversableOnce.scala:148)
	at scala.collection.TraversableOnce.collectFirst$(TraversableOnce.scala:135)
	at scala.collection.AbstractIterator.collectFirst(Iterator.scala:1429)
	at org.apache.spark.sql.hive.orc.OrcFileOperator$.getFileReader(OrcFileOperator.scala:87)
	at org.apache.spark.sql.hive.orc.OrcFileOperator$.$anonfun$readSchema$1(OrcFileOperator.scala:96)
	at scala.collection.Iterator$$anon$10.next(Iterator.scala:459)
	at scala.collection.TraversableOnce.collectFirst(TraversableOnce.scala:148)
	at scala.collection.TraversableOnce.collectFirst$(TraversableOnce.scala:135)
	at scala.collection.AbstractIterator.collectFirst(Iterator.scala:1429)
	at org.apache.spark.sql.hive.orc.OrcFileOperator$.readSchema(OrcFileOperator.scala:96)
	at org.apache.spark.sql.hive.orc.OrcFileFormat.$anonfun$buildReader$2(OrcFileFormat.scala:163)
	at org.apache.spark.sql.execution.datasources.FileFormat$$anon$1.apply(FileFormat.scala:147)
	at org.apache.spark.sql.execution.datasources.FileFormat$$anon$1.apply(FileFormat.scala:132)
	at org.apache.spark.sql.execution.datasources.FileScanRDD$$anon$1.org$apache$spark$sql$execution$datasources$FileScanRDD$$anon$$readCurrentFile(FileScanRDD.scala:116)
	at org.apache.spark.sql.execution.datasources.FileScanRDD$$anon$1.nextIterator(FileScanRDD.scala:169)
	at org.apache.spark.sql.execution.datasources.FileScanRDD$$anon$1.hasNext(FileScanRDD.scala:93)
	at scala.collection.Iterator$$anon$10.hasNext(Iterator.scala:458)
	at scala.collection.Iterator$$anon$10.hasNext(Iterator.scala:458)
	at scala.collection.Iterator$$anon$10.hasNext(Iterator.scala:458)
	at org.apache.spark.util.Utils$.getIteratorSize(Utils.scala:1804)
	at org.apache.spark.rdd.RDD.$anonfun$count$1(RDD.scala:1227)
	at org.apache.spark.rdd.RDD.$anonfun$count$1$adapted(RDD.scala:1227)
	at org.apache.spark.SparkContext.$anonfun$runJob$5(SparkContext.scala:2156)
	at org.apache.spark.scheduler.ResultTask.runTask(ResultTask.scala:90)
	at org.apache.spark.scheduler.Task.run(Task.scala:127)
	at org.apache.spark.executor.Executor$TaskRunner.$anonfun$run$3(Executor.scala:441)
	at org.apache.spark.util.Utils$.tryWithSafeFinally(Utils.scala:1377)
	at org.apache.spark.executor.Executor$TaskRunner.run(Executor.scala:444)
	at java.util.concurrent.ThreadPoolExecutor.runWorker(ThreadPoolExecutor.java:1149)
	at java.util.concurrent.ThreadPoolExecutor$Worker.run(ThreadPoolExecutor.java:624)
	at java.lang.Thread.run(Thread.java:748)
Caused by: org.apache.orc.FileFormatException: Malformed ORC file file:/home/jenkins/workspace/NewSparkPullRequestBuilder/target/tmp/spark-dc0c890d-22f2-4ee4-a5fb-6b8fbd305fa9/third/part-00000-55e5f88c-47c8-4564-841d-e564a2390c13-c000.json. Invalid postscript.
	at org.apache.orc.impl.ReaderImpl.ensureOrcFooter(ReaderImpl.java:274)
	at org.apache.orc.impl.ReaderImpl.extractFileTail(ReaderImpl.java:581)
	at org.apache.orc.impl.ReaderImpl.<init>(ReaderImpl.java:369)
	at org.apache.hadoop.hive.ql.io.orc.ReaderImpl.<init>(ReaderImpl.java:63)
	at org.apache.hadoop.hive.ql.io.orc.OrcFile.createReader(OrcFile.java:55)
	at org.apache.spark.sql.hive.orc.OrcFileOperator$.$anonfun$getFileReader$3(OrcFileOperator.scala:76)
	... 32 more

08:47:00.016 ERROR org.apache.spark.scheduler.TaskSetManager: Task 0 in stage 11874.0 failed 1 times; aborting job
08:47:01.142 ERROR org.apache.spark.executor.Executor: Exception in task 0.0 in stage 11879.0 (TID 21697)
org.apache.spark.SparkException: Could not read footer for file: file:/home/jenkins/workspace/NewSparkPullRequestBuilder/target/tmp/spark-587ed1e8-719e-4c42-953f-c2f522bee48d/first/part-00000-0b163052-ace7-4253-a1c2-857fab9614d8-c000.json
	at org.apache.spark.sql.hive.orc.OrcFileOperator$.$anonfun$getFileReader$3(OrcFileOperator.scala:83)
	at scala.collection.Iterator$$anon$10.next(Iterator.scala:459)
	at scala.collection.TraversableOnce.collectFirst(TraversableOnce.scala:148)
	at scala.collection.TraversableOnce.collectFirst$(TraversableOnce.scala:135)
	at scala.collection.AbstractIterator.collectFirst(Iterator.scala:1429)
	at org.apache.spark.sql.hive.orc.OrcFileOperator$.getFileReader(OrcFileOperator.scala:87)
	at org.apache.spark.sql.hive.orc.OrcFileOperator$.$anonfun$readSchema$1(OrcFileOperator.scala:96)
	at scala.collection.Iterator$$anon$10.next(Iterator.scala:459)
	at scala.collection.TraversableOnce.collectFirst(TraversableOnce.scala:148)
	at scala.collection.TraversableOnce.collectFirst$(TraversableOnce.scala:135)
	at scala.collection.AbstractIterator.collectFirst(Iterator.scala:1429)
	at org.apache.spark.sql.hive.orc.OrcFileOperator$.readSchema(OrcFileOperator.scala:96)
	at org.apache.spark.sql.hive.orc.OrcFileFormat.$anonfun$buildReader$2(OrcFileFormat.scala:163)
	at org.apache.spark.sql.execution.datasources.FileFormat$$anon$1.apply(FileFormat.scala:147)
	at org.apache.spark.sql.execution.datasources.FileFormat$$anon$1.apply(FileFormat.scala:132)
	at org.apache.spark.sql.execution.datasources.FileScanRDD$$anon$1.org$apache$spark$sql$execution$datasources$FileScanRDD$$anon$$readCurrentFile(FileScanRDD.scala:116)
	at org.apache.spark.sql.execution.datasources.FileScanRDD$$anon$1.nextIterator(FileScanRDD.scala:169)
	at org.apache.spark.sql.execution.datasources.FileScanRDD$$anon$1.hasNext(FileScanRDD.scala:93)
	at scala.collection.Iterator$$anon$10.hasNext(Iterator.scala:458)
	at org.apache.spark.sql.catalyst.expressions.GeneratedClass$GeneratedIteratorForCodegenStage1.agg_doAggregateWithoutKey_0$(generated.java:33)
	at org.apache.spark.sql.catalyst.expressions.GeneratedClass$GeneratedIteratorForCodegenStage1.processNext(generated.java:63)
	at org.apache.spark.sql.execution.BufferedRowIterator.hasNext(BufferedRowIterator.java:43)
	at org.apache.spark.sql.execution.WholeStageCodegenExec$$anon$1.hasNext(WholeStageCodegenExec.scala:726)
	at scala.collection.Iterator$$anon$10.hasNext(Iterator.scala:458)
	at org.apache.spark.shuffle.sort.BypassMergeSortShuffleWriter.write(BypassMergeSortShuffleWriter.java:132)
	at org.apache.spark.shuffle.ShuffleWriteProcessor.write(ShuffleWriteProcessor.scala:59)
	at org.apache.spark.scheduler.ShuffleMapTask.runTask(ShuffleMapTask.scala:99)
	at org.apache.spark.scheduler.ShuffleMapTask.runTask(ShuffleMapTask.scala:52)
	at org.apache.spark.scheduler.Task.run(Task.scala:127)
	at org.apache.spark.executor.Executor$TaskRunner.$anonfun$run$3(Executor.scala:441)
	at org.apache.spark.util.Utils$.tryWithSafeFinally(Utils.scala:1377)
	at org.apache.spark.executor.Executor$TaskRunner.run(Executor.scala:444)
	at java.util.concurrent.ThreadPoolExecutor.runWorker(ThreadPoolExecutor.java:1149)
	at java.util.concurrent.ThreadPoolExecutor$Worker.run(ThreadPoolExecutor.java:624)
	at java.lang.Thread.run(Thread.java:748)
Caused by: org.apache.orc.FileFormatException: Malformed ORC file file:/home/jenkins/workspace/NewSparkPullRequestBuilder/target/tmp/spark-587ed1e8-719e-4c42-953f-c2f522bee48d/first/part-00000-0b163052-ace7-4253-a1c2-857fab9614d8-c000.json. Invalid postscript.
	at org.apache.orc.impl.ReaderImpl.ensureOrcFooter(ReaderImpl.java:274)
	at org.apache.orc.impl.ReaderImpl.extractFileTail(ReaderImpl.java:581)
	at org.apache.orc.impl.ReaderImpl.<init>(ReaderImpl.java:369)
	at org.apache.hadoop.hive.ql.io.orc.ReaderImpl.<init>(ReaderImpl.java:63)
	at org.apache.hadoop.hive.ql.io.orc.OrcFile.createReader(OrcFile.java:55)
	at org.apache.spark.sql.hive.orc.OrcFileOperator$.$anonfun$getFileReader$3(OrcFileOperator.scala:76)
	... 34 more
08:47:01.152 WARN org.apache.spark.scheduler.TaskSetManager: Lost task 0.0 in stage 11879.0 (TID 21697, amp-jenkins-worker-02.amp, executor driver): org.apache.spark.SparkException: Could not read footer for file: file:/home/jenkins/workspace/NewSparkPullRequestBuilder/target/tmp/spark-587ed1e8-719e-4c42-953f-c2f522bee48d/first/part-00000-0b163052-ace7-4253-a1c2-857fab9614d8-c000.json
	at org.apache.spark.sql.hive.orc.OrcFileOperator$.$anonfun$getFileReader$3(OrcFileOperator.scala:83)
	at scala.collection.Iterator$$anon$10.next(Iterator.scala:459)
	at scala.collection.TraversableOnce.collectFirst(TraversableOnce.scala:148)
	at scala.collection.TraversableOnce.collectFirst$(TraversableOnce.scala:135)
	at scala.collection.AbstractIterator.collectFirst(Iterator.scala:1429)
	at org.apache.spark.sql.hive.orc.OrcFileOperator$.getFileReader(OrcFileOperator.scala:87)
	at org.apache.spark.sql.hive.orc.OrcFileOperator$.$anonfun$readSchema$1(OrcFileOperator.scala:96)
	at scala.collection.Iterator$$anon$10.next(Iterator.scala:459)
	at scala.collection.TraversableOnce.collectFirst(TraversableOnce.scala:148)
	at scala.collection.TraversableOnce.collectFirst$(TraversableOnce.scala:135)
	at scala.collection.AbstractIterator.collectFirst(Iterator.scala:1429)
	at org.apache.spark.sql.hive.orc.OrcFileOperator$.readSchema(OrcFileOperator.scala:96)
	at org.apache.spark.sql.hive.orc.OrcFileFormat.$anonfun$buildReader$2(OrcFileFormat.scala:163)
	at org.apache.spark.sql.execution.datasources.FileFormat$$anon$1.apply(FileFormat.scala:147)
	at org.apache.spark.sql.execution.datasources.FileFormat$$anon$1.apply(FileFormat.scala:132)
	at org.apache.spark.sql.execution.datasources.FileScanRDD$$anon$1.org$apache$spark$sql$execution$datasources$FileScanRDD$$anon$$readCurrentFile(FileScanRDD.scala:116)
	at org.apache.spark.sql.execution.datasources.FileScanRDD$$anon$1.nextIterator(FileScanRDD.scala:169)
	at org.apache.spark.sql.execution.datasources.FileScanRDD$$anon$1.hasNext(FileScanRDD.scala:93)
	at scala.collection.Iterator$$anon$10.hasNext(Iterator.scala:458)
	at org.apache.spark.sql.catalyst.expressions.GeneratedClass$GeneratedIteratorForCodegenStage1.agg_doAggregateWithoutKey_0$(generated.java:33)
	at org.apache.spark.sql.catalyst.expressions.GeneratedClass$GeneratedIteratorForCodegenStage1.processNext(generated.java:63)
	at org.apache.spark.sql.execution.BufferedRowIterator.hasNext(BufferedRowIterator.java:43)
	at org.apache.spark.sql.execution.WholeStageCodegenExec$$anon$1.hasNext(WholeStageCodegenExec.scala:726)
	at scala.collection.Iterator$$anon$10.hasNext(Iterator.scala:458)
	at org.apache.spark.shuffle.sort.BypassMergeSortShuffleWriter.write(BypassMergeSortShuffleWriter.java:132)
	at org.apache.spark.shuffle.ShuffleWriteProcessor.write(ShuffleWriteProcessor.scala:59)
	at org.apache.spark.scheduler.ShuffleMapTask.runTask(ShuffleMapTask.scala:99)
	at org.apache.spark.scheduler.ShuffleMapTask.runTask(ShuffleMapTask.scala:52)
	at org.apache.spark.scheduler.Task.run(Task.scala:127)
	at org.apache.spark.executor.Executor$TaskRunner.$anonfun$run$3(Executor.scala:441)
	at org.apache.spark.util.Utils$.tryWithSafeFinally(Utils.scala:1377)
	at org.apache.spark.executor.Executor$TaskRunner.run(Executor.scala:444)
	at java.util.concurrent.ThreadPoolExecutor.runWorker(ThreadPoolExecutor.java:1149)
	at java.util.concurrent.ThreadPoolExecutor$Worker.run(ThreadPoolExecutor.java:624)
	at java.lang.Thread.run(Thread.java:748)
Caused by: org.apache.orc.FileFormatException: Malformed ORC file file:/home/jenkins/workspace/NewSparkPullRequestBuilder/target/tmp/spark-587ed1e8-719e-4c42-953f-c2f522bee48d/first/part-00000-0b163052-ace7-4253-a1c2-857fab9614d8-c000.json. Invalid postscript.
	at org.apache.orc.impl.ReaderImpl.ensureOrcFooter(ReaderImpl.java:274)
	at org.apache.orc.impl.ReaderImpl.extractFileTail(ReaderImpl.java:581)
	at org.apache.orc.impl.ReaderImpl.<init>(ReaderImpl.java:369)
	at org.apache.hadoop.hive.ql.io.orc.ReaderImpl.<init>(ReaderImpl.java:63)
	at org.apache.hadoop.hive.ql.io.orc.OrcFile.createReader(OrcFile.java:55)
	at org.apache.spark.sql.hive.orc.OrcFileOperator$.$anonfun$getFileReader$3(OrcFileOperator.scala:76)
	... 34 more

08:47:01.152 ERROR org.apache.spark.scheduler.TaskSetManager: Task 0 in stage 11879.0 failed 1 times; aborting job
[info] - Enabling/disabling ignoreCorruptFiles (5 seconds, 599 milliseconds)
[info] - SPARK-27160 Predicate pushdown correctness on DecimalType for ORC (1 second, 133 milliseconds)
[info] - SPARK-8501: Avoids discovery schema from empty ORC files (986 milliseconds)
08:47:04.906 ERROR org.apache.hadoop.hive.ql.io.AcidUtils: Failed to get files with ID; using regular API: Only supported for DFS; got class org.apache.hadoop.hive.ql.io.ProxyLocalFileSystem
08:47:04.997 ERROR org.apache.hadoop.hive.ql.io.AcidUtils: Failed to get files with ID; using regular API: Only supported for DFS; got class org.apache.hadoop.hive.ql.io.ProxyLocalFileSystem
[info] - Verify the ORC conversion parameter: CONVERT_METASTORE_ORC (1 second, 868 milliseconds)
[info] - converted ORC table supports resolving mixed case field (1 second, 704 milliseconds)
[info] - SPARK-20728 Make ORCFileFormat configurable between sql/hive and sql/core (598 milliseconds)
[info] - SPARK-22267 Spark SQL incorrectly reads ORC files when column order is different (1 second, 388 milliseconds)
[info] - SPARK-19809 NullPointerException on zero-size ORC file (869 milliseconds)
[info] - SPARK-23340 Empty float/double array columns raise EOFException !!! IGNORED !!!
08:47:09.765 WARN org.apache.hadoop.hive.metastore.HiveMetaStore: Location: file:/home/jenkins/workspace/NewSparkPullRequestBuilder/target/tmp/warehouse-271c1635-6bce-4432-97a7-62cbfb5f3e48/spark_26437 specified for non-external table:spark_26437
08:47:10.501 ERROR org.apache.hadoop.hive.ql.io.AcidUtils: Failed to get files with ID; using regular API: Only supported for DFS; got class org.apache.hadoop.hive.ql.io.ProxyLocalFileSystem
08:47:10.607 ERROR org.apache.hadoop.hive.ql.io.AcidUtils: Failed to get files with ID; using regular API: Only supported for DFS; got class org.apache.hadoop.hive.ql.io.ProxyLocalFileSystem
[info] - SPARK-26437 Can not query decimal type when value is 0 (1 second, 13 milliseconds)
08:47:10.781 WARN org.apache.hadoop.hive.metastore.HiveMetaStore: Location: file:/home/jenkins/workspace/NewSparkPullRequestBuilder/target/tmp/warehouse-271c1635-6bce-4432-97a7-62cbfb5f3e48/dummy_orc_partitioned specified for non-external table:dummy_orc_partitioned
08:47:12.048 WARN org.apache.hadoop.hive.metastore.HiveMetaStore: Location: file:/home/jenkins/workspace/NewSparkPullRequestBuilder/target/tmp/warehouse-271c1635-6bce-4432-97a7-62cbfb5f3e48/dummy_orc_partitioned specified for non-external table:dummy_orc_partitioned
[info] - SPARK-28573 ORC conversation could be applied for partitioned table insertion (3 seconds, 26 milliseconds)
08:47:13.903 WARN org.apache.hadoop.hive.conf.HiveConf: HiveConf of name hive.internal.ss.authz.settings.applied.marker does not exist
08:47:13.903 WARN org.apache.hadoop.hive.conf.HiveConf: HiveConf of name hive.stats.jdbc.timeout does not exist
08:47:13.903 WARN org.apache.hadoop.hive.conf.HiveConf: HiveConf of name hive.stats.retries.wait does not exist
08:47:14.056 WARN org.apache.hadoop.hive.conf.HiveConf: HiveConf of name hive.internal.ss.authz.settings.applied.marker does not exist
08:47:14.056 WARN org.apache.hadoop.hive.conf.HiveConf: HiveConf of name hive.stats.jdbc.timeout does not exist
08:47:14.056 WARN org.apache.hadoop.hive.conf.HiveConf: HiveConf of name hive.stats.retries.wait does not exist
[info] HiveOrcPartitionDiscoverySuite:
[info] - read partitioned table - normal case (1 second, 548 milliseconds)
[info] - read partitioned table - with nulls (1 second, 570 milliseconds)
[info] - SPARK-27162: handle pathfilter configuration correctly (770 milliseconds)
08:47:18.059 WARN org.apache.hadoop.hive.conf.HiveConf: HiveConf of name hive.internal.ss.authz.settings.applied.marker does not exist
08:47:18.059 WARN org.apache.hadoop.hive.conf.HiveConf: HiveConf of name hive.stats.jdbc.timeout does not exist
08:47:18.059 WARN org.apache.hadoop.hive.conf.HiveConf: HiveConf of name hive.stats.retries.wait does not exist
08:47:18.152 WARN org.apache.hadoop.hive.conf.HiveConf: HiveConf of name hive.internal.ss.authz.settings.applied.marker does not exist
08:47:18.152 WARN org.apache.hadoop.hive.conf.HiveConf: HiveConf of name hive.stats.jdbc.timeout does not exist
08:47:18.152 WARN org.apache.hadoop.hive.conf.HiveConf: HiveConf of name hive.stats.retries.wait does not exist
[info] PruneFileSourcePartitionsSuite:
[info] - subquery/exists-subquery/exists-joins-and-set-ops.sql (45 seconds, 78 milliseconds)
[info] - PruneFileSourcePartitions should not change the output of LogicalRelation (245 milliseconds)
[info] - SPARK-20986 Reset table's statistics after PruneFileSourcePartitions rule (1 second, 609 milliseconds)
[info] - subquery/exists-subquery/exists-cte.sql (1 second, 931 milliseconds)
[info] - subquery/exists-subquery/exists-within-and-or.sql (744 milliseconds)
[info] - SPARK-26576 Broadcast hint not applied to partitioned table (1 second, 148 milliseconds)
08:47:21.288 WARN org.apache.hadoop.hive.conf.HiveConf: HiveConf of name hive.internal.ss.authz.settings.applied.marker does not exist
08:47:21.288 WARN org.apache.hadoop.hive.conf.HiveConf: HiveConf of name hive.stats.jdbc.timeout does not exist
08:47:21.288 WARN org.apache.hadoop.hive.conf.HiveConf: HiveConf of name hive.stats.retries.wait does not exist
08:47:21.403 WARN org.apache.hadoop.hive.conf.HiveConf: HiveConf of name hive.internal.ss.authz.settings.applied.marker does not exist
08:47:21.403 WARN org.apache.hadoop.hive.conf.HiveConf: HiveConf of name hive.stats.jdbc.timeout does not exist
08:47:21.403 WARN org.apache.hadoop.hive.conf.HiveConf: HiveConf of name hive.stats.retries.wait does not exist
[info] HiveOrcFilterSuite:
[info] - filter pushdown - integer (774 milliseconds)
[info] - filter pushdown - long (748 milliseconds)
[info] - filter pushdown - float (714 milliseconds)
[info] - filter pushdown - double (724 milliseconds)
[info] - filter pushdown - string (754 milliseconds)
[info] - filter pushdown - boolean (689 milliseconds)
[info] - filter pushdown - decimal (693 milliseconds)
[info] - subquery/exists-subquery/exists-aggregate.sql (5 seconds, 905 milliseconds)
[info] - filter pushdown - timestamp (876 milliseconds)
[info] - filter pushdown - combinations with logical operators (424 milliseconds)
[info] - subquery/exists-subquery/exists-having.sql (1 second, 918 milliseconds)
[info] - no filter pushdown - non-supported types (939 milliseconds)
[info] - SPARK-12218 and SPARK-25699 Converting conjunctions into ORC SearchArguments (3 milliseconds)
[info] - SPARK-27699 Converting disjunctions into ORC SearchArguments (1 millisecond)
08:47:28.861 WARN org.apache.hadoop.hive.conf.HiveConf: HiveConf of name hive.internal.ss.authz.settings.applied.marker does not exist
08:47:28.861 WARN org.apache.hadoop.hive.conf.HiveConf: HiveConf of name hive.stats.jdbc.timeout does not exist
08:47:28.861 WARN org.apache.hadoop.hive.conf.HiveConf: HiveConf of name hive.stats.retries.wait does not exist
08:47:28.952 WARN org.apache.hadoop.hive.conf.HiveConf: HiveConf of name hive.internal.ss.authz.settings.applied.marker does not exist
08:47:28.952 WARN org.apache.hadoop.hive.conf.HiveConf: HiveConf of name hive.stats.jdbc.timeout does not exist
08:47:28.952 WARN org.apache.hadoop.hive.conf.HiveConf: HiveConf of name hive.stats.retries.wait does not exist
[info] ParquetHiveCompatibilitySuite:
[info] - subquery/in-subquery/not-in-unit-tests-single-column.sql (927 milliseconds)
08:47:30.174 WARN org.apache.spark.sql.execution.command.DropTableCommand: org.apache.spark.sql.AnalysisException: Path does not exist: file:/home/jenkins/workspace/NewSparkPullRequestBuilder/target/tmp/spark-2bc11415-d527-414f-8dd3-f060ed0f7f17;
org.apache.spark.sql.AnalysisException: Path does not exist: file:/home/jenkins/workspace/NewSparkPullRequestBuilder/target/tmp/spark-2bc11415-d527-414f-8dd3-f060ed0f7f17;
	at org.apache.spark.sql.execution.datasources.DataSource$.$anonfun$checkAndGlobPathIfNecessary$1(DataSource.scala:759)
	at scala.collection.TraversableLike.$anonfun$flatMap$1(TraversableLike.scala:245)
	at scala.collection.immutable.List.foreach(List.scala:392)
	at scala.collection.TraversableLike.flatMap(TraversableLike.scala:245)
	at scala.collection.TraversableLike.flatMap$(TraversableLike.scala:242)
	at scala.collection.immutable.List.flatMap(List.scala:355)
	at org.apache.spark.sql.execution.datasources.DataSource$.checkAndGlobPathIfNecessary(DataSource.scala:746)
	at org.apache.spark.sql.execution.datasources.DataSource.checkAndGlobPathIfNecessary(DataSource.scala:575)
	at org.apache.spark.sql.execution.datasources.DataSource.resolveRelation(DataSource.scala:398)
	at org.apache.spark.sql.hive.HiveMetastoreCatalog.$anonfun$convertToLogicalRelation$5(HiveMetastoreCatalog.scala:248)
	at scala.Option.getOrElse(Option.scala:189)
	at org.apache.spark.sql.hive.HiveMetastoreCatalog.$anonfun$convertToLogicalRelation$4(HiveMetastoreCatalog.scala:238)
	at org.apache.spark.sql.hive.HiveMetastoreCatalog.withTableCreationLock(HiveMetastoreCatalog.scala:58)
	at org.apache.spark.sql.hive.HiveMetastoreCatalog.convertToLogicalRelation(HiveMetastoreCatalog.scala:231)
	at org.apache.spark.sql.hive.HiveMetastoreCatalog.convert(HiveMetastoreCatalog.scala:137)
	at org.apache.spark.sql.hive.RelationConversions$$anonfun$apply$4.applyOrElse(HiveStrategies.scala:220)
	at org.apache.spark.sql.hive.RelationConversions$$anonfun$apply$4.applyOrElse(HiveStrategies.scala:207)
	at org.apache.spark.sql.catalyst.plans.logical.AnalysisHelper.$anonfun$resolveOperatorsDown$2(AnalysisHelper.scala:108)
	at org.apache.spark.sql.catalyst.trees.CurrentOrigin$.withOrigin(TreeNode.scala:72)
	at org.apache.spark.sql.catalyst.plans.logical.AnalysisHelper.$anonfun$resolveOperatorsDown$1(AnalysisHelper.scala:108)
	at org.apache.spark.sql.catalyst.plans.logical.AnalysisHelper$.allowInvokingTransformsInAnalyzer(AnalysisHelper.scala:194)
	at org.apache.spark.sql.catalyst.plans.logical.AnalysisHelper.resolveOperatorsDown(AnalysisHelper.scala:106)
	at org.apache.spark.sql.catalyst.plans.logical.AnalysisHelper.resolveOperatorsDown$(AnalysisHelper.scala:104)
	at org.apache.spark.sql.catalyst.plans.logical.LogicalPlan.resolveOperatorsDown(LogicalPlan.scala:29)
	at org.apache.spark.sql.catalyst.plans.logical.AnalysisHelper.$anonfun$resolveOperatorsDown$4(AnalysisHelper.scala:113)
	at org.apache.spark.sql.catalyst.trees.TreeNode.$anonfun$mapChildren$1(TreeNode.scala:376)
	at org.apache.spark.sql.catalyst.trees.TreeNode.mapProductIterator(TreeNode.scala:214)
	at org.apache.spark.sql.catalyst.trees.TreeNode.mapChildren(TreeNode.scala:374)
	at org.apache.spark.sql.catalyst.trees.TreeNode.mapChildren(TreeNode.scala:327)
	at org.apache.spark.sql.catalyst.plans.logical.AnalysisHelper.$anonfun$resolveOperatorsDown$1(AnalysisHelper.scala:113)
	at org.apache.spark.sql.catalyst.plans.logical.AnalysisHelper$.allowInvokingTransformsInAnalyzer(AnalysisHelper.scala:194)
	at org.apache.spark.sql.catalyst.plans.logical.AnalysisHelper.resolveOperatorsDown(AnalysisHelper.scala:106)
	at org.apache.spark.sql.catalyst.plans.logical.AnalysisHelper.resolveOperatorsDown$(AnalysisHelper.scala:104)
	at org.apache.spark.sql.catalyst.plans.logical.LogicalPlan.resolveOperatorsDown(LogicalPlan.scala:29)
	at org.apache.spark.sql.catalyst.plans.logical.AnalysisHelper.resolveOperators(AnalysisHelper.scala:73)
	at org.apache.spark.sql.catalyst.plans.logical.AnalysisHelper.resolveOperators$(AnalysisHelper.scala:72)
	at org.apache.spark.sql.catalyst.plans.logical.LogicalPlan.resolveOperators(LogicalPlan.scala:29)
	at org.apache.spark.sql.hive.RelationConversions.apply(HiveStrategies.scala:207)
	at org.apache.spark.sql.hive.RelationConversions.apply(HiveStrategies.scala:191)
	at org.apache.spark.sql.catalyst.rules.RuleExecutor.$anonfun$execute$2(RuleExecutor.scala:130)
	at scala.collection.IndexedSeqOptimized.foldLeft(IndexedSeqOptimized.scala:60)
	at scala.collection.IndexedSeqOptimized.foldLeft$(IndexedSeqOptimized.scala:68)
	at scala.collection.mutable.ArrayBuffer.foldLeft(ArrayBuffer.scala:49)
	at org.apache.spark.sql.catalyst.rules.RuleExecutor.$anonfun$execute$1(RuleExecutor.scala:127)
	at org.apache.spark.sql.catalyst.rules.RuleExecutor.$anonfun$execute$1$adapted(RuleExecutor.scala:119)
	at scala.collection.immutable.List.foreach(List.scala:392)
	at org.apache.spark.sql.catalyst.rules.RuleExecutor.execute(RuleExecutor.scala:119)
	at org.apache.spark.sql.catalyst.analysis.Analyzer.org$apache$spark$sql$catalyst$analysis$Analyzer$$executeSameContext(Analyzer.scala:174)
	at org.apache.spark.sql.catalyst.analysis.Analyzer.execute(Analyzer.scala:168)
	at org.apache.spark.sql.catalyst.analysis.Analyzer.execute(Analyzer.scala:128)
	at org.apache.spark.sql.catalyst.rules.RuleExecutor.$anonfun$executeAndTrack$1(RuleExecutor.scala:98)
	at org.apache.spark.sql.catalyst.QueryPlanningTracker$.withTracker(QueryPlanningTracker.scala:88)
	at org.apache.spark.sql.catalyst.rules.RuleExecutor.executeAndTrack(RuleExecutor.scala:98)
	at org.apache.spark.sql.catalyst.analysis.Analyzer.$anonfun$executeAndCheck$1(Analyzer.scala:152)
	at org.apache.spark.sql.catalyst.plans.logical.AnalysisHelper$.markInAnalyzer(AnalysisHelper.scala:201)
	at org.apache.spark.sql.catalyst.analysis.Analyzer.executeAndCheck(Analyzer.scala:151)
	at org.apache.spark.sql.hive.test.TestHiveQueryExecution.analyzed$lzycompute(TestHive.scala:606)
	at org.apache.spark.sql.hive.test.TestHiveQueryExecution.analyzed(TestHive.scala:589)
	at org.apache.spark.sql.execution.QueryExecution.assertAnalyzed(QueryExecution.scala:58)
	at org.apache.spark.sql.Dataset$.ofRows(Dataset.scala:87)
	at org.apache.spark.sql.SparkSession.table(SparkSession.scala:589)
	at org.apache.spark.sql.execution.command.DropTableCommand.run(ddl.scala:241)
	at org.apache.spark.sql.execution.command.ExecutedCommandExec.sideEffectResult$lzycompute(commands.scala:70)
	at org.apache.spark.sql.execution.command.ExecutedCommandExec.sideEffectResult(commands.scala:68)
	at org.apache.spark.sql.execution.command.ExecutedCommandExec.executeCollect(commands.scala:79)
	at org.apache.spark.sql.Dataset.$anonfun$logicalPlan$1(Dataset.scala:226)
	at org.apache.spark.sql.Dataset.$anonfun$withAction$1(Dataset.scala:3487)
	at org.apache.spark.sql.execution.SQLExecution$.$anonfun$withNewExecutionId$4(SQLExecution.scala:100)
	at org.apache.spark.sql.execution.SQLExecution$.withSQLConfPropagated(SQLExecution.scala:160)
	at org.apache.spark.sql.execution.SQLExecution$.withNewExecutionId(SQLExecution.scala:87)
	at org.apache.spark.sql.Dataset.withAction(Dataset.scala:3485)
	at org.apache.spark.sql.Dataset.<init>(Dataset.scala:226)
	at org.apache.spark.sql.Dataset$.ofRows(Dataset.scala:88)
	at org.apache.spark.sql.hive.test.TestHiveSparkSession.sql(TestHive.scala:238)
	at org.apache.spark.sql.test.SQLTestUtilsBase.$anonfun$withTable$2(SQLTestUtils.scala:291)
	at scala.collection.IndexedSeqOptimized.foreach(IndexedSeqOptimized.scala:36)
	at scala.collection.IndexedSeqOptimized.foreach$(IndexedSeqOptimized.scala:33)
	at scala.collection.mutable.WrappedArray.foreach(WrappedArray.scala:38)
	at org.apache.spark.sql.test.SQLTestUtilsBase.$anonfun$withTable$1(SQLTestUtils.scala:290)
	at org.apache.spark.util.Utils$.tryWithSafeFinally(Utils.scala:1386)
	at org.apache.spark.sql.test.SQLTestUtilsBase.withTable(SQLTestUtils.scala:290)
	at org.apache.spark.sql.test.SQLTestUtilsBase.withTable$(SQLTestUtils.scala:288)
	at org.apache.spark.sql.execution.datasources.parquet.ParquetCompatibilityTest.withTable(ParquetCompatibilityTest.scala:35)
	at org.apache.spark.sql.hive.ParquetHiveCompatibilitySuite.testParquetHiveCompatibility(ParquetHiveCompatibilitySuite.scala:47)
	at org.apache.spark.sql.hive.ParquetHiveCompatibilitySuite.$anonfun$new$1(ParquetHiveCompatibilitySuite.scala:94)
	at scala.runtime.java8.JFunction0$mcV$sp.apply(JFunction0$mcV$sp.java:23)
	at org.scalatest.OutcomeOf.outcomeOf(OutcomeOf.scala:85)
	at org.scalatest.OutcomeOf.outcomeOf$(OutcomeOf.scala:83)
	at org.scalatest.OutcomeOf$.outcomeOf(OutcomeOf.scala:104)
	at org.scalatest.Transformer.apply(Transformer.scala:22)
	at org.scalatest.Transformer.apply(Transformer.scala:20)
	at org.scalatest.FunSuiteLike$$anon$1.apply(FunSuiteLike.scala:186)
	at org.apache.spark.SparkFunSuite.withFixture(SparkFunSuite.scala:149)
	at org.scalatest.FunSuiteLike.invokeWithFixture$1(FunSuiteLike.scala:184)
	at org.scalatest.FunSuiteLike.$anonfun$runTest$1(FunSuiteLike.scala:196)
	at org.scalatest.SuperEngine.runTestImpl(Engine.scala:286)
	at org.scalatest.FunSuiteLike.runTest(FunSuiteLike.scala:196)
	at org.scalatest.FunSuiteLike.runTest$(FunSuiteLike.scala:178)
	at org.apache.spark.SparkFunSuite.org$scalatest$BeforeAndAfterEach$$super$runTest(SparkFunSuite.scala:56)
	at org.scalatest.BeforeAndAfterEach.runTest(BeforeAndAfterEach.scala:221)
	at org.scalatest.BeforeAndAfterEach.runTest$(BeforeAndAfterEach.scala:214)
	at org.apache.spark.SparkFunSuite.runTest(SparkFunSuite.scala:56)
	at org.scalatest.FunSuiteLike.$anonfun$runTests$1(FunSuiteLike.scala:229)
	at org.scalatest.SuperEngine.$anonfun$runTestsInBranch$1(Engine.scala:393)
	at scala.collection.immutable.List.foreach(List.scala:392)
	at org.scalatest.SuperEngine.traverseSubNodes$1(Engine.scala:381)
	at org.scalatest.SuperEngine.runTestsInBranch(Engine.scala:376)
	at org.scalatest.SuperEngine.runTestsImpl(Engine.scala:458)
	at org.scalatest.FunSuiteLike.runTests(FunSuiteLike.scala:229)
	at org.scalatest.FunSuiteLike.runTests$(FunSuiteLike.scala:228)
	at org.scalatest.FunSuite.runTests(FunSuite.scala:1560)
	at org.scalatest.Suite.run(Suite.scala:1124)
	at org.scalatest.Suite.run$(Suite.scala:1106)
	at org.scalatest.FunSuite.org$scalatest$FunSuiteLike$$super$run(FunSuite.scala:1560)
	at org.scalatest.FunSuiteLike.$anonfun$run$1(FunSuiteLike.scala:233)
	at org.scalatest.SuperEngine.runImpl(Engine.scala:518)
	at org.scalatest.FunSuiteLike.run(FunSuiteLike.scala:233)
	at org.scalatest.FunSuiteLike.run$(FunSuiteLike.scala:232)
	at org.apache.spark.SparkFunSuite.org$scalatest$BeforeAndAfterAll$$super$run(SparkFunSuite.scala:56)
	at org.scalatest.BeforeAndAfterAll.liftedTree1$1(BeforeAndAfterAll.scala:213)
	at org.scalatest.BeforeAndAfterAll.run(BeforeAndAfterAll.scala:210)
	at org.scalatest.BeforeAndAfterAll.run$(BeforeAndAfterAll.scala:208)
	at org.apache.spark.SparkFunSuite.run(SparkFunSuite.scala:56)
	at org.scalatest.tools.Framework.org$scalatest$tools$Framework$$runSuite(Framework.scala:317)
	at org.scalatest.tools.Framework$ScalaTestTask.execute(Framework.scala:510)
	at sbt.ForkMain$Run$2.call(ForkMain.java:296)
	at sbt.ForkMain$Run$2.call(ForkMain.java:286)
	at java.util.concurrent.FutureTask.run(FutureTask.java:266)
	at java.util.concurrent.ThreadPoolExecutor.runWorker(ThreadPoolExecutor.java:1149)
	at java.util.concurrent.ThreadPoolExecutor$Worker.run(ThreadPoolExecutor.java:624)
	at java.lang.Thread.run(Thread.java:748)
[info] - simple primitives (1 second, 249 milliseconds)
08:47:31.339 WARN org.apache.spark.sql.execution.command.DropTableCommand: org.apache.spark.sql.AnalysisException: Path does not exist: file:/home/jenkins/workspace/NewSparkPullRequestBuilder/target/tmp/spark-42a81678-b226-4b83-b016-7cb1354f95d4;
org.apache.spark.sql.AnalysisException: Path does not exist: file:/home/jenkins/workspace/NewSparkPullRequestBuilder/target/tmp/spark-42a81678-b226-4b83-b016-7cb1354f95d4;
	at org.apache.spark.sql.execution.datasources.DataSource$.$anonfun$checkAndGlobPathIfNecessary$1(DataSource.scala:759)
	at scala.collection.TraversableLike.$anonfun$flatMap$1(TraversableLike.scala:245)
	at scala.collection.immutable.List.foreach(List.scala:392)
	at scala.collection.TraversableLike.flatMap(TraversableLike.scala:245)
	at scala.collection.TraversableLike.flatMap$(TraversableLike.scala:242)
	at scala.collection.immutable.List.flatMap(List.scala:355)
	at org.apache.spark.sql.execution.datasources.DataSource$.checkAndGlobPathIfNecessary(DataSource.scala:746)
	at org.apache.spark.sql.execution.datasources.DataSource.checkAndGlobPathIfNecessary(DataSource.scala:575)
	at org.apache.spark.sql.execution.datasources.DataSource.resolveRelation(DataSource.scala:398)
	at org.apache.spark.sql.hive.HiveMetastoreCatalog.$anonfun$convertToLogicalRelation$5(HiveMetastoreCatalog.scala:248)
	at scala.Option.getOrElse(Option.scala:189)
	at org.apache.spark.sql.hive.HiveMetastoreCatalog.$anonfun$convertToLogicalRelation$4(HiveMetastoreCatalog.scala:238)
	at org.apache.spark.sql.hive.HiveMetastoreCatalog.withTableCreationLock(HiveMetastoreCatalog.scala:58)
	at org.apache.spark.sql.hive.HiveMetastoreCatalog.convertToLogicalRelation(HiveMetastoreCatalog.scala:231)
	at org.apache.spark.sql.hive.HiveMetastoreCatalog.convert(HiveMetastoreCatalog.scala:137)
	at org.apache.spark.sql.hive.RelationConversions$$anonfun$apply$4.applyOrElse(HiveStrategies.scala:220)
	at org.apache.spark.sql.hive.RelationConversions$$anonfun$apply$4.applyOrElse(HiveStrategies.scala:207)
	at org.apache.spark.sql.catalyst.plans.logical.AnalysisHelper.$anonfun$resolveOperatorsDown$2(AnalysisHelper.scala:108)
	at org.apache.spark.sql.catalyst.trees.CurrentOrigin$.withOrigin(TreeNode.scala:72)
	at org.apache.spark.sql.catalyst.plans.logical.AnalysisHelper.$anonfun$resolveOperatorsDown$1(AnalysisHelper.scala:108)
	at org.apache.spark.sql.catalyst.plans.logical.AnalysisHelper$.allowInvokingTransformsInAnalyzer(AnalysisHelper.scala:194)
	at org.apache.spark.sql.catalyst.plans.logical.AnalysisHelper.resolveOperatorsDown(AnalysisHelper.scala:106)
	at org.apache.spark.sql.catalyst.plans.logical.AnalysisHelper.resolveOperatorsDown$(AnalysisHelper.scala:104)
	at org.apache.spark.sql.catalyst.plans.logical.LogicalPlan.resolveOperatorsDown(LogicalPlan.scala:29)
	at org.apache.spark.sql.catalyst.plans.logical.AnalysisHelper.$anonfun$resolveOperatorsDown$4(AnalysisHelper.scala:113)
	at org.apache.spark.sql.catalyst.trees.TreeNode.$anonfun$mapChildren$1(TreeNode.scala:376)
	at org.apache.spark.sql.catalyst.trees.TreeNode.mapProductIterator(TreeNode.scala:214)
	at org.apache.spark.sql.catalyst.trees.TreeNode.mapChildren(TreeNode.scala:374)
	at org.apache.spark.sql.catalyst.trees.TreeNode.mapChildren(TreeNode.scala:327)
	at org.apache.spark.sql.catalyst.plans.logical.AnalysisHelper.$anonfun$resolveOperatorsDown$1(AnalysisHelper.scala:113)
	at org.apache.spark.sql.catalyst.plans.logical.AnalysisHelper$.allowInvokingTransformsInAnalyzer(AnalysisHelper.scala:194)
	at org.apache.spark.sql.catalyst.plans.logical.AnalysisHelper.resolveOperatorsDown(AnalysisHelper.scala:106)
	at org.apache.spark.sql.catalyst.plans.logical.AnalysisHelper.resolveOperatorsDown$(AnalysisHelper.scala:104)
	at org.apache.spark.sql.catalyst.plans.logical.LogicalPlan.resolveOperatorsDown(LogicalPlan.scala:29)
	at org.apache.spark.sql.catalyst.plans.logical.AnalysisHelper.resolveOperators(AnalysisHelper.scala:73)
	at org.apache.spark.sql.catalyst.plans.logical.AnalysisHelper.resolveOperators$(AnalysisHelper.scala:72)
	at org.apache.spark.sql.catalyst.plans.logical.LogicalPlan.resolveOperators(LogicalPlan.scala:29)
	at org.apache.spark.sql.hive.RelationConversions.apply(HiveStrategies.scala:207)
	at org.apache.spark.sql.hive.RelationConversions.apply(HiveStrategies.scala:191)
	at org.apache.spark.sql.catalyst.rules.RuleExecutor.$anonfun$execute$2(RuleExecutor.scala:130)
	at scala.collection.IndexedSeqOptimized.foldLeft(IndexedSeqOptimized.scala:60)
	at scala.collection.IndexedSeqOptimized.foldLeft$(IndexedSeqOptimized.scala:68)
	at scala.collection.mutable.ArrayBuffer.foldLeft(ArrayBuffer.scala:49)
	at org.apache.spark.sql.catalyst.rules.RuleExecutor.$anonfun$execute$1(RuleExecutor.scala:127)
	at org.apache.spark.sql.catalyst.rules.RuleExecutor.$anonfun$execute$1$adapted(RuleExecutor.scala:119)
	at scala.collection.immutable.List.foreach(List.scala:392)
	at org.apache.spark.sql.catalyst.rules.RuleExecutor.execute(RuleExecutor.scala:119)
	at org.apache.spark.sql.catalyst.analysis.Analyzer.org$apache$spark$sql$catalyst$analysis$Analyzer$$executeSameContext(Analyzer.scala:174)
	at org.apache.spark.sql.catalyst.analysis.Analyzer.execute(Analyzer.scala:168)
	at org.apache.spark.sql.catalyst.analysis.Analyzer.execute(Analyzer.scala:128)
	at org.apache.spark.sql.catalyst.rules.RuleExecutor.$anonfun$executeAndTrack$1(RuleExecutor.scala:98)
	at org.apache.spark.sql.catalyst.QueryPlanningTracker$.withTracker(QueryPlanningTracker.scala:88)
	at org.apache.spark.sql.catalyst.rules.RuleExecutor.executeAndTrack(RuleExecutor.scala:98)
	at org.apache.spark.sql.catalyst.analysis.Analyzer.$anonfun$executeAndCheck$1(Analyzer.scala:152)
	at org.apache.spark.sql.catalyst.plans.logical.AnalysisHelper$.markInAnalyzer(AnalysisHelper.scala:201)
	at org.apache.spark.sql.catalyst.analysis.Analyzer.executeAndCheck(Analyzer.scala:151)
	at org.apache.spark.sql.hive.test.TestHiveQueryExecution.analyzed$lzycompute(TestHive.scala:606)
	at org.apache.spark.sql.hive.test.TestHiveQueryExecution.analyzed(TestHive.scala:589)
	at org.apache.spark.sql.execution.QueryExecution.assertAnalyzed(QueryExecution.scala:58)
	at org.apache.spark.sql.Dataset$.ofRows(Dataset.scala:87)
	at org.apache.spark.sql.SparkSession.table(SparkSession.scala:589)
	at org.apache.spark.sql.execution.command.DropTableCommand.run(ddl.scala:241)
	at org.apache.spark.sql.execution.command.ExecutedCommandExec.sideEffectResult$lzycompute(commands.scala:70)
	at org.apache.spark.sql.execution.command.ExecutedCommandExec.sideEffectResult(commands.scala:68)
	at org.apache.spark.sql.execution.command.ExecutedCommandExec.executeCollect(commands.scala:79)
	at org.apache.spark.sql.Dataset.$anonfun$logicalPlan$1(Dataset.scala:226)
	at org.apache.spark.sql.Dataset.$anonfun$withAction$1(Dataset.scala:3487)
	at org.apache.spark.sql.execution.SQLExecution$.$anonfun$withNewExecutionId$4(SQLExecution.scala:100)
	at org.apache.spark.sql.execution.SQLExecution$.withSQLConfPropagated(SQLExecution.scala:160)
	at org.apache.spark.sql.execution.SQLExecution$.withNewExecutionId(SQLExecution.scala:87)
	at org.apache.spark.sql.Dataset.withAction(Dataset.scala:3485)
	at org.apache.spark.sql.Dataset.<init>(Dataset.scala:226)
	at org.apache.spark.sql.Dataset$.ofRows(Dataset.scala:88)
	at org.apache.spark.sql.hive.test.TestHiveSparkSession.sql(TestHive.scala:238)
	at org.apache.spark.sql.test.SQLTestUtilsBase.$anonfun$withTable$2(SQLTestUtils.scala:291)
	at scala.collection.IndexedSeqOptimized.foreach(IndexedSeqOptimized.scala:36)
	at scala.collection.IndexedSeqOptimized.foreach$(IndexedSeqOptimized.scala:33)
	at scala.collection.mutable.WrappedArray.foreach(WrappedArray.scala:38)
	at org.apache.spark.sql.test.SQLTestUtilsBase.$anonfun$withTable$1(SQLTestUtils.scala:290)
	at org.apache.spark.util.Utils$.tryWithSafeFinally(Utils.scala:1386)
	at org.apache.spark.sql.test.SQLTestUtilsBase.withTable(SQLTestUtils.scala:290)
	at org.apache.spark.sql.test.SQLTestUtilsBase.withTable$(SQLTestUtils.scala:288)
	at org.apache.spark.sql.execution.datasources.parquet.ParquetCompatibilityTest.withTable(ParquetCompatibilityTest.scala:35)
	at org.apache.spark.sql.hive.ParquetHiveCompatibilitySuite.testParquetHiveCompatibility(ParquetHiveCompatibilitySuite.scala:47)
	at org.apache.spark.sql.hive.ParquetHiveCompatibilitySuite.$anonfun$new$2(ParquetHiveCompatibilitySuite.scala:98)
	at scala.runtime.java8.JFunction0$mcV$sp.apply(JFunction0$mcV$sp.java:23)
	at org.scalatest.OutcomeOf.outcomeOf(OutcomeOf.scala:85)
	at org.scalatest.OutcomeOf.outcomeOf$(OutcomeOf.scala:83)
	at org.scalatest.OutcomeOf$.outcomeOf(OutcomeOf.scala:104)
	at org.scalatest.Transformer.apply(Transformer.scala:22)
	at org.scalatest.Transformer.apply(Transformer.scala:20)
	at org.scalatest.FunSuiteLike$$anon$1.apply(FunSuiteLike.scala:186)
	at org.apache.spark.SparkFunSuite.withFixture(SparkFunSuite.scala:149)
	at org.scalatest.FunSuiteLike.invokeWithFixture$1(FunSuiteLike.scala:184)
	at org.scalatest.FunSuiteLike.$anonfun$runTest$1(FunSuiteLike.scala:196)
	at org.scalatest.SuperEngine.runTestImpl(Engine.scala:286)
	at org.scalatest.FunSuiteLike.runTest(FunSuiteLike.scala:196)
	at org.scalatest.FunSuiteLike.runTest$(FunSuiteLike.scala:178)
	at org.apache.spark.SparkFunSuite.org$scalatest$BeforeAndAfterEach$$super$runTest(SparkFunSuite.scala:56)
	at org.scalatest.BeforeAndAfterEach.runTest(BeforeAndAfterEach.scala:221)
	at org.scalatest.BeforeAndAfterEach.runTest$(BeforeAndAfterEach.scala:214)
	at org.apache.spark.SparkFunSuite.runTest(SparkFunSuite.scala:56)
	at org.scalatest.FunSuiteLike.$anonfun$runTests$1(FunSuiteLike.scala:229)
	at org.scalatest.SuperEngine.$anonfun$runTestsInBranch$1(Engine.scala:393)
	at scala.collection.immutable.List.foreach(List.scala:392)
	at org.scalatest.SuperEngine.traverseSubNodes$1(Engine.scala:381)
	at org.scalatest.SuperEngine.runTestsInBranch(Engine.scala:376)
	at org.scalatest.SuperEngine.runTestsImpl(Engine.scala:458)
	at org.scalatest.FunSuiteLike.runTests(FunSuiteLike.scala:229)
	at org.scalatest.FunSuiteLike.runTests$(FunSuiteLike.scala:228)
	at org.scalatest.FunSuite.runTests(FunSuite.scala:1560)
	at org.scalatest.Suite.run(Suite.scala:1124)
	at org.scalatest.Suite.run$(Suite.scala:1106)
	at org.scalatest.FunSuite.org$scalatest$FunSuiteLike$$super$run(FunSuite.scala:1560)
	at org.scalatest.FunSuiteLike.$anonfun$run$1(FunSuiteLike.scala:233)
	at org.scalatest.SuperEngine.runImpl(Engine.scala:518)
	at org.scalatest.FunSuiteLike.run(FunSuiteLike.scala:233)
	at org.scalatest.FunSuiteLike.run$(FunSuiteLike.scala:232)
	at org.apache.spark.SparkFunSuite.org$scalatest$BeforeAndAfterAll$$super$run(SparkFunSuite.scala:56)
	at org.scalatest.BeforeAndAfterAll.liftedTree1$1(BeforeAndAfterAll.scala:213)
	at org.scalatest.BeforeAndAfterAll.run(BeforeAndAfterAll.scala:210)
	at org.scalatest.BeforeAndAfterAll.run$(BeforeAndAfterAll.scala:208)
	at org.apache.spark.SparkFunSuite.run(SparkFunSuite.scala:56)
	at org.scalatest.tools.Framework.org$scalatest$tools$Framework$$runSuite(Framework.scala:317)
	at org.scalatest.tools.Framework$ScalaTestTask.execute(Framework.scala:510)
	at sbt.ForkMain$Run$2.call(ForkMain.java:296)
	at sbt.ForkMain$Run$2.call(ForkMain.java:286)
	at java.util.concurrent.FutureTask.run(FutureTask.java:266)
	at java.util.concurrent.ThreadPoolExecutor.runWorker(ThreadPoolExecutor.java:1149)
	at java.util.concurrent.ThreadPoolExecutor$Worker.run(ThreadPoolExecutor.java:624)
	at java.lang.Thread.run(Thread.java:748)
[info] - SPARK-10177 timestamp (1 second, 154 milliseconds)
08:47:32.697 WARN org.apache.spark.sql.execution.command.DropTableCommand: org.apache.spark.sql.AnalysisException: Path does not exist: file:/home/jenkins/workspace/NewSparkPullRequestBuilder/target/tmp/spark-1266aca9-724d-42b4-b4ed-53cbdf3d1a09;
org.apache.spark.sql.AnalysisException: Path does not exist: file:/home/jenkins/workspace/NewSparkPullRequestBuilder/target/tmp/spark-1266aca9-724d-42b4-b4ed-53cbdf3d1a09;
	at org.apache.spark.sql.execution.datasources.DataSource$.$anonfun$checkAndGlobPathIfNecessary$1(DataSource.scala:759)
	at scala.collection.TraversableLike.$anonfun$flatMap$1(TraversableLike.scala:245)
	at scala.collection.immutable.List.foreach(List.scala:392)
	at scala.collection.TraversableLike.flatMap(TraversableLike.scala:245)
	at scala.collection.TraversableLike.flatMap$(TraversableLike.scala:242)
	at scala.collection.immutable.List.flatMap(List.scala:355)
	at org.apache.spark.sql.execution.datasources.DataSource$.checkAndGlobPathIfNecessary(DataSource.scala:746)
	at org.apache.spark.sql.execution.datasources.DataSource.checkAndGlobPathIfNecessary(DataSource.scala:575)
	at org.apache.spark.sql.execution.datasources.DataSource.resolveRelation(DataSource.scala:398)
	at org.apache.spark.sql.hive.HiveMetastoreCatalog.$anonfun$convertToLogicalRelation$5(HiveMetastoreCatalog.scala:248)
	at scala.Option.getOrElse(Option.scala:189)
	at org.apache.spark.sql.hive.HiveMetastoreCatalog.$anonfun$convertToLogicalRelation$4(HiveMetastoreCatalog.scala:238)
	at org.apache.spark.sql.hive.HiveMetastoreCatalog.withTableCreationLock(HiveMetastoreCatalog.scala:58)
	at org.apache.spark.sql.hive.HiveMetastoreCatalog.convertToLogicalRelation(HiveMetastoreCatalog.scala:231)
	at org.apache.spark.sql.hive.HiveMetastoreCatalog.convert(HiveMetastoreCatalog.scala:137)
	at org.apache.spark.sql.hive.RelationConversions$$anonfun$apply$4.applyOrElse(HiveStrategies.scala:220)
	at org.apache.spark.sql.hive.RelationConversions$$anonfun$apply$4.applyOrElse(HiveStrategies.scala:207)
	at org.apache.spark.sql.catalyst.plans.logical.AnalysisHelper.$anonfun$resolveOperatorsDown$2(AnalysisHelper.scala:108)
	at org.apache.spark.sql.catalyst.trees.CurrentOrigin$.withOrigin(TreeNode.scala:72)
	at org.apache.spark.sql.catalyst.plans.logical.AnalysisHelper.$anonfun$resolveOperatorsDown$1(AnalysisHelper.scala:108)
	at org.apache.spark.sql.catalyst.plans.logical.AnalysisHelper$.allowInvokingTransformsInAnalyzer(AnalysisHelper.scala:194)
	at org.apache.spark.sql.catalyst.plans.logical.AnalysisHelper.resolveOperatorsDown(AnalysisHelper.scala:106)
	at org.apache.spark.sql.catalyst.plans.logical.AnalysisHelper.resolveOperatorsDown$(AnalysisHelper.scala:104)
	at org.apache.spark.sql.catalyst.plans.logical.LogicalPlan.resolveOperatorsDown(LogicalPlan.scala:29)
	at org.apache.spark.sql.catalyst.plans.logical.AnalysisHelper.$anonfun$resolveOperatorsDown$4(AnalysisHelper.scala:113)
	at org.apache.spark.sql.catalyst.trees.TreeNode.$anonfun$mapChildren$1(TreeNode.scala:376)
	at org.apache.spark.sql.catalyst.trees.TreeNode.mapProductIterator(TreeNode.scala:214)
	at org.apache.spark.sql.catalyst.trees.TreeNode.mapChildren(TreeNode.scala:374)
	at org.apache.spark.sql.catalyst.trees.TreeNode.mapChildren(TreeNode.scala:327)
	at org.apache.spark.sql.catalyst.plans.logical.AnalysisHelper.$anonfun$resolveOperatorsDown$1(AnalysisHelper.scala:113)
	at org.apache.spark.sql.catalyst.plans.logical.AnalysisHelper$.allowInvokingTransformsInAnalyzer(AnalysisHelper.scala:194)
	at org.apache.spark.sql.catalyst.plans.logical.AnalysisHelper.resolveOperatorsDown(AnalysisHelper.scala:106)
	at org.apache.spark.sql.catalyst.plans.logical.AnalysisHelper.resolveOperatorsDown$(AnalysisHelper.scala:104)
	at org.apache.spark.sql.catalyst.plans.logical.LogicalPlan.resolveOperatorsDown(LogicalPlan.scala:29)
	at org.apache.spark.sql.catalyst.plans.logical.AnalysisHelper.resolveOperators(AnalysisHelper.scala:73)
	at org.apache.spark.sql.catalyst.plans.logical.AnalysisHelper.resolveOperators$(AnalysisHelper.scala:72)
	at org.apache.spark.sql.catalyst.plans.logical.LogicalPlan.resolveOperators(LogicalPlan.scala:29)
	at org.apache.spark.sql.hive.RelationConversions.apply(HiveStrategies.scala:207)
	at org.apache.spark.sql.hive.RelationConversions.apply(HiveStrategies.scala:191)
	at org.apache.spark.sql.catalyst.rules.RuleExecutor.$anonfun$execute$2(RuleExecutor.scala:130)
	at scala.collection.IndexedSeqOptimized.foldLeft(IndexedSeqOptimized.scala:60)
	at scala.collection.IndexedSeqOptimized.foldLeft$(IndexedSeqOptimized.scala:68)
	at scala.collection.mutable.ArrayBuffer.foldLeft(ArrayBuffer.scala:49)
	at org.apache.spark.sql.catalyst.rules.RuleExecutor.$anonfun$execute$1(RuleExecutor.scala:127)
	at org.apache.spark.sql.catalyst.rules.RuleExecutor.$anonfun$execute$1$adapted(RuleExecutor.scala:119)
	at scala.collection.immutable.List.foreach(List.scala:392)
	at org.apache.spark.sql.catalyst.rules.RuleExecutor.execute(RuleExecutor.scala:119)
	at org.apache.spark.sql.catalyst.analysis.Analyzer.org$apache$spark$sql$catalyst$analysis$Analyzer$$executeSameContext(Analyzer.scala:174)
	at org.apache.spark.sql.catalyst.analysis.Analyzer.execute(Analyzer.scala:168)
	at org.apache.spark.sql.catalyst.analysis.Analyzer.execute(Analyzer.scala:128)
	at org.apache.spark.sql.catalyst.rules.RuleExecutor.$anonfun$executeAndTrack$1(RuleExecutor.scala:98)
	at org.apache.spark.sql.catalyst.QueryPlanningTracker$.withTracker(QueryPlanningTracker.scala:88)
	at org.apache.spark.sql.catalyst.rules.RuleExecutor.executeAndTrack(RuleExecutor.scala:98)
	at org.apache.spark.sql.catalyst.analysis.Analyzer.$anonfun$executeAndCheck$1(Analyzer.scala:152)
	at org.apache.spark.sql.catalyst.plans.logical.AnalysisHelper$.markInAnalyzer(AnalysisHelper.scala:201)
	at org.apache.spark.sql.catalyst.analysis.Analyzer.executeAndCheck(Analyzer.scala:151)
	at org.apache.spark.sql.hive.test.TestHiveQueryExecution.analyzed$lzycompute(TestHive.scala:606)
	at org.apache.spark.sql.hive.test.TestHiveQueryExecution.analyzed(TestHive.scala:589)
	at org.apache.spark.sql.execution.QueryExecution.assertAnalyzed(QueryExecution.scala:58)
	at org.apache.spark.sql.Dataset$.ofRows(Dataset.scala:87)
	at org.apache.spark.sql.SparkSession.table(SparkSession.scala:589)
	at org.apache.spark.sql.execution.command.DropTableCommand.run(ddl.scala:241)
	at org.apache.spark.sql.execution.command.ExecutedCommandExec.sideEffectResult$lzycompute(commands.scala:70)
	at org.apache.spark.sql.execution.command.ExecutedCommandExec.sideEffectResult(commands.scala:68)
	at org.apache.spark.sql.execution.command.ExecutedCommandExec.executeCollect(commands.scala:79)
	at org.apache.spark.sql.Dataset.$anonfun$logicalPlan$1(Dataset.scala:226)
	at org.apache.spark.sql.Dataset.$anonfun$withAction$1(Dataset.scala:3487)
	at org.apache.spark.sql.execution.SQLExecution$.$anonfun$withNewExecutionId$4(SQLExecution.scala:100)
	at org.apache.spark.sql.execution.SQLExecution$.withSQLConfPropagated(SQLExecution.scala:160)
	at org.apache.spark.sql.execution.SQLExecution$.withNewExecutionId(SQLExecution.scala:87)
	at org.apache.spark.sql.Dataset.withAction(Dataset.scala:3485)
	at org.apache.spark.sql.Dataset.<init>(Dataset.scala:226)
	at org.apache.spark.sql.Dataset$.ofRows(Dataset.scala:88)
	at org.apache.spark.sql.hive.test.TestHiveSparkSession.sql(TestHive.scala:238)
	at org.apache.spark.sql.test.SQLTestUtilsBase.$anonfun$withTable$2(SQLTestUtils.scala:291)
	at scala.collection.IndexedSeqOptimized.foreach(IndexedSeqOptimized.scala:36)
	at scala.collection.IndexedSeqOptimized.foreach$(IndexedSeqOptimized.scala:33)
	at scala.collection.mutable.WrappedArray.foreach(WrappedArray.scala:38)
	at org.apache.spark.sql.test.SQLTestUtilsBase.$anonfun$withTable$1(SQLTestUtils.scala:290)
	at org.apache.spark.util.Utils$.tryWithSafeFinally(Utils.scala:1386)
	at org.apache.spark.sql.test.SQLTestUtilsBase.withTable(SQLTestUtils.scala:290)
	at org.apache.spark.sql.test.SQLTestUtilsBase.withTable$(SQLTestUtils.scala:288)
	at org.apache.spark.sql.execution.datasources.parquet.ParquetCompatibilityTest.withTable(ParquetCompatibilityTest.scala:35)
	at org.apache.spark.sql.hive.ParquetHiveCompatibilitySuite.testParquetHiveCompatibility(ParquetHiveCompatibilitySuite.scala:47)
	at org.apache.spark.sql.hive.ParquetHiveCompatibilitySuite.$anonfun$new$3(ParquetHiveCompatibilitySuite.scala:111)
	at scala.runtime.java8.JFunction0$mcV$sp.apply(JFunction0$mcV$sp.java:23)
	at org.scalatest.OutcomeOf.outcomeOf(OutcomeOf.scala:85)
	at org.scalatest.OutcomeOf.outcomeOf$(OutcomeOf.scala:83)
	at org.scalatest.OutcomeOf$.outcomeOf(OutcomeOf.scala:104)
	at org.scalatest.Transformer.apply(Transformer.scala:22)
	at org.scalatest.Transformer.apply(Transformer.scala:20)
	at org.scalatest.FunSuiteLike$$anon$1.apply(FunSuiteLike.scala:186)
	at org.apache.spark.SparkFunSuite.withFixture(SparkFunSuite.scala:149)
	at org.scalatest.FunSuiteLike.invokeWithFixture$1(FunSuiteLike.scala:184)
	at org.scalatest.FunSuiteLike.$anonfun$runTest$1(FunSuiteLike.scala:196)
	at org.scalatest.SuperEngine.runTestImpl(Engine.scala:286)
	at org.scalatest.FunSuiteLike.runTest(FunSuiteLike.scala:196)
	at org.scalatest.FunSuiteLike.runTest$(FunSuiteLike.scala:178)
	at org.apache.spark.SparkFunSuite.org$scalatest$BeforeAndAfterEach$$super$runTest(SparkFunSuite.scala:56)
	at org.scalatest.BeforeAndAfterEach.runTest(BeforeAndAfterEach.scala:221)
	at org.scalatest.BeforeAndAfterEach.runTest$(BeforeAndAfterEach.scala:214)
	at org.apache.spark.SparkFunSuite.runTest(SparkFunSuite.scala:56)
	at org.scalatest.FunSuiteLike.$anonfun$runTests$1(FunSuiteLike.scala:229)
	at org.scalatest.SuperEngine.$anonfun$runTestsInBranch$1(Engine.scala:393)
	at scala.collection.immutable.List.foreach(List.scala:392)
	at org.scalatest.SuperEngine.traverseSubNodes$1(Engine.scala:381)
	at org.scalatest.SuperEngine.runTestsInBranch(Engine.scala:376)
	at org.scalatest.SuperEngine.runTestsImpl(Engine.scala:458)
	at org.scalatest.FunSuiteLike.runTests(FunSuiteLike.scala:229)
	at org.scalatest.FunSuiteLike.runTests$(FunSuiteLike.scala:228)
	at org.scalatest.FunSuite.runTests(FunSuite.scala:1560)
	at org.scalatest.Suite.run(Suite.scala:1124)
	at org.scalatest.Suite.run$(Suite.scala:1106)
	at org.scalatest.FunSuite.org$scalatest$FunSuiteLike$$super$run(FunSuite.scala:1560)
	at org.scalatest.FunSuiteLike.$anonfun$run$1(FunSuiteLike.scala:233)
	at org.scalatest.SuperEngine.runImpl(Engine.scala:518)
	at org.scalatest.FunSuiteLike.run(FunSuiteLike.scala:233)
	at org.scalatest.FunSuiteLike.run$(FunSuiteLike.scala:232)
	at org.apache.spark.SparkFunSuite.org$scalatest$BeforeAndAfterAll$$super$run(SparkFunSuite.scala:56)
	at org.scalatest.BeforeAndAfterAll.liftedTree1$1(BeforeAndAfterAll.scala:213)
	at org.scalatest.BeforeAndAfterAll.run(BeforeAndAfterAll.scala:210)
	at org.scalatest.BeforeAndAfterAll.run$(BeforeAndAfterAll.scala:208)
	at org.apache.spark.SparkFunSuite.run(SparkFunSuite.scala:56)
	at org.scalatest.tools.Framework.org$scalatest$tools$Framework$$runSuite(Framework.scala:317)
	at org.scalatest.tools.Framework$ScalaTestTask.execute(Framework.scala:510)
	at sbt.ForkMain$Run$2.call(ForkMain.java:296)
	at sbt.ForkMain$Run$2.call(ForkMain.java:286)
	at java.util.concurrent.FutureTask.run(FutureTask.java:266)
	at java.util.concurrent.ThreadPoolExecutor.runWorker(ThreadPoolExecutor.java:1149)
	at java.util.concurrent.ThreadPoolExecutor$Worker.run(ThreadPoolExecutor.java:624)
	at java.lang.Thread.run(Thread.java:748)
[info] - array (1 second, 360 milliseconds)
08:47:33.958 WARN org.apache.spark.sql.execution.command.DropTableCommand: org.apache.spark.sql.AnalysisException: Path does not exist: file:/home/jenkins/workspace/NewSparkPullRequestBuilder/target/tmp/spark-9b39de0f-8aa0-4791-9fde-fa44cd3a8170;
org.apache.spark.sql.AnalysisException: Path does not exist: file:/home/jenkins/workspace/NewSparkPullRequestBuilder/target/tmp/spark-9b39de0f-8aa0-4791-9fde-fa44cd3a8170;
	at org.apache.spark.sql.execution.datasources.DataSource$.$anonfun$checkAndGlobPathIfNecessary$1(DataSource.scala:759)
	at scala.collection.TraversableLike.$anonfun$flatMap$1(TraversableLike.scala:245)
	at scala.collection.immutable.List.foreach(List.scala:392)
	at scala.collection.TraversableLike.flatMap(TraversableLike.scala:245)
	at scala.collection.TraversableLike.flatMap$(TraversableLike.scala:242)
	at scala.collection.immutable.List.flatMap(List.scala:355)
	at org.apache.spark.sql.execution.datasources.DataSource$.checkAndGlobPathIfNecessary(DataSource.scala:746)
	at org.apache.spark.sql.execution.datasources.DataSource.checkAndGlobPathIfNecessary(DataSource.scala:575)
	at org.apache.spark.sql.execution.datasources.DataSource.resolveRelation(DataSource.scala:398)
	at org.apache.spark.sql.hive.HiveMetastoreCatalog.$anonfun$convertToLogicalRelation$5(HiveMetastoreCatalog.scala:248)
	at scala.Option.getOrElse(Option.scala:189)
	at org.apache.spark.sql.hive.HiveMetastoreCatalog.$anonfun$convertToLogicalRelation$4(HiveMetastoreCatalog.scala:238)
	at org.apache.spark.sql.hive.HiveMetastoreCatalog.withTableCreationLock(HiveMetastoreCatalog.scala:58)
	at org.apache.spark.sql.hive.HiveMetastoreCatalog.convertToLogicalRelation(HiveMetastoreCatalog.scala:231)
	at org.apache.spark.sql.hive.HiveMetastoreCatalog.convert(HiveMetastoreCatalog.scala:137)
	at org.apache.spark.sql.hive.RelationConversions$$anonfun$apply$4.applyOrElse(HiveStrategies.scala:220)
	at org.apache.spark.sql.hive.RelationConversions$$anonfun$apply$4.applyOrElse(HiveStrategies.scala:207)
	at org.apache.spark.sql.catalyst.plans.logical.AnalysisHelper.$anonfun$resolveOperatorsDown$2(AnalysisHelper.scala:108)
	at org.apache.spark.sql.catalyst.trees.CurrentOrigin$.withOrigin(TreeNode.scala:72)
	at org.apache.spark.sql.catalyst.plans.logical.AnalysisHelper.$anonfun$resolveOperatorsDown$1(AnalysisHelper.scala:108)
	at org.apache.spark.sql.catalyst.plans.logical.AnalysisHelper$.allowInvokingTransformsInAnalyzer(AnalysisHelper.scala:194)
	at org.apache.spark.sql.catalyst.plans.logical.AnalysisHelper.resolveOperatorsDown(AnalysisHelper.scala:106)
	at org.apache.spark.sql.catalyst.plans.logical.AnalysisHelper.resolveOperatorsDown$(AnalysisHelper.scala:104)
	at org.apache.spark.sql.catalyst.plans.logical.LogicalPlan.resolveOperatorsDown(LogicalPlan.scala:29)
	at org.apache.spark.sql.catalyst.plans.logical.AnalysisHelper.$anonfun$resolveOperatorsDown$4(AnalysisHelper.scala:113)
	at org.apache.spark.sql.catalyst.trees.TreeNode.$anonfun$mapChildren$1(TreeNode.scala:376)
	at org.apache.spark.sql.catalyst.trees.TreeNode.mapProductIterator(TreeNode.scala:214)
	at org.apache.spark.sql.catalyst.trees.TreeNode.mapChildren(TreeNode.scala:374)
	at org.apache.spark.sql.catalyst.trees.TreeNode.mapChildren(TreeNode.scala:327)
	at org.apache.spark.sql.catalyst.plans.logical.AnalysisHelper.$anonfun$resolveOperatorsDown$1(AnalysisHelper.scala:113)
	at org.apache.spark.sql.catalyst.plans.logical.AnalysisHelper$.allowInvokingTransformsInAnalyzer(AnalysisHelper.scala:194)
	at org.apache.spark.sql.catalyst.plans.logical.AnalysisHelper.resolveOperatorsDown(AnalysisHelper.scala:106)
	at org.apache.spark.sql.catalyst.plans.logical.AnalysisHelper.resolveOperatorsDown$(AnalysisHelper.scala:104)
	at org.apache.spark.sql.catalyst.plans.logical.LogicalPlan.resolveOperatorsDown(LogicalPlan.scala:29)
	at org.apache.spark.sql.catalyst.plans.logical.AnalysisHelper.resolveOperators(AnalysisHelper.scala:73)
	at org.apache.spark.sql.catalyst.plans.logical.AnalysisHelper.resolveOperators$(AnalysisHelper.scala:72)
	at org.apache.spark.sql.catalyst.plans.logical.LogicalPlan.resolveOperators(LogicalPlan.scala:29)
	at org.apache.spark.sql.hive.RelationConversions.apply(HiveStrategies.scala:207)
	at org.apache.spark.sql.hive.RelationConversions.apply(HiveStrategies.scala:191)
	at org.apache.spark.sql.catalyst.rules.RuleExecutor.$anonfun$execute$2(RuleExecutor.scala:130)
	at scala.collection.IndexedSeqOptimized.foldLeft(IndexedSeqOptimized.scala:60)
	at scala.collection.IndexedSeqOptimized.foldLeft$(IndexedSeqOptimized.scala:68)
	at scala.collection.mutable.ArrayBuffer.foldLeft(ArrayBuffer.scala:49)
	at org.apache.spark.sql.catalyst.rules.RuleExecutor.$anonfun$execute$1(RuleExecutor.scala:127)
	at org.apache.spark.sql.catalyst.rules.RuleExecutor.$anonfun$execute$1$adapted(RuleExecutor.scala:119)
	at scala.collection.immutable.List.foreach(List.scala:392)
	at org.apache.spark.sql.catalyst.rules.RuleExecutor.execute(RuleExecutor.scala:119)
	at org.apache.spark.sql.catalyst.analysis.Analyzer.org$apache$spark$sql$catalyst$analysis$Analyzer$$executeSameContext(Analyzer.scala:174)
	at org.apache.spark.sql.catalyst.analysis.Analyzer.execute(Analyzer.scala:168)
	at org.apache.spark.sql.catalyst.analysis.Analyzer.execute(Analyzer.scala:128)
	at org.apache.spark.sql.catalyst.rules.RuleExecutor.$anonfun$executeAndTrack$1(RuleExecutor.scala:98)
	at org.apache.spark.sql.catalyst.QueryPlanningTracker$.withTracker(QueryPlanningTracker.scala:88)
	at org.apache.spark.sql.catalyst.rules.RuleExecutor.executeAndTrack(RuleExecutor.scala:98)
	at org.apache.spark.sql.catalyst.analysis.Analyzer.$anonfun$executeAndCheck$1(Analyzer.scala:152)
	at org.apache.spark.sql.catalyst.plans.logical.AnalysisHelper$.markInAnalyzer(AnalysisHelper.scala:201)
	at org.apache.spark.sql.catalyst.analysis.Analyzer.executeAndCheck(Analyzer.scala:151)
	at org.apache.spark.sql.hive.test.TestHiveQueryExecution.analyzed$lzycompute(TestHive.scala:606)
	at org.apache.spark.sql.hive.test.TestHiveQueryExecution.analyzed(TestHive.scala:589)
	at org.apache.spark.sql.execution.QueryExecution.assertAnalyzed(QueryExecution.scala:58)
	at org.apache.spark.sql.Dataset$.ofRows(Dataset.scala:87)
	at org.apache.spark.sql.SparkSession.table(SparkSession.scala:589)
	at org.apache.spark.sql.execution.command.DropTableCommand.run(ddl.scala:241)
	at org.apache.spark.sql.execution.command.ExecutedCommandExec.sideEffectResult$lzycompute(commands.scala:70)
	at org.apache.spark.sql.execution.command.ExecutedCommandExec.sideEffectResult(commands.scala:68)
	at org.apache.spark.sql.execution.command.ExecutedCommandExec.executeCollect(commands.scala:79)
	at org.apache.spark.sql.Dataset.$anonfun$logicalPlan$1(Dataset.scala:226)
	at org.apache.spark.sql.Dataset.$anonfun$withAction$1(Dataset.scala:3487)
	at org.apache.spark.sql.execution.SQLExecution$.$anonfun$withNewExecutionId$4(SQLExecution.scala:100)
	at org.apache.spark.sql.execution.SQLExecution$.withSQLConfPropagated(SQLExecution.scala:160)
	at org.apache.spark.sql.execution.SQLExecution$.withNewExecutionId(SQLExecution.scala:87)
	at org.apache.spark.sql.Dataset.withAction(Dataset.scala:3485)
	at org.apache.spark.sql.Dataset.<init>(Dataset.scala:226)
	at org.apache.spark.sql.Dataset$.ofRows(Dataset.scala:88)
	at org.apache.spark.sql.hive.test.TestHiveSparkSession.sql(TestHive.scala:238)
	at org.apache.spark.sql.test.SQLTestUtilsBase.$anonfun$withTable$2(SQLTestUtils.scala:291)
	at scala.collection.IndexedSeqOptimized.foreach(IndexedSeqOptimized.scala:36)
	at scala.collection.IndexedSeqOptimized.foreach$(IndexedSeqOptimized.scala:33)
	at scala.collection.mutable.WrappedArray.foreach(WrappedArray.scala:38)
	at org.apache.spark.sql.test.SQLTestUtilsBase.$anonfun$withTable$1(SQLTestUtils.scala:290)
	at org.apache.spark.util.Utils$.tryWithSafeFinally(Utils.scala:1386)
	at org.apache.spark.sql.test.SQLTestUtilsBase.withTable(SQLTestUtils.scala:290)
	at org.apache.spark.sql.test.SQLTestUtilsBase.withTable$(SQLTestUtils.scala:288)
	at org.apache.spark.sql.execution.datasources.parquet.ParquetCompatibilityTest.withTable(ParquetCompatibilityTest.scala:35)
	at org.apache.spark.sql.hive.ParquetHiveCompatibilitySuite.testParquetHiveCompatibility(ParquetHiveCompatibilitySuite.scala:47)
	at org.apache.spark.sql.hive.ParquetHiveCompatibilitySuite.$anonfun$new$4(ParquetHiveCompatibilitySuite.scala:120)
	at scala.runtime.java8.JFunction0$mcV$sp.apply(JFunction0$mcV$sp.java:23)
	at org.scalatest.OutcomeOf.outcomeOf(OutcomeOf.scala:85)
	at org.scalatest.OutcomeOf.outcomeOf$(OutcomeOf.scala:83)
	at org.scalatest.OutcomeOf$.outcomeOf(OutcomeOf.scala:104)
	at org.scalatest.Transformer.apply(Transformer.scala:22)
	at org.scalatest.Transformer.apply(Transformer.scala:20)
	at org.scalatest.FunSuiteLike$$anon$1.apply(FunSuiteLike.scala:186)
	at org.apache.spark.SparkFunSuite.withFixture(SparkFunSuite.scala:149)
	at org.scalatest.FunSuiteLike.invokeWithFixture$1(FunSuiteLike.scala:184)
	at org.scalatest.FunSuiteLike.$anonfun$runTest$1(FunSuiteLike.scala:196)
	at org.scalatest.SuperEngine.runTestImpl(Engine.scala:286)
	at org.scalatest.FunSuiteLike.runTest(FunSuiteLike.scala:196)
	at org.scalatest.FunSuiteLike.runTest$(FunSuiteLike.scala:178)
	at org.apache.spark.SparkFunSuite.org$scalatest$BeforeAndAfterEach$$super$runTest(SparkFunSuite.scala:56)
	at org.scalatest.BeforeAndAfterEach.runTest(BeforeAndAfterEach.scala:221)
	at org.scalatest.BeforeAndAfterEach.runTest$(BeforeAndAfterEach.scala:214)
	at org.apache.spark.SparkFunSuite.runTest(SparkFunSuite.scala:56)
	at org.scalatest.FunSuiteLike.$anonfun$runTests$1(FunSuiteLike.scala:229)
	at org.scalatest.SuperEngine.$anonfun$runTestsInBranch$1(Engine.scala:393)
	at scala.collection.immutable.List.foreach(List.scala:392)
	at org.scalatest.SuperEngine.traverseSubNodes$1(Engine.scala:381)
	at org.scalatest.SuperEngine.runTestsInBranch(Engine.scala:376)
	at org.scalatest.SuperEngine.runTestsImpl(Engine.scala:458)
	at org.scalatest.FunSuiteLike.runTests(FunSuiteLike.scala:229)
	at org.scalatest.FunSuiteLike.runTests$(FunSuiteLike.scala:228)
	at org.scalatest.FunSuite.runTests(FunSuite.scala:1560)
	at org.scalatest.Suite.run(Suite.scala:1124)
	at org.scalatest.Suite.run$(Suite.scala:1106)
	at org.scalatest.FunSuite.org$scalatest$FunSuiteLike$$super$run(FunSuite.scala:1560)
	at org.scalatest.FunSuiteLike.$anonfun$run$1(FunSuiteLike.scala:233)
	at org.scalatest.SuperEngine.runImpl(Engine.scala:518)
	at org.scalatest.FunSuiteLike.run(FunSuiteLike.scala:233)
	at org.scalatest.FunSuiteLike.run$(FunSuiteLike.scala:232)
	at org.apache.spark.SparkFunSuite.org$scalatest$BeforeAndAfterAll$$super$run(SparkFunSuite.scala:56)
	at org.scalatest.BeforeAndAfterAll.liftedTree1$1(BeforeAndAfterAll.scala:213)
	at org.scalatest.BeforeAndAfterAll.run(BeforeAndAfterAll.scala:210)
	at org.scalatest.BeforeAndAfterAll.run$(BeforeAndAfterAll.scala:208)
	at org.apache.spark.SparkFunSuite.run(SparkFunSuite.scala:56)
	at org.scalatest.tools.Framework.org$scalatest$tools$Framework$$runSuite(Framework.scala:317)
	at org.scalatest.tools.Framework$ScalaTestTask.execute(Framework.scala:510)
	at sbt.ForkMain$Run$2.call(ForkMain.java:296)
	at sbt.ForkMain$Run$2.call(ForkMain.java:286)
	at java.util.concurrent.FutureTask.run(FutureTask.java:266)
	at java.util.concurrent.ThreadPoolExecutor.runWorker(ThreadPoolExecutor.java:1149)
	at java.util.concurrent.ThreadPoolExecutor$Worker.run(ThreadPoolExecutor.java:624)
	at java.lang.Thread.run(Thread.java:748)
[info] - map (1 second, 257 milliseconds)
[info] - map entries with null keys !!! IGNORED !!!
[info] - subquery/in-subquery/in-with-cte.sql (5 seconds, 261 milliseconds)
08:47:35.203 WARN org.apache.spark.sql.execution.command.DropTableCommand: org.apache.spark.sql.AnalysisException: Path does not exist: file:/home/jenkins/workspace/NewSparkPullRequestBuilder/target/tmp/spark-74b99a33-4aa7-4d83-a814-31da0393a368;
org.apache.spark.sql.AnalysisException: Path does not exist: file:/home/jenkins/workspace/NewSparkPullRequestBuilder/target/tmp/spark-74b99a33-4aa7-4d83-a814-31da0393a368;
	at org.apache.spark.sql.execution.datasources.DataSource$.$anonfun$checkAndGlobPathIfNecessary$1(DataSource.scala:759)
	at scala.collection.TraversableLike.$anonfun$flatMap$1(TraversableLike.scala:245)
	at scala.collection.immutable.List.foreach(List.scala:392)
	at scala.collection.TraversableLike.flatMap(TraversableLike.scala:245)
	at scala.collection.TraversableLike.flatMap$(TraversableLike.scala:242)
	at scala.collection.immutable.List.flatMap(List.scala:355)
	at org.apache.spark.sql.execution.datasources.DataSource$.checkAndGlobPathIfNecessary(DataSource.scala:746)
	at org.apache.spark.sql.execution.datasources.DataSource.checkAndGlobPathIfNecessary(DataSource.scala:575)
	at org.apache.spark.sql.execution.datasources.DataSource.resolveRelation(DataSource.scala:398)
	at org.apache.spark.sql.hive.HiveMetastoreCatalog.$anonfun$convertToLogicalRelation$5(HiveMetastoreCatalog.scala:248)
	at scala.Option.getOrElse(Option.scala:189)
	at org.apache.spark.sql.hive.HiveMetastoreCatalog.$anonfun$convertToLogicalRelation$4(HiveMetastoreCatalog.scala:238)
	at org.apache.spark.sql.hive.HiveMetastoreCatalog.withTableCreationLock(HiveMetastoreCatalog.scala:58)
	at org.apache.spark.sql.hive.HiveMetastoreCatalog.convertToLogicalRelation(HiveMetastoreCatalog.scala:231)
	at org.apache.spark.sql.hive.HiveMetastoreCatalog.convert(HiveMetastoreCatalog.scala:137)
	at org.apache.spark.sql.hive.RelationConversions$$anonfun$apply$4.applyOrElse(HiveStrategies.scala:220)
	at org.apache.spark.sql.hive.RelationConversions$$anonfun$apply$4.applyOrElse(HiveStrategies.scala:207)
	at org.apache.spark.sql.catalyst.plans.logical.AnalysisHelper.$anonfun$resolveOperatorsDown$2(AnalysisHelper.scala:108)
	at org.apache.spark.sql.catalyst.trees.CurrentOrigin$.withOrigin(TreeNode.scala:72)
	at org.apache.spark.sql.catalyst.plans.logical.AnalysisHelper.$anonfun$resolveOperatorsDown$1(AnalysisHelper.scala:108)
	at org.apache.spark.sql.catalyst.plans.logical.AnalysisHelper$.allowInvokingTransformsInAnalyzer(AnalysisHelper.scala:194)
	at org.apache.spark.sql.catalyst.plans.logical.AnalysisHelper.resolveOperatorsDown(AnalysisHelper.scala:106)
	at org.apache.spark.sql.catalyst.plans.logical.AnalysisHelper.resolveOperatorsDown$(AnalysisHelper.scala:104)
	at org.apache.spark.sql.catalyst.plans.logical.LogicalPlan.resolveOperatorsDown(LogicalPlan.scala:29)
	at org.apache.spark.sql.catalyst.plans.logical.AnalysisHelper.$anonfun$resolveOperatorsDown$4(AnalysisHelper.scala:113)
	at org.apache.spark.sql.catalyst.trees.TreeNode.$anonfun$mapChildren$1(TreeNode.scala:376)
	at org.apache.spark.sql.catalyst.trees.TreeNode.mapProductIterator(TreeNode.scala:214)
	at org.apache.spark.sql.catalyst.trees.TreeNode.mapChildren(TreeNode.scala:374)
	at org.apache.spark.sql.catalyst.trees.TreeNode.mapChildren(TreeNode.scala:327)
	at org.apache.spark.sql.catalyst.plans.logical.AnalysisHelper.$anonfun$resolveOperatorsDown$1(AnalysisHelper.scala:113)
	at org.apache.spark.sql.catalyst.plans.logical.AnalysisHelper$.allowInvokingTransformsInAnalyzer(AnalysisHelper.scala:194)
	at org.apache.spark.sql.catalyst.plans.logical.AnalysisHelper.resolveOperatorsDown(AnalysisHelper.scala:106)
	at org.apache.spark.sql.catalyst.plans.logical.AnalysisHelper.resolveOperatorsDown$(AnalysisHelper.scala:104)
	at org.apache.spark.sql.catalyst.plans.logical.LogicalPlan.resolveOperatorsDown(LogicalPlan.scala:29)
	at org.apache.spark.sql.catalyst.plans.logical.AnalysisHelper.resolveOperators(AnalysisHelper.scala:73)
	at org.apache.spark.sql.catalyst.plans.logical.AnalysisHelper.resolveOperators$(AnalysisHelper.scala:72)
	at org.apache.spark.sql.catalyst.plans.logical.LogicalPlan.resolveOperators(LogicalPlan.scala:29)
	at org.apache.spark.sql.hive.RelationConversions.apply(HiveStrategies.scala:207)
	at org.apache.spark.sql.hive.RelationConversions.apply(HiveStrategies.scala:191)
	at org.apache.spark.sql.catalyst.rules.RuleExecutor.$anonfun$execute$2(RuleExecutor.scala:130)
	at scala.collection.IndexedSeqOptimized.foldLeft(IndexedSeqOptimized.scala:60)
	at scala.collection.IndexedSeqOptimized.foldLeft$(IndexedSeqOptimized.scala:68)
	at scala.collection.mutable.ArrayBuffer.foldLeft(ArrayBuffer.scala:49)
	at org.apache.spark.sql.catalyst.rules.RuleExecutor.$anonfun$execute$1(RuleExecutor.scala:127)
	at org.apache.spark.sql.catalyst.rules.RuleExecutor.$anonfun$execute$1$adapted(RuleExecutor.scala:119)
	at scala.collection.immutable.List.foreach(List.scala:392)
	at org.apache.spark.sql.catalyst.rules.RuleExecutor.execute(RuleExecutor.scala:119)
	at org.apache.spark.sql.catalyst.analysis.Analyzer.org$apache$spark$sql$catalyst$analysis$Analyzer$$executeSameContext(Analyzer.scala:174)
	at org.apache.spark.sql.catalyst.analysis.Analyzer.execute(Analyzer.scala:168)
	at org.apache.spark.sql.catalyst.analysis.Analyzer.execute(Analyzer.scala:128)
	at org.apache.spark.sql.catalyst.rules.RuleExecutor.$anonfun$executeAndTrack$1(RuleExecutor.scala:98)
	at org.apache.spark.sql.catalyst.QueryPlanningTracker$.withTracker(QueryPlanningTracker.scala:88)
	at org.apache.spark.sql.catalyst.rules.RuleExecutor.executeAndTrack(RuleExecutor.scala:98)
	at org.apache.spark.sql.catalyst.analysis.Analyzer.$anonfun$executeAndCheck$1(Analyzer.scala:152)
	at org.apache.spark.sql.catalyst.plans.logical.AnalysisHelper$.markInAnalyzer(AnalysisHelper.scala:201)
	at org.apache.spark.sql.catalyst.analysis.Analyzer.executeAndCheck(Analyzer.scala:151)
	at org.apache.spark.sql.hive.test.TestHiveQueryExecution.analyzed$lzycompute(TestHive.scala:606)
	at org.apache.spark.sql.hive.test.TestHiveQueryExecution.analyzed(TestHive.scala:589)
	at org.apache.spark.sql.execution.QueryExecution.assertAnalyzed(QueryExecution.scala:58)
	at org.apache.spark.sql.Dataset$.ofRows(Dataset.scala:87)
	at org.apache.spark.sql.SparkSession.table(SparkSession.scala:589)
	at org.apache.spark.sql.execution.command.DropTableCommand.run(ddl.scala:241)
	at org.apache.spark.sql.execution.command.ExecutedCommandExec.sideEffectResult$lzycompute(commands.scala:70)
	at org.apache.spark.sql.execution.command.ExecutedCommandExec.sideEffectResult(commands.scala:68)
	at org.apache.spark.sql.execution.command.ExecutedCommandExec.executeCollect(commands.scala:79)
	at org.apache.spark.sql.Dataset.$anonfun$logicalPlan$1(Dataset.scala:226)
	at org.apache.spark.sql.Dataset.$anonfun$withAction$1(Dataset.scala:3487)
	at org.apache.spark.sql.execution.SQLExecution$.$anonfun$withNewExecutionId$4(SQLExecution.scala:100)
	at org.apache.spark.sql.execution.SQLExecution$.withSQLConfPropagated(SQLExecution.scala:160)
	at org.apache.spark.sql.execution.SQLExecution$.withNewExecutionId(SQLExecution.scala:87)
	at org.apache.spark.sql.Dataset.withAction(Dataset.scala:3485)
	at org.apache.spark.sql.Dataset.<init>(Dataset.scala:226)
	at org.apache.spark.sql.Dataset$.ofRows(Dataset.scala:88)
	at org.apache.spark.sql.hive.test.TestHiveSparkSession.sql(TestHive.scala:238)
	at org.apache.spark.sql.test.SQLTestUtilsBase.$anonfun$withTable$2(SQLTestUtils.scala:291)
	at scala.collection.IndexedSeqOptimized.foreach(IndexedSeqOptimized.scala:36)
	at scala.collection.IndexedSeqOptimized.foreach$(IndexedSeqOptimized.scala:33)
	at scala.collection.mutable.WrappedArray.foreach(WrappedArray.scala:38)
	at org.apache.spark.sql.test.SQLTestUtilsBase.$anonfun$withTable$1(SQLTestUtils.scala:290)
	at org.apache.spark.util.Utils$.tryWithSafeFinally(Utils.scala:1386)
	at org.apache.spark.sql.test.SQLTestUtilsBase.withTable(SQLTestUtils.scala:290)
	at org.apache.spark.sql.test.SQLTestUtilsBase.withTable$(SQLTestUtils.scala:288)
	at org.apache.spark.sql.execution.datasources.parquet.ParquetCompatibilityTest.withTable(ParquetCompatibilityTest.scala:35)
	at org.apache.spark.sql.hive.ParquetHiveCompatibilitySuite.testParquetHiveCompatibility(ParquetHiveCompatibilitySuite.scala:47)
	at org.apache.spark.sql.hive.ParquetHiveCompatibilitySuite.$anonfun$new$6(ParquetHiveCompatibilitySuite.scala:136)
	at scala.runtime.java8.JFunction0$mcV$sp.apply(JFunction0$mcV$sp.java:23)
	at org.scalatest.OutcomeOf.outcomeOf(OutcomeOf.scala:85)
	at org.scalatest.OutcomeOf.outcomeOf$(OutcomeOf.scala:83)
	at org.scalatest.OutcomeOf$.outcomeOf(OutcomeOf.scala:104)
	at org.scalatest.Transformer.apply(Transformer.scala:22)
	at org.scalatest.Transformer.apply(Transformer.scala:20)
	at org.scalatest.FunSuiteLike$$anon$1.apply(FunSuiteLike.scala:186)
	at org.apache.spark.SparkFunSuite.withFixture(SparkFunSuite.scala:149)
	at org.scalatest.FunSuiteLike.invokeWithFixture$1(FunSuiteLike.scala:184)
	at org.scalatest.FunSuiteLike.$anonfun$runTest$1(FunSuiteLike.scala:196)
	at org.scalatest.SuperEngine.runTestImpl(Engine.scala:286)
	at org.scalatest.FunSuiteLike.runTest(FunSuiteLike.scala:196)
	at org.scalatest.FunSuiteLike.runTest$(FunSuiteLike.scala:178)
	at org.apache.spark.SparkFunSuite.org$scalatest$BeforeAndAfterEach$$super$runTest(SparkFunSuite.scala:56)
	at org.scalatest.BeforeAndAfterEach.runTest(BeforeAndAfterEach.scala:221)
	at org.scalatest.BeforeAndAfterEach.runTest$(BeforeAndAfterEach.scala:214)
	at org.apache.spark.SparkFunSuite.runTest(SparkFunSuite.scala:56)
	at org.scalatest.FunSuiteLike.$anonfun$runTests$1(FunSuiteLike.scala:229)
	at org.scalatest.SuperEngine.$anonfun$runTestsInBranch$1(Engine.scala:393)
	at scala.collection.immutable.List.foreach(List.scala:392)
	at org.scalatest.SuperEngine.traverseSubNodes$1(Engine.scala:381)
	at org.scalatest.SuperEngine.runTestsInBranch(Engine.scala:376)
	at org.scalatest.SuperEngine.runTestsImpl(Engine.scala:458)
	at org.scalatest.FunSuiteLike.runTests(FunSuiteLike.scala:229)
	at org.scalatest.FunSuiteLike.runTests$(FunSuiteLike.scala:228)
	at org.scalatest.FunSuite.runTests(FunSuite.scala:1560)
	at org.scalatest.Suite.run(Suite.scala:1124)
	at org.scalatest.Suite.run$(Suite.scala:1106)
	at org.scalatest.FunSuite.org$scalatest$FunSuiteLike$$super$run(FunSuite.scala:1560)
	at org.scalatest.FunSuiteLike.$anonfun$run$1(FunSuiteLike.scala:233)
	at org.scalatest.SuperEngine.runImpl(Engine.scala:518)
	at org.scalatest.FunSuiteLike.run(FunSuiteLike.scala:233)
	at org.scalatest.FunSuiteLike.run$(FunSuiteLike.scala:232)
	at org.apache.spark.SparkFunSuite.org$scalatest$BeforeAndAfterAll$$super$run(SparkFunSuite.scala:56)
	at org.scalatest.BeforeAndAfterAll.liftedTree1$1(BeforeAndAfterAll.scala:213)
	at org.scalatest.BeforeAndAfterAll.run(BeforeAndAfterAll.scala:210)
	at org.scalatest.BeforeAndAfterAll.run$(BeforeAndAfterAll.scala:208)
	at org.apache.spark.SparkFunSuite.run(SparkFunSuite.scala:56)
	at org.scalatest.tools.Framework.org$scalatest$tools$Framework$$runSuite(Framework.scala:317)
	at org.scalatest.tools.Framework$ScalaTestTask.execute(Framework.scala:510)
	at sbt.ForkMain$Run$2.call(ForkMain.java:296)
	at sbt.ForkMain$Run$2.call(ForkMain.java:286)
	at java.util.concurrent.FutureTask.run(FutureTask.java:266)
	at java.util.concurrent.ThreadPoolExecutor.runWorker(ThreadPoolExecutor.java:1149)
	at java.util.concurrent.ThreadPoolExecutor$Worker.run(ThreadPoolExecutor.java:624)
	at java.lang.Thread.run(Thread.java:748)
[info] - struct (1 second, 247 milliseconds)
[info] - subquery/in-subquery/not-in-unit-tests-single-column-literal.sql (354 milliseconds)
08:47:36.490 WARN org.apache.spark.sql.execution.command.DropTableCommand: org.apache.spark.sql.AnalysisException: Path does not exist: file:/home/jenkins/workspace/NewSparkPullRequestBuilder/target/tmp/spark-c9ff30cf-7f85-4c72-88b0-7dfc6414dc77;
org.apache.spark.sql.AnalysisException: Path does not exist: file:/home/jenkins/workspace/NewSparkPullRequestBuilder/target/tmp/spark-c9ff30cf-7f85-4c72-88b0-7dfc6414dc77;
	at org.apache.spark.sql.execution.datasources.DataSource$.$anonfun$checkAndGlobPathIfNecessary$1(DataSource.scala:759)
	at scala.collection.TraversableLike.$anonfun$flatMap$1(TraversableLike.scala:245)
	at scala.collection.immutable.List.foreach(List.scala:392)
	at scala.collection.TraversableLike.flatMap(TraversableLike.scala:245)
	at scala.collection.TraversableLike.flatMap$(TraversableLike.scala:242)
	at scala.collection.immutable.List.flatMap(List.scala:355)
	at org.apache.spark.sql.execution.datasources.DataSource$.checkAndGlobPathIfNecessary(DataSource.scala:746)
	at org.apache.spark.sql.execution.datasources.DataSource.checkAndGlobPathIfNecessary(DataSource.scala:575)
	at org.apache.spark.sql.execution.datasources.DataSource.resolveRelation(DataSource.scala:398)
	at org.apache.spark.sql.hive.HiveMetastoreCatalog.$anonfun$convertToLogicalRelation$5(HiveMetastoreCatalog.scala:248)
	at scala.Option.getOrElse(Option.scala:189)
	at org.apache.spark.sql.hive.HiveMetastoreCatalog.$anonfun$convertToLogicalRelation$4(HiveMetastoreCatalog.scala:238)
	at org.apache.spark.sql.hive.HiveMetastoreCatalog.withTableCreationLock(HiveMetastoreCatalog.scala:58)
	at org.apache.spark.sql.hive.HiveMetastoreCatalog.convertToLogicalRelation(HiveMetastoreCatalog.scala:231)
	at org.apache.spark.sql.hive.HiveMetastoreCatalog.convert(HiveMetastoreCatalog.scala:137)
	at org.apache.spark.sql.hive.RelationConversions$$anonfun$apply$4.applyOrElse(HiveStrategies.scala:220)
	at org.apache.spark.sql.hive.RelationConversions$$anonfun$apply$4.applyOrElse(HiveStrategies.scala:207)
	at org.apache.spark.sql.catalyst.plans.logical.AnalysisHelper.$anonfun$resolveOperatorsDown$2(AnalysisHelper.scala:108)
	at org.apache.spark.sql.catalyst.trees.CurrentOrigin$.withOrigin(TreeNode.scala:72)
	at org.apache.spark.sql.catalyst.plans.logical.AnalysisHelper.$anonfun$resolveOperatorsDown$1(AnalysisHelper.scala:108)
	at org.apache.spark.sql.catalyst.plans.logical.AnalysisHelper$.allowInvokingTransformsInAnalyzer(AnalysisHelper.scala:194)
	at org.apache.spark.sql.catalyst.plans.logical.AnalysisHelper.resolveOperatorsDown(AnalysisHelper.scala:106)
	at org.apache.spark.sql.catalyst.plans.logical.AnalysisHelper.resolveOperatorsDown$(AnalysisHelper.scala:104)
	at org.apache.spark.sql.catalyst.plans.logical.LogicalPlan.resolveOperatorsDown(LogicalPlan.scala:29)
	at org.apache.spark.sql.catalyst.plans.logical.AnalysisHelper.$anonfun$resolveOperatorsDown$4(AnalysisHelper.scala:113)
	at org.apache.spark.sql.catalyst.trees.TreeNode.$anonfun$mapChildren$1(TreeNode.scala:376)
	at org.apache.spark.sql.catalyst.trees.TreeNode.mapProductIterator(TreeNode.scala:214)
	at org.apache.spark.sql.catalyst.trees.TreeNode.mapChildren(TreeNode.scala:374)
	at org.apache.spark.sql.catalyst.trees.TreeNode.mapChildren(TreeNode.scala:327)
	at org.apache.spark.sql.catalyst.plans.logical.AnalysisHelper.$anonfun$resolveOperatorsDown$1(AnalysisHelper.scala:113)
	at org.apache.spark.sql.catalyst.plans.logical.AnalysisHelper$.allowInvokingTransformsInAnalyzer(AnalysisHelper.scala:194)
	at org.apache.spark.sql.catalyst.plans.logical.AnalysisHelper.resolveOperatorsDown(AnalysisHelper.scala:106)
	at org.apache.spark.sql.catalyst.plans.logical.AnalysisHelper.resolveOperatorsDown$(AnalysisHelper.scala:104)
	at org.apache.spark.sql.catalyst.plans.logical.LogicalPlan.resolveOperatorsDown(LogicalPlan.scala:29)
	at org.apache.spark.sql.catalyst.plans.logical.AnalysisHelper.resolveOperators(AnalysisHelper.scala:73)
	at org.apache.spark.sql.catalyst.plans.logical.AnalysisHelper.resolveOperators$(AnalysisHelper.scala:72)
	at org.apache.spark.sql.catalyst.plans.logical.LogicalPlan.resolveOperators(LogicalPlan.scala:29)
	at org.apache.spark.sql.hive.RelationConversions.apply(HiveStrategies.scala:207)
	at org.apache.spark.sql.hive.RelationConversions.apply(HiveStrategies.scala:191)
	at org.apache.spark.sql.catalyst.rules.RuleExecutor.$anonfun$execute$2(RuleExecutor.scala:130)
	at scala.collection.IndexedSeqOptimized.foldLeft(IndexedSeqOptimized.scala:60)
	at scala.collection.IndexedSeqOptimized.foldLeft$(IndexedSeqOptimized.scala:68)
	at scala.collection.mutable.ArrayBuffer.foldLeft(ArrayBuffer.scala:49)
	at org.apache.spark.sql.catalyst.rules.RuleExecutor.$anonfun$execute$1(RuleExecutor.scala:127)
	at org.apache.spark.sql.catalyst.rules.RuleExecutor.$anonfun$execute$1$adapted(RuleExecutor.scala:119)
	at scala.collection.immutable.List.foreach(List.scala:392)
	at org.apache.spark.sql.catalyst.rules.RuleExecutor.execute(RuleExecutor.scala:119)
	at org.apache.spark.sql.catalyst.analysis.Analyzer.org$apache$spark$sql$catalyst$analysis$Analyzer$$executeSameContext(Analyzer.scala:174)
	at org.apache.spark.sql.catalyst.analysis.Analyzer.execute(Analyzer.scala:168)
	at org.apache.spark.sql.catalyst.analysis.Analyzer.execute(Analyzer.scala:128)
	at org.apache.spark.sql.catalyst.rules.RuleExecutor.$anonfun$executeAndTrack$1(RuleExecutor.scala:98)
	at org.apache.spark.sql.catalyst.QueryPlanningTracker$.withTracker(QueryPlanningTracker.scala:88)
	at org.apache.spark.sql.catalyst.rules.RuleExecutor.executeAndTrack(RuleExecutor.scala:98)
	at org.apache.spark.sql.catalyst.analysis.Analyzer.$anonfun$executeAndCheck$1(Analyzer.scala:152)
	at org.apache.spark.sql.catalyst.plans.logical.AnalysisHelper$.markInAnalyzer(AnalysisHelper.scala:201)
	at org.apache.spark.sql.catalyst.analysis.Analyzer.executeAndCheck(Analyzer.scala:151)
	at org.apache.spark.sql.hive.test.TestHiveQueryExecution.analyzed$lzycompute(TestHive.scala:606)
	at org.apache.spark.sql.hive.test.TestHiveQueryExecution.analyzed(TestHive.scala:589)
	at org.apache.spark.sql.execution.QueryExecution.assertAnalyzed(QueryExecution.scala:58)
	at org.apache.spark.sql.Dataset$.ofRows(Dataset.scala:87)
	at org.apache.spark.sql.SparkSession.table(SparkSession.scala:589)
	at org.apache.spark.sql.execution.command.DropTableCommand.run(ddl.scala:241)
	at org.apache.spark.sql.execution.command.ExecutedCommandExec.sideEffectResult$lzycompute(commands.scala:70)
	at org.apache.spark.sql.execution.command.ExecutedCommandExec.sideEffectResult(commands.scala:68)
	at org.apache.spark.sql.execution.command.ExecutedCommandExec.executeCollect(commands.scala:79)
	at org.apache.spark.sql.Dataset.$anonfun$logicalPlan$1(Dataset.scala:226)
	at org.apache.spark.sql.Dataset.$anonfun$withAction$1(Dataset.scala:3487)
	at org.apache.spark.sql.execution.SQLExecution$.$anonfun$withNewExecutionId$4(SQLExecution.scala:100)
	at org.apache.spark.sql.execution.SQLExecution$.withSQLConfPropagated(SQLExecution.scala:160)
	at org.apache.spark.sql.execution.SQLExecution$.withNewExecutionId(SQLExecution.scala:87)
	at org.apache.spark.sql.Dataset.withAction(Dataset.scala:3485)
	at org.apache.spark.sql.Dataset.<init>(Dataset.scala:226)
	at org.apache.spark.sql.Dataset$.ofRows(Dataset.scala:88)
	at org.apache.spark.sql.hive.test.TestHiveSparkSession.sql(TestHive.scala:238)
	at org.apache.spark.sql.test.SQLTestUtilsBase.$anonfun$withTable$2(SQLTestUtils.scala:291)
	at scala.collection.IndexedSeqOptimized.foreach(IndexedSeqOptimized.scala:36)
	at scala.collection.IndexedSeqOptimized.foreach$(IndexedSeqOptimized.scala:33)
	at scala.collection.mutable.WrappedArray.foreach(WrappedArray.scala:38)
	at org.apache.spark.sql.test.SQLTestUtilsBase.$anonfun$withTable$1(SQLTestUtils.scala:290)
	at org.apache.spark.util.Utils$.tryWithSafeFinally(Utils.scala:1386)
	at org.apache.spark.sql.test.SQLTestUtilsBase.withTable(SQLTestUtils.scala:290)
	at org.apache.spark.sql.test.SQLTestUtilsBase.withTable$(SQLTestUtils.scala:288)
	at org.apache.spark.sql.execution.datasources.parquet.ParquetCompatibilityTest.withTable(ParquetCompatibilityTest.scala:35)
	at org.apache.spark.sql.hive.ParquetHiveCompatibilitySuite.testParquetHiveCompatibility(ParquetHiveCompatibilitySuite.scala:47)
	at org.apache.spark.sql.hive.ParquetHiveCompatibilitySuite.$anonfun$new$7(ParquetHiveCompatibilitySuite.scala:142)
	at scala.runtime.java8.JFunction0$mcV$sp.apply(JFunction0$mcV$sp.java:23)
	at org.scalatest.OutcomeOf.outcomeOf(OutcomeOf.scala:85)
	at org.scalatest.OutcomeOf.outcomeOf$(OutcomeOf.scala:83)
	at org.scalatest.OutcomeOf$.outcomeOf(OutcomeOf.scala:104)
	at org.scalatest.Transformer.apply(Transformer.scala:22)
	at org.scalatest.Transformer.apply(Transformer.scala:20)
	at org.scalatest.FunSuiteLike$$anon$1.apply(FunSuiteLike.scala:186)
	at org.apache.spark.SparkFunSuite.withFixture(SparkFunSuite.scala:149)
	at org.scalatest.FunSuiteLike.invokeWithFixture$1(FunSuiteLike.scala:184)
	at org.scalatest.FunSuiteLike.$anonfun$runTest$1(FunSuiteLike.scala:196)
	at org.scalatest.SuperEngine.runTestImpl(Engine.scala:286)
	at org.scalatest.FunSuiteLike.runTest(FunSuiteLike.scala:196)
	at org.scalatest.FunSuiteLike.runTest$(FunSuiteLike.scala:178)
	at org.apache.spark.SparkFunSuite.org$scalatest$BeforeAndAfterEach$$super$runTest(SparkFunSuite.scala:56)
	at org.scalatest.BeforeAndAfterEach.runTest(BeforeAndAfterEach.scala:221)
	at org.scalatest.BeforeAndAfterEach.runTest$(BeforeAndAfterEach.scala:214)
	at org.apache.spark.SparkFunSuite.runTest(SparkFunSuite.scala:56)
	at org.scalatest.FunSuiteLike.$anonfun$runTests$1(FunSuiteLike.scala:229)
	at org.scalatest.SuperEngine.$anonfun$runTestsInBranch$1(Engine.scala:393)
	at scala.collection.immutable.List.foreach(List.scala:392)
	at org.scalatest.SuperEngine.traverseSubNodes$1(Engine.scala:381)
	at org.scalatest.SuperEngine.runTestsInBranch(Engine.scala:376)
	at org.scalatest.SuperEngine.runTestsImpl(Engine.scala:458)
	at org.scalatest.FunSuiteLike.runTests(FunSuiteLike.scala:229)
	at org.scalatest.FunSuiteLike.runTests$(FunSuiteLike.scala:228)
	at org.scalatest.FunSuite.runTests(FunSuite.scala:1560)
	at org.scalatest.Suite.run(Suite.scala:1124)
	at org.scalatest.Suite.run$(Suite.scala:1106)
	at org.scalatest.FunSuite.org$scalatest$FunSuiteLike$$super$run(FunSuite.scala:1560)
	at org.scalatest.FunSuiteLike.$anonfun$run$1(FunSuiteLike.scala:233)
	at org.scalatest.SuperEngine.runImpl(Engine.scala:518)
	at org.scalatest.FunSuiteLike.run(FunSuiteLike.scala:233)
	at org.scalatest.FunSuiteLike.run$(FunSuiteLike.scala:232)
	at org.apache.spark.SparkFunSuite.org$scalatest$BeforeAndAfterAll$$super$run(SparkFunSuite.scala:56)
	at org.scalatest.BeforeAndAfterAll.liftedTree1$1(BeforeAndAfterAll.scala:213)
	at org.scalatest.BeforeAndAfterAll.run(BeforeAndAfterAll.scala:210)
	at org.scalatest.BeforeAndAfterAll.run$(BeforeAndAfterAll.scala:208)
	at org.apache.spark.SparkFunSuite.run(SparkFunSuite.scala:56)
	at org.scalatest.tools.Framework.org$scalatest$tools$Framework$$runSuite(Framework.scala:317)
	at org.scalatest.tools.Framework$ScalaTestTask.execute(Framework.scala:510)
	at sbt.ForkMain$Run$2.call(ForkMain.java:296)
	at sbt.ForkMain$Run$2.call(ForkMain.java:286)
	at java.util.concurrent.FutureTask.run(FutureTask.java:266)
	at java.util.concurrent.ThreadPoolExecutor.runWorker(ThreadPoolExecutor.java:1149)
	at java.util.concurrent.ThreadPoolExecutor$Worker.run(ThreadPoolExecutor.java:624)
	at java.lang.Thread.run(Thread.java:748)
[info] - SPARK-16344: array of struct with a single field named 'array_element' (1 second, 294 milliseconds)
08:47:36.640 WARN org.apache.hadoop.hive.conf.HiveConf: HiveConf of name hive.internal.ss.authz.settings.applied.marker does not exist
08:47:36.640 WARN org.apache.hadoop.hive.conf.HiveConf: HiveConf of name hive.stats.jdbc.timeout does not exist
08:47:36.640 WARN org.apache.hadoop.hive.conf.HiveConf: HiveConf of name hive.stats.retries.wait does not exist
08:47:36.720 WARN org.apache.hadoop.hive.conf.HiveConf: HiveConf of name hive.internal.ss.authz.settings.applied.marker does not exist
08:47:36.720 WARN org.apache.hadoop.hive.conf.HiveConf: HiveConf of name hive.stats.jdbc.timeout does not exist
08:47:36.720 WARN org.apache.hadoop.hive.conf.HiveConf: HiveConf of name hive.stats.retries.wait does not exist
[info] Test run started
[info] Test org.apache.spark.sql.hive.JavaDataFrameSuite.testUDAF started
[info] Test org.apache.spark.sql.hive.JavaDataFrameSuite.saveTableAndQueryIt started
[info] Test run finished: 0 failed, 0 ignored, 2 total, 2.566s
[info] Test run started
[info] Test org.apache.spark.sql.hive.JavaMetastoreDataSourcesSuite.saveTableAndQueryIt started
08:47:39.801 WARN org.apache.spark.sql.hive.test.TestHiveExternalCatalog: Couldn't find corresponding Hive SerDe for data source provider org.apache.spark.sql.json. Persisting data source table `default`.`javasavedtable` into Hive metastore in Spark SQL specific format, which is NOT compatible with Hive.
[info] Test run finished: 0 failed, 0 ignored, 1 total, 0.665s
[info] ScalaTest
[info] Run completed in 1 hour, 22 minutes, 1 second.
[info] Total number of tests run: 2597
[info] Suites: completed 125, aborted 0
[info] Tests: succeeded 2597, failed 0, canceled 0, ignored 594, pending 0
[info] All tests passed.
[info] Passed: Total 2600, Failed 0, Errors 0, Passed 2600, Ignored 594
[info] - subquery/in-subquery/in-joins.sql (1 minute, 50 seconds)
[info] - subquery/in-subquery/not-in-group-by.sql (5 seconds, 724 milliseconds)
[info] - subquery/in-subquery/not-in-unit-tests-multi-column-literal.sql (324 milliseconds)
[info] - subquery/in-subquery/in-having.sql (3 seconds, 145 milliseconds)
[info] - subquery/in-subquery/in-set-operations.sql !!! IGNORED !!!
[info] - subquery/in-subquery/in-basic.sql (627 milliseconds)
[info] - subquery/in-subquery/in-order-by.sql !!! IGNORED !!!
[info] - subquery/in-subquery/not-in-joins.sql (3 seconds, 465 milliseconds)
[info] - subquery/in-subquery/simple-in.sql !!! IGNORED !!!
[info] - subquery/in-subquery/in-multiple-columns.sql (1 second, 876 milliseconds)
[info] - subquery/in-subquery/in-group-by.sql !!! IGNORED !!!
[info] - subquery/in-subquery/not-in-unit-tests-multi-column.sql (817 milliseconds)
[info] - subquery/in-subquery/in-limit.sql !!! IGNORED !!!
[info] - Check if ThriftServer can work (85 milliseconds)
[info] ScalaTest
[info] Run completed in 1 hour, 23 minutes, 39 seconds.
[info] Total number of tests run: 417
[info] Suites: completed 15, aborted 1
[info] Tests: succeeded 416, failed 1, canceled 0, ignored 17, pending 0
[info] *** 1 SUITE ABORTED ***
[info] *** 1 TEST FAILED ***
[error] Error: Total 418, Failed 1, Errors 1, Passed 416, Ignored 17
[error] Failed tests:
[error] 	org.apache.spark.sql.hive.thriftserver.SparkMetadataOperationSuite
[error] Error during tests:
[error] 	org.apache.spark.sql.hive.thriftserver.ThriftServerWithSparkContextSuite
[error] (sql-kafka-0-10/test:test) sbt.TestsFailedException: Tests unsuccessful
[error] (core/test:test) sbt.TestsFailedException: Tests unsuccessful
[error] (hive-thriftserver/test:test) sbt.TestsFailedException: Tests unsuccessful
[error] Total time: 5069 s, completed Jan 8, 2020 8:49:55 AM
[error] running /home/jenkins/workspace/NewSparkPullRequestBuilder/build/sbt -Phadoop-2.7 -Phive-2.3 -Pkubernetes -Pmesos -Phive-thriftserver -Phadoop-cloud -Pspark-ganglia-lgpl -Phive -Pkinesis-asl -Pyarn -Dtest.exclude.tags=org.apache.spark.tags.ExtendedHiveTest,org.apache.spark.tags.ExtendedYarnTest test ; received return code 1
Attempting to post to Github...
 > Post successful.
Build step 'Execute shell' marked build as failure
Archiving artifacts
Recording test results
Finished: FAILURE