FailedConsole Output

Skipping 23,450 KB.. Full Log
jNKU4P0+vIKc0PTOvWC8xrzgzOT8nv0gvODO3ICfVoyQ3xy+/JNU2Yj/Tagmf50wMjD4M7CWJ6SCJEgYhn6zEskT9nMS8dP3gkqLMvHTriiIGKaihyfl5xfk5qXrOEBpkDgMEMDIxMFQUlDDI2RQXJOYpFJdU5qTaKoEttlJQNnS1NHBzs1ayAwAGsmNKpQAAAA==, 2 total, 0.288s
[info] Test run started
[info] Test org.apache.spark.ml.feature.JavaPCASuite.testPCA started
[info] Test run finished: 0 failed, 0 ignored, 1 total, 0.33s
[info] Test run started
[info] Test org.apache.spark.mllib.feature.JavaWord2VecSuite.word2Vec started
[info] Test run finished: 0 failed, 0 ignored, 1 total, 0.151s
[info] Test run started
[info] Test org.apache.spark.mllib.random.JavaRandomRDDsSuite.testNormalVectorRDD started
[info] Test org.apache.spark.mllib.random.JavaRandomRDDsSuite.testArbitrary started
[info] Test org.apache.spark.mllib.random.JavaRandomRDDsSuite.testLogNormalVectorRDD started
[info] Test org.apache.spark.mllib.random.JavaRandomRDDsSuite.testExponentialVectorRDD started
[info] Test org.apache.spark.mllib.random.JavaRandomRDDsSuite.testUniformRDD started
[info] Test org.apache.spark.mllib.random.JavaRandomRDDsSuite.testRandomVectorRDD started
[info] Test org.apache.spark.mllib.random.JavaRandomRDDsSuite.testGammaRDD started
[info] Test org.apache.spark.mllib.random.JavaRandomRDDsSuite.testUniformVectorRDD started
[info] Test org.apache.spark.mllib.random.JavaRandomRDDsSuite.testPoissonRDD started
[info] Test org.apache.spark.mllib.random.JavaRandomRDDsSuite.testNormalRDD started
[info] Test org.apache.spark.mllib.random.JavaRandomRDDsSuite.testPoissonVectorRDD started
[info] Test org.apache.spark.mllib.random.JavaRandomRDDsSuite.testGammaVectorRDD started
[info] Test org.apache.spark.mllib.random.JavaRandomRDDsSuite.testExponentialRDD started
[info] Test org.apache.spark.mllib.random.JavaRandomRDDsSuite.testLNormalRDD started
[info] Test run finished: 0 failed, 0 ignored, 14 total, 1.814s
[info] Test run started
[info] Test org.apache.spark.mllib.stat.JavaStatisticsSuite.testCorr started
[info] Test org.apache.spark.mllib.stat.JavaStatisticsSuite.chiSqTest started
[info] Test org.apache.spark.mllib.stat.JavaStatisticsSuite.streamingTest started
[info] Test org.apache.spark.mllib.stat.JavaStatisticsSuite.kolmogorovSmirnovTest started
[info] Test run finished: 0 failed, 0 ignored, 4 total, 0.716s
[info] Test run started
[info] Test org.apache.spark.ml.attribute.JavaAttributeGroupSuite.testAttributeGroup started
[info] Test run finished: 0 failed, 0 ignored, 1 total, 0.001s
[info] Test run started
[info] Test org.apache.spark.mllib.tree.JavaDecisionTreeSuite.runDTUsingStaticMethods started
[info] Test org.apache.spark.mllib.tree.JavaDecisionTreeSuite.runDTUsingConstructor started
[info] Test run finished: 0 failed, 0 ignored, 2 total, 0.391s
[info] Test run started
[info] Test org.apache.spark.ml.classification.JavaOneVsRestSuite.oneVsRestDefaultParams started
[info] Test run finished: 0 failed, 0 ignored, 1 total, 1.994s
[info] Test run started
[info] Test org.apache.spark.mllib.clustering.JavaLDASuite.onlineOptimizerCompatibility started
[info] Test org.apache.spark.mllib.clustering.JavaLDASuite.distributedLDAModel started
[info] Test org.apache.spark.mllib.clustering.JavaLDASuite.localLDAModel started
[info] Test org.apache.spark.mllib.clustering.JavaLDASuite.localLdaMethods started
[info] Test run finished: 0 failed, 0 ignored, 4 total, 1.023s
[info] Test run started
[info] Test org.apache.spark.mllib.regression.JavaIsotonicRegressionSuite.testIsotonicRegressionJavaRDD started
[info] Test org.apache.spark.mllib.regression.JavaIsotonicRegressionSuite.testIsotonicRegressionPredictionsJavaRDD started
[info] Test run finished: 0 failed, 0 ignored, 2 total, 0.235s
[info] Test run started
[info] Test org.apache.spark.ml.attribute.JavaAttributeSuite.testBinaryAttribute started
[info] Test org.apache.spark.ml.attribute.JavaAttributeSuite.testNominalAttribute started
[info] Test org.apache.spark.ml.attribute.JavaAttributeSuite.testAttributeType started
[info] Test org.apache.spark.ml.attribute.JavaAttributeSuite.testNumericAttribute started
[info] Test run finished: 0 failed, 0 ignored, 4 total, 0.001s
[info] Test run started
[info] Test org.apache.spark.ml.regression.JavaGBTRegressorSuite.runDT started
[info] Test run finished: 0 failed, 0 ignored, 1 total, 0.472s
[info] Test run started
[info] Test org.apache.spark.ml.feature.JavaStopWordsRemoverSuite.javaCompatibilityTest started
[info] Test run finished: 0 failed, 0 ignored, 1 total, 0.1s
[info] Test run started
[info] Test org.apache.spark.mllib.classification.JavaNaiveBayesSuite.testPredictJavaRDD started
[info] Test org.apache.spark.mllib.classification.JavaNaiveBayesSuite.runUsingConstructor started
[info] Test org.apache.spark.mllib.classification.JavaNaiveBayesSuite.runUsingStaticMethods started
[info] Test org.apache.spark.mllib.classification.JavaNaiveBayesSuite.testModelTypeSetters started
[info] Test run finished: 0 failed, 0 ignored, 4 total, 2.026s
[info] Test run started
[info] Test org.apache.spark.mllib.classification.JavaStreamingLogisticRegressionSuite.javaAPI started
[info] Test run finished: 0 failed, 0 ignored, 1 total, 0.415s
[info] Test run started
[info] Test org.apache.spark.ml.stat.JavaSummarizerSuite.testSummarizer started
[info] Test run finished: 0 failed, 0 ignored, 1 total, 0.189s
[info] Test run started
[info] Test org.apache.spark.ml.feature.JavaHashingTFSuite.hashingTF started
[info] Test run finished: 0 failed, 0 ignored, 1 total, 0.167s
[info] Test run started
[info] Test org.apache.spark.mllib.linalg.JavaMatricesSuite.zerosMatrixConstruction started
[info] Test org.apache.spark.mllib.linalg.JavaMatricesSuite.identityMatrixConstruction started
[info] Test org.apache.spark.mllib.linalg.JavaMatricesSuite.concatenateMatrices started
[info] Test org.apache.spark.mllib.linalg.JavaMatricesSuite.sparseDenseConversion started
[info] Test org.apache.spark.mllib.linalg.JavaMatricesSuite.randMatrixConstruction started
[info] Test org.apache.spark.mllib.linalg.JavaMatricesSuite.diagonalMatrixConstruction started
[info] Test run finished: 0 failed, 0 ignored, 6 total, 0.003s
[info] Test run started
[info] Test org.apache.spark.ml.feature.JavaVectorSlicerSuite.vectorSlice started
[info] Test run finished: 0 failed, 0 ignored, 1 total, 0.118s
[info] Test run started
[info] Test org.apache.spark.ml.JavaPipelineSuite.pipeline started
[info] Test run finished: 0 failed, 0 ignored, 1 total, 0.604s
[info] Test run started
[info] Test org.apache.spark.ml.feature.JavaDCTSuite.javaCompatibilityTest started
[info] Test run finished: 0 failed, 0 ignored, 1 total, 0.13s
[info] Test run started
[info] Test org.apache.spark.ml.feature.JavaVectorAssemblerSuite.testVectorAssembler started
[info] Test run finished: 0 failed, 0 ignored, 1 total, 0.112s
[info] Test run started
[info] Test org.apache.spark.mllib.clustering.JavaGaussianMixtureSuite.runGaussianMixture started
[info] Test run finished: 0 failed, 0 ignored, 1 total, 0.142s
[info] Test run started
[info] Test org.apache.spark.mllib.classification.JavaLogisticRegressionSuite.runLRUsingConstructor started
[info] Test org.apache.spark.mllib.classification.JavaLogisticRegressionSuite.runLRUsingStaticMethods started
[info] Test run finished: 0 failed, 0 ignored, 2 total, 3.942s
[info] Test run started
[info] Test org.apache.spark.mllib.regression.JavaLinearRegressionSuite.testPredictJavaRDD started
[info] Test org.apache.spark.mllib.regression.JavaLinearRegressionSuite.runLinearRegressionUsingStaticMethods started
[info] Test org.apache.spark.mllib.regression.JavaLinearRegressionSuite.runLinearRegressionUsingConstructor started
[info] Test run finished: 0 failed, 0 ignored, 3 total, 2.934s
[info] Test run started
[info] Test org.apache.spark.mllib.fpm.JavaPrefixSpanSuite.runPrefixSpan started
[info] Test org.apache.spark.mllib.fpm.JavaPrefixSpanSuite.runPrefixSpanSaveLoad started
[info] Test run finished: 0 failed, 0 ignored, 2 total, 0.889s
[info] Test run started
[info] Test org.apache.spark.ml.classification.JavaMultilayerPerceptronClassifierSuite.testMLPC started
[info] Test run finished: 0 failed, 0 ignored, 1 total, 0.918s
[info] Test run started
[info] Test org.apache.spark.ml.feature.JavaTokenizerSuite.regexTokenizer started
[info] Test run finished: 0 failed, 0 ignored, 1 total, 0.156s
[info] Test run started
[info] Test org.apache.spark.ml.feature.JavaBucketizerSuite.bucketizerTest started
[info] Test org.apache.spark.ml.feature.JavaBucketizerSuite.bucketizerMultipleColumnsTest started
[info] Test run finished: 0 failed, 0 ignored, 2 total, 0.161s
[info] Test run started
[info] Test org.apache.spark.ml.classification.JavaRandomForestClassifierSuite.runDT started
[info] Test run finished: 0 failed, 0 ignored, 1 total, 0.311s
[info] ScalaTest
[info] Run completed in 1 hour, 36 minutes, 45 seconds.
[info] Total number of tests run: 1593
[info] Suites: completed 205, aborted 0
[info] Tests: succeeded 1592, failed 1, canceled 0, ignored 7, pending 0
[info] *** 1 TEST FAILED ***
[error] Failed: Total 1715, Failed 1, Errors 0, Passed 1714, Ignored 7
[error] Failed tests:
[error] 	org.apache.spark.mllib.classification.NaiveBayesSuite
[error] (mllib/test:test) sbt.TestsFailedException: Tests unsuccessful
[error] (core/test:test) sbt.TestsFailedException: Tests unsuccessful
[error] Total time: 6399 s, completed May 16, 2020, 9:58:18 PM
[error] running /home/jenkins/workspace/NewSparkPullRequestBuilder/build/sbt -Phadoop-3.2 -Phive-2.3 -Pkinesis-asl -Pyarn -Pkubernetes -Phadoop-cloud -Phive -Pspark-ganglia-lgpl -Phive-thriftserver -Pmesos -Dtest.exclude.tags=org.apache.spark.tags.ExtendedHiveTest,org.apache.spark.tags.ExtendedYarnTest -Djava.version=11 test ; received return code 1
Attempting to post to Github...
 > Post successful.
Build step 'Execute shell' marked build as failure
Archiving artifacts
Recording test results
Finished: FAILURE