FailedConsole Output

Skipping 1,601 KB.. Full Log
en-clean-plugin:2.5:clean (default-clean) @ alluxio-core-client-hdfs ---
[INFO] 
[INFO] --- maven-enforcer-plugin:1.0:enforce (enforce-maven) @ alluxio-core-client-hdfs ---
[INFO] 
[INFO] --- maven-enforcer-plugin:1.0:enforce (enforce-versions) @ alluxio-core-client-hdfs ---
[INFO] 
[INFO] --- maven-checkstyle-plugin:2.17:check (checkstyle) @ alluxio-core-client-hdfs ---
[INFO] Starting audit...
Audit done.
[INFO] 
[INFO] --- license-maven-plugin:2.9:check (default) @ alluxio-core-client-hdfs ---
[INFO] Checking licenses...
[INFO] 
[INFO] --- maven-resources-plugin:2.6:resources (default-resources) @ alluxio-core-client-hdfs ---
[INFO] Using 'UTF-8' encoding to copy filtered resources.
[INFO] Copying 1 resource
[INFO] 
[INFO] --- maven-compiler-plugin:3.2:compile (default-compile) @ alluxio-core-client-hdfs ---
[INFO] Changes detected - recompiling the module!
[INFO] Compiling 7 source files to /home/jenkins/workspace/alluxio-ubuntu-testing/PROFILE_OPTS/-PcontractTest/label/spark-k8s-testing/core/client/hdfs/target/classes
[INFO] /home/jenkins/workspace/alluxio-ubuntu-testing/PROFILE_OPTS/-PcontractTest/label/spark-k8s-testing/core/client/hdfs/src/main/java/alluxio/hadoop/AbstractFileSystem.java: Some input files use or override a deprecated API.
[INFO] /home/jenkins/workspace/alluxio-ubuntu-testing/PROFILE_OPTS/-PcontractTest/label/spark-k8s-testing/core/client/hdfs/src/main/java/alluxio/hadoop/AbstractFileSystem.java: Recompile with -Xlint:deprecation for details.
[INFO] 
[INFO] >>> findbugs-maven-plugin:3.0.2:check (default) > :findbugs @ alluxio-core-client-hdfs >>>
[INFO] 
[INFO] --- findbugs-maven-plugin:3.0.2:findbugs (findbugs) @ alluxio-core-client-hdfs ---
[INFO] Fork Value is true
[INFO] Done FindBugs Analysis....
[INFO] 
[INFO] <<< findbugs-maven-plugin:3.0.2:check (default) < :findbugs @ alluxio-core-client-hdfs <<<
[INFO] 
[INFO] --- findbugs-maven-plugin:3.0.2:check (default) @ alluxio-core-client-hdfs ---
[INFO] BugInstance size is 0
[INFO] Error size is 0
[INFO] No errors/warnings found
[INFO] 
[INFO] --- maven-resources-plugin:2.6:testResources (default-testResources) @ alluxio-core-client-hdfs ---
[INFO] Using 'UTF-8' encoding to copy filtered resources.
[INFO] Copying 1 resource
[INFO] 
[INFO] --- maven-compiler-plugin:3.2:testCompile (default-testCompile) @ alluxio-core-client-hdfs ---
[INFO] Changes detected - recompiling the module!
[INFO] Compiling 4 source files to /home/jenkins/workspace/alluxio-ubuntu-testing/PROFILE_OPTS/-PcontractTest/label/spark-k8s-testing/core/client/hdfs/target/test-classes
[INFO] /home/jenkins/workspace/alluxio-ubuntu-testing/PROFILE_OPTS/-PcontractTest/label/spark-k8s-testing/core/client/hdfs/src/test/java/alluxio/hadoop/AbstractFileSystemTest.java: /home/jenkins/workspace/alluxio-ubuntu-testing/PROFILE_OPTS/-PcontractTest/label/spark-k8s-testing/core/client/hdfs/src/test/java/alluxio/hadoop/AbstractFileSystemTest.java uses or overrides a deprecated API.
[INFO] /home/jenkins/workspace/alluxio-ubuntu-testing/PROFILE_OPTS/-PcontractTest/label/spark-k8s-testing/core/client/hdfs/src/test/java/alluxio/hadoop/AbstractFileSystemTest.java: Recompile with -Xlint:deprecation for details.
[INFO] 
[INFO] --- maven-surefire-plugin:2.19.1:test (default-test) @ alluxio-core-client-hdfs ---
[INFO] Surefire report directory: /home/jenkins/workspace/alluxio-ubuntu-testing/PROFILE_OPTS/-PcontractTest/label/spark-k8s-testing/core/client/hdfs/target/surefire-reports

-------------------------------------------------------
 T E S T S
-------------------------------------------------------
Java HotSpot(TM) 64-Bit Server VM warning: ignoring option MaxPermSize=512M; support was removed in 8.0
Java HotSpot(TM) 64-Bit Server VM warning: ignoring option MaxPermSize=512M; support was removed in 8.0
Java HotSpot(TM) 64-Bit Server VM warning: ignoring option MaxPermSize=512M; support was removed in 8.0
Running alluxio.hadoop.AbstractFileSystemTest
Running alluxio.hadoop.HadoopConfigurationUtilsTest
Running alluxio.hadoop.HadoopUtilsTest
Tests run: 4, Failures: 0, Errors: 0, Skipped: 0, Time elapsed: 0.136 sec - in alluxio.hadoop.HadoopUtilsTest
Tests run: 2, Failures: 0, Errors: 0, Skipped: 0, Time elapsed: 0.619 sec - in alluxio.hadoop.HadoopConfigurationUtilsTest
Tests run: 12, Failures: 0, Errors: 0, Skipped: 0, Time elapsed: 3.552 sec - in alluxio.hadoop.AbstractFileSystemTest

Results :

Tests run: 18, Failures: 0, Errors: 0, Skipped: 0

[INFO] 
[INFO] --- maven-jar-plugin:2.4:jar (default-jar) @ alluxio-core-client-hdfs ---
[INFO] Building jar: /home/jenkins/workspace/alluxio-ubuntu-testing/PROFILE_OPTS/-PcontractTest/label/spark-k8s-testing/core/client/hdfs/target/alluxio-core-client-hdfs-1.7.0-SNAPSHOT.jar
[INFO] 
[INFO] >>> maven-source-plugin:2.3:jar (attach-sources) > generate-sources @ alluxio-core-client-hdfs >>>
[INFO] 
[INFO] --- maven-enforcer-plugin:1.0:enforce (enforce-maven) @ alluxio-core-client-hdfs ---
[INFO] 
[INFO] --- maven-enforcer-plugin:1.0:enforce (enforce-versions) @ alluxio-core-client-hdfs ---
[INFO] 
[INFO] --- maven-checkstyle-plugin:2.17:check (checkstyle) @ alluxio-core-client-hdfs ---
[INFO] Starting audit...
Audit done.
[INFO] 
[INFO] --- license-maven-plugin:2.9:check (default) @ alluxio-core-client-hdfs ---
[INFO] Checking licenses...
[INFO] 
[INFO] <<< maven-source-plugin:2.3:jar (attach-sources) < generate-sources @ alluxio-core-client-hdfs <<<
[INFO] 
[INFO] --- maven-source-plugin:2.3:jar (attach-sources) @ alluxio-core-client-hdfs ---
[INFO] Building jar: /home/jenkins/workspace/alluxio-ubuntu-testing/PROFILE_OPTS/-PcontractTest/label/spark-k8s-testing/core/client/hdfs/target/alluxio-core-client-hdfs-1.7.0-SNAPSHOT-sources.jar
[INFO] 
[INFO] --- maven-javadoc-plugin:2.9:jar (attach-javadoc) @ alluxio-core-client-hdfs ---
[INFO] 
Loading source files for package alluxio.hadoop...
Constructing Javadoc information...
Standard Doclet version 1.8.0_144
Building tree for all the packages and classes...
Generating /home/jenkins/workspace/alluxio-ubuntu-testing/PROFILE_OPTS/-PcontractTest/label/spark-k8s-testing/core/client/hdfs/target/apidocs/alluxio/hadoop/AlluxioFileSystem.html...
Generating /home/jenkins/workspace/alluxio-ubuntu-testing/PROFILE_OPTS/-PcontractTest/label/spark-k8s-testing/core/client/hdfs/target/apidocs/alluxio/hadoop/FaultTolerantFileSystem.html...
Generating /home/jenkins/workspace/alluxio-ubuntu-testing/PROFILE_OPTS/-PcontractTest/label/spark-k8s-testing/core/client/hdfs/target/apidocs/alluxio/hadoop/FileSystem.html...
Generating /home/jenkins/workspace/alluxio-ubuntu-testing/PROFILE_OPTS/-PcontractTest/label/spark-k8s-testing/core/client/hdfs/target/apidocs/alluxio/hadoop/HadoopConfigurationUtils.html...
Generating /home/jenkins/workspace/alluxio-ubuntu-testing/PROFILE_OPTS/-PcontractTest/label/spark-k8s-testing/core/client/hdfs/target/apidocs/alluxio/hadoop/HadoopUtils.html...
Generating /home/jenkins/workspace/alluxio-ubuntu-testing/PROFILE_OPTS/-PcontractTest/label/spark-k8s-testing/core/client/hdfs/target/apidocs/alluxio/hadoop/HdfsFileInputStream.html...
Generating /home/jenkins/workspace/alluxio-ubuntu-testing/PROFILE_OPTS/-PcontractTest/label/spark-k8s-testing/core/client/hdfs/target/apidocs/alluxio/hadoop/package-frame.html...
Generating /home/jenkins/workspace/alluxio-ubuntu-testing/PROFILE_OPTS/-PcontractTest/label/spark-k8s-testing/core/client/hdfs/target/apidocs/alluxio/hadoop/package-summary.html...
Generating /home/jenkins/workspace/alluxio-ubuntu-testing/PROFILE_OPTS/-PcontractTest/label/spark-k8s-testing/core/client/hdfs/target/apidocs/alluxio/hadoop/package-tree.html...
Generating /home/jenkins/workspace/alluxio-ubuntu-testing/PROFILE_OPTS/-PcontractTest/label/spark-k8s-testing/core/client/hdfs/target/apidocs/constant-values.html...
Generating /home/jenkins/workspace/alluxio-ubuntu-testing/PROFILE_OPTS/-PcontractTest/label/spark-k8s-testing/core/client/hdfs/target/apidocs/alluxio/hadoop/class-use/FaultTolerantFileSystem.html...
Generating /home/jenkins/workspace/alluxio-ubuntu-testing/PROFILE_OPTS/-PcontractTest/label/spark-k8s-testing/core/client/hdfs/target/apidocs/alluxio/hadoop/class-use/HdfsFileInputStream.html...
Generating /home/jenkins/workspace/alluxio-ubuntu-testing/PROFILE_OPTS/-PcontractTest/label/spark-k8s-testing/core/client/hdfs/target/apidocs/alluxio/hadoop/class-use/HadoopUtils.html...
Generating /home/jenkins/workspace/alluxio-ubuntu-testing/PROFILE_OPTS/-PcontractTest/label/spark-k8s-testing/core/client/hdfs/target/apidocs/alluxio/hadoop/class-use/AlluxioFileSystem.html...
Generating /home/jenkins/workspace/alluxio-ubuntu-testing/PROFILE_OPTS/-PcontractTest/label/spark-k8s-testing/core/client/hdfs/target/apidocs/alluxio/hadoop/class-use/HadoopConfigurationUtils.html...
Generating /home/jenkins/workspace/alluxio-ubuntu-testing/PROFILE_OPTS/-PcontractTest/label/spark-k8s-testing/core/client/hdfs/target/apidocs/alluxio/hadoop/class-use/FileSystem.html...
Generating /home/jenkins/workspace/alluxio-ubuntu-testing/PROFILE_OPTS/-PcontractTest/label/spark-k8s-testing/core/client/hdfs/target/apidocs/alluxio/hadoop/package-use.html...
Building index for all the packages and classes...
Generating /home/jenkins/workspace/alluxio-ubuntu-testing/PROFILE_OPTS/-PcontractTest/label/spark-k8s-testing/core/client/hdfs/target/apidocs/overview-tree.html...
Generating /home/jenkins/workspace/alluxio-ubuntu-testing/PROFILE_OPTS/-PcontractTest/label/spark-k8s-testing/core/client/hdfs/target/apidocs/index-all.html...
Generating /home/jenkins/workspace/alluxio-ubuntu-testing/PROFILE_OPTS/-PcontractTest/label/spark-k8s-testing/core/client/hdfs/target/apidocs/deprecated-list.html...
Building index for all classes...
Generating /home/jenkins/workspace/alluxio-ubuntu-testing/PROFILE_OPTS/-PcontractTest/label/spark-k8s-testing/core/client/hdfs/target/apidocs/allclasses-frame.html...
Generating /home/jenkins/workspace/alluxio-ubuntu-testing/PROFILE_OPTS/-PcontractTest/label/spark-k8s-testing/core/client/hdfs/target/apidocs/allclasses-noframe.html...
Generating /home/jenkins/workspace/alluxio-ubuntu-testing/PROFILE_OPTS/-PcontractTest/label/spark-k8s-testing/core/client/hdfs/target/apidocs/index.html...
Generating /home/jenkins/workspace/alluxio-ubuntu-testing/PROFILE_OPTS/-PcontractTest/label/spark-k8s-testing/core/client/hdfs/target/apidocs/help-doc.html...
[INFO] Building jar: /home/jenkins/workspace/alluxio-ubuntu-testing/PROFILE_OPTS/-PcontractTest/label/spark-k8s-testing/core/client/hdfs/target/alluxio-core-client-hdfs-1.7.0-SNAPSHOT-javadoc.jar
[INFO] 
[INFO] --- maven-jar-plugin:2.4:test-jar (default) @ alluxio-core-client-hdfs ---
[INFO] Building jar: /home/jenkins/workspace/alluxio-ubuntu-testing/PROFILE_OPTS/-PcontractTest/label/spark-k8s-testing/core/client/hdfs/target/alluxio-core-client-hdfs-1.7.0-SNAPSHOT-tests.jar
[INFO] 
[INFO] --- maven-install-plugin:2.4:install (default-install) @ alluxio-core-client-hdfs ---
[INFO] Installing /home/jenkins/workspace/alluxio-ubuntu-testing/PROFILE_OPTS/-PcontractTest/label/spark-k8s-testing/core/client/hdfs/target/alluxio-core-client-hdfs-1.7.0-SNAPSHOT.jar to /home/jenkins/.m2/repository/org/alluxio/alluxio-core-client-hdfs/1.7.0-SNAPSHOT/alluxio-core-client-hdfs-1.7.0-SNAPSHOT.jar
[INFO] Installing /home/jenkins/workspace/alluxio-ubuntu-testing/PROFILE_OPTS/-PcontractTest/label/spark-k8s-testing/core/client/hdfs/pom.xml to /home/jenkins/.m2/repository/org/alluxio/alluxio-core-client-hdfs/1.7.0-SNAPSHOT/alluxio-core-client-hdfs-1.7.0-SNAPSHOT.pom
[INFO] Installing /home/jenkins/workspace/alluxio-ubuntu-testing/PROFILE_OPTS/-PcontractTest/label/spark-k8s-testing/core/client/hdfs/target/alluxio-core-client-hdfs-1.7.0-SNAPSHOT-sources.jar to /home/jenkins/.m2/repository/org/alluxio/alluxio-core-client-hdfs/1.7.0-SNAPSHOT/alluxio-core-client-hdfs-1.7.0-SNAPSHOT-sources.jar
[INFO] Installing /home/jenkins/workspace/alluxio-ubuntu-testing/PROFILE_OPTS/-PcontractTest/label/spark-k8s-testing/core/client/hdfs/target/alluxio-core-client-hdfs-1.7.0-SNAPSHOT-javadoc.jar to /home/jenkins/.m2/repository/org/alluxio/alluxio-core-client-hdfs/1.7.0-SNAPSHOT/alluxio-core-client-hdfs-1.7.0-SNAPSHOT-javadoc.jar
[INFO] Installing /home/jenkins/workspace/alluxio-ubuntu-testing/PROFILE_OPTS/-PcontractTest/label/spark-k8s-testing/core/client/hdfs/target/alluxio-core-client-hdfs-1.7.0-SNAPSHOT-tests.jar to /home/jenkins/.m2/repository/org/alluxio/alluxio-core-client-hdfs/1.7.0-SNAPSHOT/alluxio-core-client-hdfs-1.7.0-SNAPSHOT-tests.jar
[INFO]                                                                         
[INFO] ------------------------------------------------------------------------
[INFO] Building Alluxio Core - Client - Runtime 1.7.0-SNAPSHOT
[INFO] ------------------------------------------------------------------------
[INFO] 
[INFO] --- maven-clean-plugin:2.5:clean (default-clean) @ alluxio-core-client-runtime ---
[INFO] 
[INFO] --- maven-enforcer-plugin:1.0:enforce (enforce-maven) @ alluxio-core-client-runtime ---
[INFO] 
[INFO] --- maven-enforcer-plugin:1.0:enforce (enforce-versions) @ alluxio-core-client-runtime ---
[INFO] 
[INFO] --- maven-checkstyle-plugin:2.17:check (checkstyle) @ alluxio-core-client-runtime ---
[INFO] Starting audit...
Audit done.
[INFO] 
[INFO] --- license-maven-plugin:2.9:check (default) @ alluxio-core-client-runtime ---
[INFO] Checking licenses...
[INFO] 
[INFO] --- maven-resources-plugin:2.6:resources (default-resources) @ alluxio-core-client-runtime ---
[INFO] Using 'UTF-8' encoding to copy filtered resources.
[INFO] skip non existing resourceDirectory /home/jenkins/workspace/alluxio-ubuntu-testing/PROFILE_OPTS/-PcontractTest/label/spark-k8s-testing/core/client/runtime/src/main/resources
[INFO] 
[INFO] --- maven-compiler-plugin:3.2:compile (default-compile) @ alluxio-core-client-runtime ---
[INFO] No sources to compile
[INFO] 
[INFO] >>> findbugs-maven-plugin:3.0.2:check (default) > :findbugs @ alluxio-core-client-runtime >>>
[INFO] 
[INFO] --- findbugs-maven-plugin:3.0.2:findbugs (findbugs) @ alluxio-core-client-runtime ---
[INFO] 
[INFO] <<< findbugs-maven-plugin:3.0.2:check (default) < :findbugs @ alluxio-core-client-runtime <<<
[INFO] 
[INFO] --- findbugs-maven-plugin:3.0.2:check (default) @ alluxio-core-client-runtime ---
[INFO] 
[INFO] --- maven-resources-plugin:2.6:testResources (default-testResources) @ alluxio-core-client-runtime ---
[INFO] Using 'UTF-8' encoding to copy filtered resources.
[INFO] skip non existing resourceDirectory /home/jenkins/workspace/alluxio-ubuntu-testing/PROFILE_OPTS/-PcontractTest/label/spark-k8s-testing/core/client/runtime/src/test/resources
[INFO] 
[INFO] --- maven-compiler-plugin:3.2:testCompile (default-testCompile) @ alluxio-core-client-runtime ---
[INFO] No sources to compile
[INFO] 
[INFO] --- maven-surefire-plugin:2.19.1:test (default-test) @ alluxio-core-client-runtime ---
[INFO] No tests to run.
[INFO] 
[INFO] --- maven-jar-plugin:2.4:jar (default-jar) @ alluxio-core-client-runtime ---
[WARNING] JAR will be empty - no content was marked for inclusion!
[INFO] Building jar: /home/jenkins/workspace/alluxio-ubuntu-testing/PROFILE_OPTS/-PcontractTest/label/spark-k8s-testing/core/client/runtime/target/alluxio-core-client-runtime-1.7.0-SNAPSHOT.jar
[INFO] 
[INFO] >>> maven-source-plugin:2.3:jar (attach-sources) > generate-sources @ alluxio-core-client-runtime >>>
[INFO] 
[INFO] --- maven-enforcer-plugin:1.0:enforce (enforce-maven) @ alluxio-core-client-runtime ---
[INFO] 
[INFO] --- maven-enforcer-plugin:1.0:enforce (enforce-versions) @ alluxio-core-client-runtime ---
[INFO] 
[INFO] --- maven-checkstyle-plugin:2.17:check (checkstyle) @ alluxio-core-client-runtime ---
[INFO] Starting audit...
Audit done.
[INFO] 
[INFO] --- license-maven-plugin:2.9:check (default) @ alluxio-core-client-runtime ---
[INFO] Checking licenses...
[INFO] 
[INFO] <<< maven-source-plugin:2.3:jar (attach-sources) < generate-sources @ alluxio-core-client-runtime <<<
[INFO] 
[INFO] --- maven-source-plugin:2.3:jar (attach-sources) @ alluxio-core-client-runtime ---
[INFO] No sources in project. Archive not created.
[INFO] 
[INFO] --- maven-javadoc-plugin:2.9:jar (attach-javadoc) @ alluxio-core-client-runtime ---
[INFO] 
[INFO] --- maven-shade-plugin:2.4.3:shade (uber-jar) @ alluxio-core-client-runtime ---
[INFO] Including commons-cli:commons-cli:jar:1.3.1 in the shaded jar.
[INFO] Including commons-httpclient:commons-httpclient:jar:3.1 in the shaded jar.
[INFO] Including commons-codec:commons-codec:jar:1.10 in the shaded jar.
[INFO] Including commons-io:commons-io:jar:2.4 in the shaded jar.
[INFO] Including commons-logging:commons-logging:jar:1.1.1 in the shaded jar.
[INFO] Including commons-lang:commons-lang:jar:2.6 in the shaded jar.
[INFO] Including com.google.protobuf:protobuf-java:jar:2.5.0 in the shaded jar.
[INFO] Including org.apache.curator:curator-client:jar:2.1.0-incubating in the shaded jar.
[INFO] Including org.apache.curator:curator-recipes:jar:2.1.0-incubating in the shaded jar.
[INFO] Including org.apache.zookeeper:zookeeper:jar:3.4.6 in the shaded jar.
[INFO] Including io.netty:netty:jar:3.6.2.Final in the shaded jar.
[INFO] Including org.alluxio:alluxio-core-client-hdfs:jar:1.7.0-SNAPSHOT in the shaded jar.
[INFO] Including com.google.guava:guava:jar:14.0.1 in the shaded jar.
[INFO] Including org.alluxio:alluxio-core-common:jar:1.7.0-SNAPSHOT in the shaded jar.
[INFO] Including io.dropwizard.metrics:metrics-graphite:jar:3.1.2 in the shaded jar.
[INFO] Including io.dropwizard.metrics:metrics-json:jar:3.1.2 in the shaded jar.
[INFO] Including com.fasterxml.jackson.core:jackson-databind:jar:2.6.6 in the shaded jar.
[INFO] Including com.fasterxml.jackson.core:jackson-core:jar:2.6.6 in the shaded jar.
[INFO] Including io.dropwizard.metrics:metrics-jvm:jar:3.1.2 in the shaded jar.
[INFO] Including org.apache.commons:commons-lang3:jar:3.4 in the shaded jar.
[INFO] Including org.apache.curator:curator-framework:jar:2.1.0-incubating in the shaded jar.
[INFO] Including org.reflections:reflections:jar:0.9.10 in the shaded jar.
[INFO] Including org.alluxio:alluxio-core-client-fs:jar:1.7.0-SNAPSHOT in the shaded jar.
[INFO] Including com.fasterxml.jackson.core:jackson-annotations:jar:2.6.6 in the shaded jar.
[INFO] Including io.dropwizard.metrics:metrics-core:jar:3.1.2 in the shaded jar.
[INFO] Including io.netty:netty-all:jar:4.0.29.Final in the shaded jar.
[INFO] Including org.apache.thrift:libthrift:jar:0.9.3 in the shaded jar.
[INFO] Including org.apache.httpcomponents:httpclient:jar:4.5.3 in the shaded jar.
[INFO] Including org.apache.httpcomponents:httpcore:jar:4.4.6 in the shaded jar.
[INFO] Including org.alluxio:alluxio-core-protobuf:jar:1.7.0-SNAPSHOT in the shaded jar.
[INFO] Including log4j:log4j:jar:1.2.17 in the shaded jar.
[INFO] Including org.slf4j:slf4j-api:jar:1.7.2 in the shaded jar.
[INFO] Including org.slf4j:slf4j-log4j12:jar:1.7.2 in the shaded jar.
[INFO] Including org.javassist:javassist:jar:3.18.2-GA in the shaded jar.
[INFO] Replacing /home/jenkins/workspace/alluxio-ubuntu-testing/PROFILE_OPTS/-PcontractTest/label/spark-k8s-testing/core/client/runtime/target/alluxio-core-client-runtime-1.7.0-SNAPSHOT-jar-with-dependencies.jar with /home/jenkins/workspace/alluxio-ubuntu-testing/PROFILE_OPTS/-PcontractTest/label/spark-k8s-testing/core/client/runtime/target/alluxio-core-client-runtime-1.7.0-SNAPSHOT-shaded.jar
[INFO] 
[INFO] --- maven-install-plugin:2.4:install (default-install) @ alluxio-core-client-runtime ---
[INFO] Installing /home/jenkins/workspace/alluxio-ubuntu-testing/PROFILE_OPTS/-PcontractTest/label/spark-k8s-testing/core/client/runtime/target/alluxio-core-client-runtime-1.7.0-SNAPSHOT.jar to /home/jenkins/.m2/repository/org/alluxio/alluxio-core-client-runtime/1.7.0-SNAPSHOT/alluxio-core-client-runtime-1.7.0-SNAPSHOT.jar
[INFO] Installing /home/jenkins/workspace/alluxio-ubuntu-testing/PROFILE_OPTS/-PcontractTest/label/spark-k8s-testing/core/client/runtime/pom.xml to /home/jenkins/.m2/repository/org/alluxio/alluxio-core-client-runtime/1.7.0-SNAPSHOT/alluxio-core-client-runtime-1.7.0-SNAPSHOT.pom
[INFO]                                                                         
[INFO] ------------------------------------------------------------------------
[INFO] Building Alluxio Integration 1.7.0-SNAPSHOT
[INFO] ------------------------------------------------------------------------
[INFO] 
[INFO] --- maven-clean-plugin:2.5:clean (default-clean) @ alluxio-integration ---
[INFO] 
[INFO] --- maven-enforcer-plugin:1.0:enforce (enforce-maven) @ alluxio-integration ---
[INFO] 
[INFO] --- maven-enforcer-plugin:1.0:enforce (enforce-versions) @ alluxio-integration ---
[INFO] 
[INFO] --- maven-checkstyle-plugin:2.17:check (checkstyle) @ alluxio-integration ---
[INFO] Starting audit...
Audit done.
[INFO] 
[INFO] --- license-maven-plugin:2.9:check (default) @ alluxio-integration ---
[INFO] Checking licenses...
[WARNING] Unknown file extension: /home/jenkins/workspace/alluxio-ubuntu-testing/PROFILE_OPTS/-PcontractTest/label/spark-k8s-testing/integration/docker/.dockerignore
[WARNING] Unable to find a comment style definition for some files. You may want to add a custom mapping for the relevant file extensions.
[INFO] 
[INFO] >>> findbugs-maven-plugin:3.0.2:check (default) > :findbugs @ alluxio-integration >>>
[INFO] 
[INFO] --- findbugs-maven-plugin:3.0.2:findbugs (findbugs) @ alluxio-integration ---
[INFO] 
[INFO] <<< findbugs-maven-plugin:3.0.2:check (default) < :findbugs @ alluxio-integration <<<
[INFO] 
[INFO] --- findbugs-maven-plugin:3.0.2:check (default) @ alluxio-integration ---
[INFO] 
[INFO] >>> maven-source-plugin:2.3:jar (attach-sources) > generate-sources @ alluxio-integration >>>
[INFO] 
[INFO] --- maven-enforcer-plugin:1.0:enforce (enforce-maven) @ alluxio-integration ---
[INFO] 
[INFO] --- maven-enforcer-plugin:1.0:enforce (enforce-versions) @ alluxio-integration ---
[INFO] 
[INFO] --- maven-checkstyle-plugin:2.17:check (checkstyle) @ alluxio-integration ---
[INFO] Starting audit...
Audit done.
[INFO] 
[INFO] --- license-maven-plugin:2.9:check (default) @ alluxio-integration ---
[INFO] Checking licenses...
[WARNING] Unknown file extension: /home/jenkins/workspace/alluxio-ubuntu-testing/PROFILE_OPTS/-PcontractTest/label/spark-k8s-testing/integration/docker/.dockerignore
[WARNING] Unable to find a comment style definition for some files. You may want to add a custom mapping for the relevant file extensions.
[INFO] 
[INFO] <<< maven-source-plugin:2.3:jar (attach-sources) < generate-sources @ alluxio-integration <<<
[INFO] 
[INFO] --- maven-source-plugin:2.3:jar (attach-sources) @ alluxio-integration ---
[INFO] 
[INFO] --- maven-javadoc-plugin:2.9:jar (attach-javadoc) @ alluxio-integration ---
[INFO] Not executing Javadoc as the project is not a Java classpath-capable package
[INFO] 
[INFO] --- maven-install-plugin:2.4:install (default-install) @ alluxio-integration ---
[INFO] Installing /home/jenkins/workspace/alluxio-ubuntu-testing/PROFILE_OPTS/-PcontractTest/label/spark-k8s-testing/integration/pom.xml to /home/jenkins/.m2/repository/org/alluxio/alluxio-integration/1.7.0-SNAPSHOT/alluxio-integration-1.7.0-SNAPSHOT.pom
[INFO]                                                                         
[INFO] ------------------------------------------------------------------------
[INFO] Building Alluxio MiniCluster 1.7.0-SNAPSHOT
[INFO] ------------------------------------------------------------------------
[INFO] 
[INFO] --- maven-clean-plugin:2.5:clean (default-clean) @ alluxio-minicluster ---
[INFO] 
[INFO] --- maven-enforcer-plugin:1.0:enforce (enforce-maven) @ alluxio-minicluster ---
[INFO] 
[INFO] --- maven-enforcer-plugin:1.0:enforce (enforce-versions) @ alluxio-minicluster ---
[INFO] 
[INFO] --- maven-checkstyle-plugin:2.17:check (checkstyle) @ alluxio-minicluster ---
[INFO] Starting audit...
Audit done.
[INFO] 
[INFO] --- license-maven-plugin:2.9:check (default) @ alluxio-minicluster ---
[INFO] Checking licenses...
[INFO] 
[INFO] --- maven-resources-plugin:2.6:resources (default-resources) @ alluxio-minicluster ---
[INFO] Using 'UTF-8' encoding to copy filtered resources.
[INFO] skip non existing resourceDirectory /home/jenkins/workspace/alluxio-ubuntu-testing/PROFILE_OPTS/-PcontractTest/label/spark-k8s-testing/minicluster/src/main/resources
[INFO] 
[INFO] --- maven-compiler-plugin:3.2:compile (default-compile) @ alluxio-minicluster ---
[INFO] Changes detected - recompiling the module!
[INFO] Compiling 5 source files to /home/jenkins/workspace/alluxio-ubuntu-testing/PROFILE_OPTS/-PcontractTest/label/spark-k8s-testing/minicluster/target/classes
[INFO] 
[INFO] >>> findbugs-maven-plugin:3.0.2:check (default) > :findbugs @ alluxio-minicluster >>>
[INFO] 
[INFO] --- findbugs-maven-plugin:3.0.2:findbugs (findbugs) @ alluxio-minicluster ---
[INFO] Fork Value is true
[INFO] Done FindBugs Analysis....
[INFO] 
[INFO] <<< findbugs-maven-plugin:3.0.2:check (default) < :findbugs @ alluxio-minicluster <<<
[INFO] 
[INFO] --- findbugs-maven-plugin:3.0.2:check (default) @ alluxio-minicluster ---
[INFO] BugInstance size is 0
[INFO] Error size is 0
[INFO] No errors/warnings found
[INFO] 
[INFO] --- maven-resources-plugin:2.6:testResources (default-testResources) @ alluxio-minicluster ---
[INFO] Using 'UTF-8' encoding to copy filtered resources.
[INFO] skip non existing resourceDirectory /home/jenkins/workspace/alluxio-ubuntu-testing/PROFILE_OPTS/-PcontractTest/label/spark-k8s-testing/minicluster/src/test/resources
[INFO] 
[INFO] --- maven-compiler-plugin:3.2:testCompile (default-testCompile) @ alluxio-minicluster ---
[INFO] No sources to compile
[INFO] 
[INFO] --- maven-surefire-plugin:2.19.1:test (default-test) @ alluxio-minicluster ---
[INFO] No tests to run.
[INFO] 
[INFO] --- maven-jar-plugin:2.4:jar (default-jar) @ alluxio-minicluster ---
[INFO] Building jar: /home/jenkins/workspace/alluxio-ubuntu-testing/PROFILE_OPTS/-PcontractTest/label/spark-k8s-testing/minicluster/target/alluxio-minicluster-1.7.0-SNAPSHOT.jar
[INFO] 
[INFO] >>> maven-source-plugin:2.3:jar (attach-sources) > generate-sources @ alluxio-minicluster >>>
[INFO] 
[INFO] --- maven-enforcer-plugin:1.0:enforce (enforce-maven) @ alluxio-minicluster ---
[INFO] 
[INFO] --- maven-enforcer-plugin:1.0:enforce (enforce-versions) @ alluxio-minicluster ---
[INFO] 
[INFO] --- maven-checkstyle-plugin:2.17:check (checkstyle) @ alluxio-minicluster ---
[INFO] Starting audit...
Audit done.
[INFO] 
[INFO] --- license-maven-plugin:2.9:check (default) @ alluxio-minicluster ---
[INFO] Checking licenses...
[INFO] 
[INFO] <<< maven-source-plugin:2.3:jar (attach-sources) < generate-sources @ alluxio-minicluster <<<
[INFO] 
[INFO] --- maven-source-plugin:2.3:jar (attach-sources) @ alluxio-minicluster ---
[INFO] Building jar: /home/jenkins/workspace/alluxio-ubuntu-testing/PROFILE_OPTS/-PcontractTest/label/spark-k8s-testing/minicluster/target/alluxio-minicluster-1.7.0-SNAPSHOT-sources.jar
[INFO] 
[INFO] --- maven-javadoc-plugin:2.9:jar (attach-javadoc) @ alluxio-minicluster ---
[INFO] 
Loading source files for package alluxio.master...
Constructing Javadoc information...
Standard Doclet version 1.8.0_144
Building tree for all the packages and classes...
Generating /home/jenkins/workspace/alluxio-ubuntu-testing/PROFILE_OPTS/-PcontractTest/label/spark-k8s-testing/minicluster/target/apidocs/alluxio/master/AbstractLocalAlluxioCluster.html...
Generating /home/jenkins/workspace/alluxio-ubuntu-testing/PROFILE_OPTS/-PcontractTest/label/spark-k8s-testing/minicluster/target/apidocs/alluxio/master/ClientPool.html...
Generating /home/jenkins/workspace/alluxio-ubuntu-testing/PROFILE_OPTS/-PcontractTest/label/spark-k8s-testing/minicluster/target/apidocs/alluxio/master/LocalAlluxioCluster.html...
Generating /home/jenkins/workspace/alluxio-ubuntu-testing/PROFILE_OPTS/-PcontractTest/label/spark-k8s-testing/minicluster/target/apidocs/alluxio/master/LocalAlluxioMaster.html...
Generating /home/jenkins/workspace/alluxio-ubuntu-testing/PROFILE_OPTS/-PcontractTest/label/spark-k8s-testing/minicluster/target/apidocs/alluxio/master/MultiMasterLocalAlluxioCluster.html...
Generating /home/jenkins/workspace/alluxio-ubuntu-testing/PROFILE_OPTS/-PcontractTest/label/spark-k8s-testing/minicluster/target/apidocs/alluxio/master/package-frame.html...
Generating /home/jenkins/workspace/alluxio-ubuntu-testing/PROFILE_OPTS/-PcontractTest/label/spark-k8s-testing/minicluster/target/apidocs/alluxio/master/package-summary.html...
Generating /home/jenkins/workspace/alluxio-ubuntu-testing/PROFILE_OPTS/-PcontractTest/label/spark-k8s-testing/minicluster/target/apidocs/alluxio/master/package-tree.html...
Generating /home/jenkins/workspace/alluxio-ubuntu-testing/PROFILE_OPTS/-PcontractTest/label/spark-k8s-testing/minicluster/target/apidocs/constant-values.html...
Generating /home/jenkins/workspace/alluxio-ubuntu-testing/PROFILE_OPTS/-PcontractTest/label/spark-k8s-testing/minicluster/target/apidocs/alluxio/master/class-use/LocalAlluxioCluster.html...
Generating /home/jenkins/workspace/alluxio-ubuntu-testing/PROFILE_OPTS/-PcontractTest/label/spark-k8s-testing/minicluster/target/apidocs/alluxio/master/class-use/MultiMasterLocalAlluxioCluster.html...
Generating /home/jenkins/workspace/alluxio-ubuntu-testing/PROFILE_OPTS/-PcontractTest/label/spark-k8s-testing/minicluster/target/apidocs/alluxio/master/class-use/AbstractLocalAlluxioCluster.html...
Generating /home/jenkins/workspace/alluxio-ubuntu-testing/PROFILE_OPTS/-PcontractTest/label/spark-k8s-testing/minicluster/target/apidocs/alluxio/master/class-use/LocalAlluxioMaster.html...
Generating /home/jenkins/workspace/alluxio-ubuntu-testing/PROFILE_OPTS/-PcontractTest/label/spark-k8s-testing/minicluster/target/apidocs/alluxio/master/class-use/ClientPool.html...
Generating /home/jenkins/workspace/alluxio-ubuntu-testing/PROFILE_OPTS/-PcontractTest/label/spark-k8s-testing/minicluster/target/apidocs/alluxio/master/package-use.html...
Building index for all the packages and classes...
Generating /home/jenkins/workspace/alluxio-ubuntu-testing/PROFILE_OPTS/-PcontractTest/label/spark-k8s-testing/minicluster/target/apidocs/overview-tree.html...
Generating /home/jenkins/workspace/alluxio-ubuntu-testing/PROFILE_OPTS/-PcontractTest/label/spark-k8s-testing/minicluster/target/apidocs/index-all.html...
Generating /home/jenkins/workspace/alluxio-ubuntu-testing/PROFILE_OPTS/-PcontractTest/label/spark-k8s-testing/minicluster/target/apidocs/deprecated-list.html...
Building index for all classes...
Generating /home/jenkins/workspace/alluxio-ubuntu-testing/PROFILE_OPTS/-PcontractTest/label/spark-k8s-testing/minicluster/target/apidocs/allclasses-frame.html...
Generating /home/jenkins/workspace/alluxio-ubuntu-testing/PROFILE_OPTS/-PcontractTest/label/spark-k8s-testing/minicluster/target/apidocs/allclasses-noframe.html...
Generating /home/jenkins/workspace/alluxio-ubuntu-testing/PROFILE_OPTS/-PcontractTest/label/spark-k8s-testing/minicluster/target/apidocs/index.html...
Generating /home/jenkins/workspace/alluxio-ubuntu-testing/PROFILE_OPTS/-PcontractTest/label/spark-k8s-testing/minicluster/target/apidocs/help-doc.html...
[INFO] Building jar: /home/jenkins/workspace/alluxio-ubuntu-testing/PROFILE_OPTS/-PcontractTest/label/spark-k8s-testing/minicluster/target/alluxio-minicluster-1.7.0-SNAPSHOT-javadoc.jar
[INFO] 
[INFO] --- maven-install-plugin:2.4:install (default-install) @ alluxio-minicluster ---
[INFO] Installing /home/jenkins/workspace/alluxio-ubuntu-testing/PROFILE_OPTS/-PcontractTest/label/spark-k8s-testing/minicluster/target/alluxio-minicluster-1.7.0-SNAPSHOT.jar to /home/jenkins/.m2/repository/org/alluxio/alluxio-minicluster/1.7.0-SNAPSHOT/alluxio-minicluster-1.7.0-SNAPSHOT.jar
[INFO] Installing /home/jenkins/workspace/alluxio-ubuntu-testing/PROFILE_OPTS/-PcontractTest/label/spark-k8s-testing/minicluster/pom.xml to /home/jenkins/.m2/repository/org/alluxio/alluxio-minicluster/1.7.0-SNAPSHOT/alluxio-minicluster-1.7.0-SNAPSHOT.pom
[INFO] Installing /home/jenkins/workspace/alluxio-ubuntu-testing/PROFILE_OPTS/-PcontractTest/label/spark-k8s-testing/minicluster/target/alluxio-minicluster-1.7.0-SNAPSHOT-sources.jar to /home/jenkins/.m2/repository/org/alluxio/alluxio-minicluster/1.7.0-SNAPSHOT/alluxio-minicluster-1.7.0-SNAPSHOT-sources.jar
[INFO] Installing /home/jenkins/workspace/alluxio-ubuntu-testing/PROFILE_OPTS/-PcontractTest/label/spark-k8s-testing/minicluster/target/alluxio-minicluster-1.7.0-SNAPSHOT-javadoc.jar to /home/jenkins/.m2/repository/org/alluxio/alluxio-minicluster/1.7.0-SNAPSHOT/alluxio-minicluster-1.7.0-SNAPSHOT-javadoc.jar
[INFO]                                                                         
[INFO] ------------------------------------------------------------------------
[INFO] Building Alluxio Tests 1.7.0-SNAPSHOT
[INFO] ------------------------------------------------------------------------
Downloading: https://repo1.maven.org/maven2/org/apache/hadoop/hadoop-minicluster/2.6.5/hadoop-minicluster-2.6.5.pom
3/4 KB         
4/4 KB   
         
Downloaded: https://repo1.maven.org/maven2/org/apache/hadoop/hadoop-minicluster/2.6.5/hadoop-minicluster-2.6.5.pom (4 KB at 35.7 KB/sec)
Downloading: https://repo1.maven.org/maven2/org/apache/hadoop/hadoop-yarn-server-tests/2.6.5/hadoop-yarn-server-tests-2.6.5.pom
3/7 KB   
5/7 KB   
7/7 KB   
         
Downloaded: https://repo1.maven.org/maven2/org/apache/hadoop/hadoop-yarn-server-tests/2.6.5/hadoop-yarn-server-tests-2.6.5.pom (7 KB at 393.0 KB/sec)
Downloading: https://repo1.maven.org/maven2/org/apache/hadoop/hadoop-yarn-server-resourcemanager/2.6.5/hadoop-yarn-server-resourcemanager-2.6.5.pom
3/13 KB   
5/13 KB   
8/13 KB   
11/13 KB   
13/13 KB   
           
Downloaded: https://repo1.maven.org/maven2/org/apache/hadoop/hadoop-yarn-server-resourcemanager/2.6.5/hadoop-yarn-server-resourcemanager-2.6.5.pom (13 KB at 146.4 KB/sec)
Downloading: https://repo1.maven.org/maven2/org/apache/hadoop/hadoop-yarn-server-applicationhistoryservice/2.6.5/hadoop-yarn-server-applicationhistoryservice-2.6.5.pom
2/7 KB     
5/7 KB   
7/7 KB   
         
Downloaded: https://repo1.maven.org/maven2/org/apache/hadoop/hadoop-yarn-server-applicationhistoryservice/2.6.5/hadoop-yarn-server-applicationhistoryservice-2.6.5.pom (7 KB at 408.8 KB/sec)
Downloading: https://repo1.maven.org/maven2/org/apache/hadoop/hadoop-yarn-server-web-proxy/2.6.5/hadoop-yarn-server-web-proxy-2.6.5.pom
3/5 KB   
5/5 KB   
         
Downloaded: https://repo1.maven.org/maven2/org/apache/hadoop/hadoop-yarn-server-web-proxy/2.6.5/hadoop-yarn-server-web-proxy-2.6.5.pom (5 KB at 289.1 KB/sec)
Downloading: https://repo1.maven.org/maven2/org/apache/hadoop/hadoop-mapreduce-client-hs/2.6.5/hadoop-mapreduce-client-hs-2.6.5.pom
3/4 KB   
4/4 KB   
         
Downloaded: https://repo1.maven.org/maven2/org/apache/hadoop/hadoop-mapreduce-client-hs/2.6.5/hadoop-mapreduce-client-hs-2.6.5.pom (4 KB at 219.8 KB/sec)
Downloading: https://repo1.maven.org/maven2/org/apache/hadoop/hadoop-minicluster/2.6.5/hadoop-minicluster-2.6.5.jar
Downloading: https://repo1.maven.org/maven2/org/apache/hadoop/hadoop-common/2.6.5/hadoop-common-2.6.5-tests.jar
Downloading: https://repo1.maven.org/maven2/org/apache/hadoop/hadoop-hdfs/2.6.5/hadoop-hdfs-2.6.5-tests.jar
Downloading: https://repo1.maven.org/maven2/org/apache/hadoop/hadoop-yarn-server-tests/2.6.5/hadoop-yarn-server-tests-2.6.5-tests.jar
Downloading: https://repo1.maven.org/maven2/org/apache/hadoop/hadoop-yarn-server-nodemanager/2.6.5/hadoop-yarn-server-nodemanager-2.6.5.jar
3/76 KB   
3/76 KB   3/652 KB   
5/76 KB   3/652 KB   
5/76 KB   5/652 KB   
8/76 KB   5/652 KB   
11/76 KB   5/652 KB   
11/76 KB   8/652 KB   
13/76 KB   8/652 KB   
13/76 KB   11/652 KB   
16/76 KB   11/652 KB   
16/76 KB   13/652 KB   
19/76 KB   13/652 KB   
19/76 KB   16/652 KB   
21/76 KB   16/652 KB   
21/76 KB   19/652 KB   
24/76 KB   19/652 KB   
24/76 KB   21/652 KB   
27/76 KB   21/652 KB   
27/76 KB   24/652 KB   
29/76 KB   24/652 KB   
29/76 KB   27/652 KB   
32/76 KB   27/652 KB   
32/76 KB   29/652 KB   
32/76 KB   32/652 KB   
36/76 KB   32/652 KB   
40/76 KB   32/652 KB   
44/76 KB   32/652 KB   
48/76 KB   32/652 KB   
48/76 KB   36/652 KB   
48/76 KB   40/652 KB   
48/76 KB   44/652 KB   
48/76 KB   48/652 KB   
52/76 KB   48/652 KB   
56/76 KB   48/652 KB   
60/76 KB   48/652 KB   
60/76 KB   52/652 KB   
64/76 KB   52/652 KB   
64/76 KB   56/652 KB   
64/76 KB   60/652 KB   
64/76 KB   64/652 KB   
68/76 KB   64/652 KB   
72/76 KB   64/652 KB   
76/76 KB   64/652 KB   
76/76 KB   64/652 KB   
76/76 KB   68/652 KB   
76/76 KB   72/652 KB   
76/76 KB   76/652 KB   
76/76 KB   80/652 KB   
76/76 KB   84/652 KB   
76/76 KB   88/652 KB   
76/76 KB   92/652 KB   
76/76 KB   96/652 KB   
76/76 KB   100/652 KB   
76/76 KB   104/652 KB   
76/76 KB   108/652 KB   
76/76 KB   112/652 KB   
76/76 KB   116/652 KB   
76/76 KB   120/652 KB   
76/76 KB   124/652 KB   
76/76 KB   128/652 KB   
76/76 KB   132/652 KB   
76/76 KB   136/652 KB   
76/76 KB   140/652 KB   
76/76 KB   144/652 KB   
76/76 KB   148/652 KB   
76/76 KB   152/652 KB   
76/76 KB   156/652 KB   
76/76 KB   160/652 KB   
76/76 KB   164/652 KB   
76/76 KB   168/652 KB   
76/76 KB   172/652 KB   
76/76 KB   176/652 KB   
                        
180/652 KB              
Downloaded: https://repo1.maven.org/maven2/org/apache/hadoop/hadoop-yarn-server-tests/2.6.5/hadoop-yarn-server-tests-2.6.5-tests.jar (76 KB at 3036.7 KB/sec)
Downloading: https://repo1.maven.org/maven2/org/apache/hadoop/hadoop-yarn-server-resourcemanager/2.6.5/hadoop-yarn-server-resourcemanager-2.6.5.jar
184/652 KB   
188/652 KB   
192/652 KB   
196/652 KB   
200/652 KB   
204/652 KB   
208/652 KB   
212/652 KB   
216/652 KB   
220/652 KB   
224/652 KB   
228/652 KB   
232/652 KB   
236/652 KB   
240/652 KB   
244/652 KB   
248/652 KB   
252/652 KB   
256/652 KB   
260/652 KB   
264/652 KB   
268/652 KB   
272/652 KB   
276/652 KB   
280/652 KB   
284/652 KB   
288/652 KB   
292/652 KB   
296/652 KB   
300/652 KB   
304/652 KB   
308/652 KB   
312/652 KB   
316/652 KB   
320/652 KB   
324/652 KB   
328/652 KB   
332/652 KB   
336/652 KB   
340/652 KB   
344/652 KB   
348/652 KB   
352/652 KB   
356/652 KB   
360/652 KB   
364/652 KB   
368/652 KB   
372/652 KB   
376/652 KB   
380/652 KB   
384/652 KB   
388/652 KB   
392/652 KB   
396/652 KB   
400/652 KB   
404/652 KB   
408/652 KB   
412/652 KB   
416/652 KB   
420/652 KB   
424/652 KB   
428/652 KB   
432/652 KB   
436/652 KB   
440/652 KB   
444/652 KB   
448/652 KB   
452/652 KB   
456/652 KB   
460/652 KB   
464/652 KB   
468/652 KB   
472/652 KB   
476/652 KB   
480/652 KB   
484/652 KB   
488/652 KB   
492/652 KB   
496/652 KB   
500/652 KB   
504/652 KB   
508/652 KB   
512/652 KB   
516/652 KB   
520/652 KB   
524/652 KB   
528/652 KB   
532/652 KB   
536/652 KB   
540/652 KB   
544/652 KB   
548/652 KB   
552/652 KB   
556/652 KB   
560/652 KB   
564/652 KB   
568/652 KB   
572/652 KB   
576/652 KB   
580/652 KB   
584/652 KB   
588/652 KB   
592/652 KB   
3/3058 KB   592/652 KB   
3/3058 KB   596/652 KB   
3/3058 KB   600/652 KB   
5/3058 KB   600/652 KB   
5/3058 KB   604/652 KB   
5/3058 KB   608/652 KB   
8/3058 KB   608/652 KB   
11/3058 KB   608/652 KB   
13/3058 KB   608/652 KB   
13/3058 KB   612/652 KB   
16/3058 KB   612/652 KB   
16/3058 KB   616/652 KB   
16/3058 KB   620/652 KB   
16/3058 KB   624/652 KB   
19/3058 KB   624/652 KB   
21/3058 KB   624/652 KB   
24/3058 KB   624/652 KB   
27/3058 KB   624/652 KB   
27/3058 KB   628/652 KB   
27/3058 KB   632/652 KB   
29/3058 KB   632/652 KB   
29/3058 KB   636/652 KB   
29/3058 KB   640/652 KB   
32/3058 KB   640/652 KB   
32/3058 KB   644/652 KB   
32/3058 KB   648/652 KB   
32/3058 KB   652/652 KB   
32/3058 KB   652/652 KB   
36/3058 KB   652/652 KB   
40/3058 KB   652/652 KB   
44/3058 KB   652/652 KB   
48/3058 KB   652/652 KB   
52/3058 KB   652/652 KB   
56/3058 KB   652/652 KB   
60/3058 KB   652/652 KB   
64/3058 KB   652/652 KB   
68/3058 KB   652/652 KB   
72/3058 KB   652/652 KB   
76/3058 KB   652/652 KB   
80/3058 KB   652/652 KB   
84/3058 KB   652/652 KB   
88/3058 KB   652/652 KB   
92/3058 KB   652/652 KB   
96/3058 KB   652/652 KB   
100/3058 KB   652/652 KB   
104/3058 KB   652/652 KB   
108/3058 KB   652/652 KB   
112/3058 KB   652/652 KB   
116/3058 KB   652/652 KB   
120/3058 KB   652/652 KB   
124/3058 KB   652/652 KB   
128/3058 KB   652/652 KB   
132/3058 KB   652/652 KB   
136/3058 KB   652/652 KB   
140/3058 KB   652/652 KB   
144/3058 KB   652/652 KB   
148/3058 KB   652/652 KB   
152/3058 KB   652/652 KB   
156/3058 KB   652/652 KB   
160/3058 KB   652/652 KB   
                           
Downloaded: https://repo1.maven.org/maven2/org/apache/hadoop/hadoop-yarn-server-nodemanager/2.6.5/hadoop-yarn-server-nodemanager-2.6.5.jar (652 KB at 10686.8 KB/sec)
Downloading: https://repo1.maven.org/maven2/org/apache/hadoop/hadoop-yarn-server-applicationhistoryservice/2.6.5/hadoop-yarn-server-applicationhistoryservice-2.6.5.jar
164/3058 KB                
168/3058 KB   
172/3058 KB   
176/3058 KB   
180/3058 KB   
184/3058 KB   
188/3058 KB   
192/3058 KB   
196/3058 KB   
200/3058 KB   
204/3058 KB   
208/3058 KB   
212/3058 KB   
216/3058 KB   
220/3058 KB   
224/3058 KB   
228/3058 KB   
232/3058 KB   
236/3058 KB   
240/3058 KB   
244/3058 KB   
248/3058 KB   
252/3058 KB   
256/3058 KB   
260/3058 KB   
264/3058 KB   
268/3058 KB   
272/3058 KB   
276/3058 KB   
280/3058 KB   
284/3058 KB   
288/3058 KB   
292/3058 KB   
296/3058 KB   
300/3058 KB   
304/3058 KB   
308/3058 KB   
312/3058 KB   
316/3058 KB   
320/3058 KB   
324/3058 KB   
328/3058 KB   
332/3058 KB   
336/3058 KB   
340/3058 KB   
344/3058 KB   
348/3058 KB   
352/3058 KB   
356/3058 KB   
360/3058 KB   
364/3058 KB   
368/3058 KB   
372/3058 KB   
376/3058 KB   
380/3058 KB   
384/3058 KB   
388/3058 KB   
392/3058 KB   
396/3058 KB   
400/3058 KB   
404/3058 KB   
408/3058 KB   
412/3058 KB   
416/3058 KB   
420/3058 KB   
424/3058 KB   
428/3058 KB   
432/3058 KB   
436/3058 KB   
440/3058 KB   
444/3058 KB   
448/3058 KB   
452/3058 KB   
456/3058 KB   
460/3058 KB   
464/3058 KB   
468/3058 KB   
472/3058 KB   
476/3058 KB   
480/3058 KB   
484/3058 KB   
488/3058 KB   
492/3058 KB   
496/3058 KB   
500/3058 KB   
504/3058 KB   
508/3058 KB   
512/3058 KB   
516/3058 KB   
520/3058 KB   
524/3058 KB   
528/3058 KB   
532/3058 KB   
536/3058 KB   
540/3058 KB   
544/3058 KB   
548/3058 KB   
552/3058 KB   
556/3058 KB   
560/3058 KB   
564/3058 KB   
568/3058 KB   
572/3058 KB   
576/3058 KB   
580/3058 KB   
584/3058 KB   
588/3058 KB   
592/3058 KB   
596/3058 KB   
600/3058 KB   
604/3058 KB   
608/3058 KB   
612/3058 KB   
616/3058 KB   
620/3058 KB   
624/3058 KB   
628/3058 KB   
632/3058 KB   
636/3058 KB   
640/3058 KB   
644/3058 KB   
648/3058 KB   
652/3058 KB   
656/3058 KB   
660/3058 KB   
664/3058 KB   
668/3058 KB   
672/3058 KB   
676/3058 KB   
680/3058 KB   
684/3058 KB   
688/3058 KB   
692/3058 KB   
696/3058 KB   
700/3058 KB   
704/3058 KB   
708/3058 KB   
712/3058 KB   
716/3058 KB   
720/3058 KB   
724/3058 KB   
728/3058 KB   
732/3058 KB   
736/3058 KB   
740/3058 KB   
744/3058 KB   
748/3058 KB   
752/3058 KB   
756/3058 KB   
760/3058 KB   
764/3058 KB   
768/3058 KB   
772/3058 KB   
776/3058 KB   
780/3058 KB   
784/3058 KB   
788/3058 KB   
792/3058 KB   
796/3058 KB   
800/3058 KB   
804/3058 KB   
808/3058 KB   
812/3058 KB   
816/3058 KB   
820/3058 KB   
824/3058 KB   
828/3058 KB   
832/3058 KB   
836/3058 KB   
840/3058 KB   
844/3058 KB   
848/3058 KB   
852/3058 KB   
856/3058 KB   
860/3058 KB   
864/3058 KB   
868/3058 KB   
872/3058 KB   
876/3058 KB   
880/3058 KB   
884/3058 KB   
888/3058 KB   
892/3058 KB   
896/3058 KB   
900/3058 KB   
904/3058 KB   
908/3058 KB   
912/3058 KB   
916/3058 KB   
920/3058 KB   
924/3058 KB   
928/3058 KB   
932/3058 KB   
936/3058 KB   
940/3058 KB   
944/3058 KB   
948/3058 KB   
952/3058 KB   
956/3058 KB   
960/3058 KB   
964/3058 KB   
968/3058 KB   
972/3058 KB   
976/3058 KB   
980/3058 KB   
984/3058 KB   
988/3058 KB   
992/3058 KB   
996/3058 KB   
1000/3058 KB   
1004/3058 KB   
1008/3058 KB   
1012/3058 KB   
1016/3058 KB   
1020/3058 KB   
1024/3058 KB   
1028/3058 KB   
1032/3058 KB   
1036/3058 KB   
1040/3058 KB   
1044/3058 KB   
1048/3058 KB   
1052/3058 KB   
1056/3058 KB   
1060/3058 KB   
1064/3058 KB   
1068/3058 KB   
1072/3058 KB   
1076/3058 KB   
1080/3058 KB   
1084/3058 KB   
1088/3058 KB   
1092/3058 KB   
1096/3058 KB   
1100/3058 KB   
1104/3058 KB   
1108/3058 KB   
1112/3058 KB   
1116/3058 KB   
1120/3058 KB   
1124/3058 KB   
1128/3058 KB   
1132/3058 KB   
1136/3058 KB   
1140/3058 KB   
1144/3058 KB   
1148/3058 KB   
1152/3058 KB   
1156/3058 KB   
1160/3058 KB   
1164/3058 KB   
1168/3058 KB   
1172/3058 KB   
1176/3058 KB   
1180/3058 KB   
1184/3058 KB   
1188/3058 KB   
1192/3058 KB   
1196/3058 KB   
1200/3058 KB   
1204/3058 KB   
1208/3058 KB   
1212/3058 KB   
1216/3058 KB   
1220/3058 KB   
1224/3058 KB   
1228/3058 KB   
1232/3058 KB   
1236/3058 KB   
1240/3058 KB   
1244/3058 KB   
1248/3058 KB   
1252/3058 KB   
1256/3058 KB   
1260/3058 KB   
1264/3058 KB   
1268/3058 KB   
1272/3058 KB   
1276/3058 KB   
1280/3058 KB   
1284/3058 KB   
1288/3058 KB   
1292/3058 KB   
1296/3058 KB   
1300/3058 KB   
1304/3058 KB   
1308/3058 KB   
1312/3058 KB   
1316/3058 KB   
1320/3058 KB   
1324/3058 KB   
1328/3058 KB   
1332/3058 KB   
1336/3058 KB   
1340/3058 KB   
1344/3058 KB   
1348/3058 KB   
1352/3058 KB   
1356/3058 KB   
1360/3058 KB   
1364/3058 KB   
1368/3058 KB   
1372/3058 KB   
1376/3058 KB   
1380/3058 KB   
1384/3058 KB   
1388/3058 KB   
1392/3058 KB   
1396/3058 KB   
1400/3058 KB   
1404/3058 KB   
1408/3058 KB   
1412/3058 KB   
1416/3058 KB   
1420/3058 KB   
1424/3058 KB   
1428/3058 KB   
1432/3058 KB   
1436/3058 KB   
1440/3058 KB   
1444/3058 KB   
1448/3058 KB   
1452/3058 KB   
1456/3058 KB   
1460/3058 KB   
1464/3058 KB   
1468/3058 KB   
1472/3058 KB   
1476/3058 KB   
1480/3058 KB   
1484/3058 KB   
1488/3058 KB   
1492/3058 KB   
1496/3058 KB   
1500/3058 KB   
1504/3058 KB   
1508/3058 KB   
1512/3058 KB   
1516/3058 KB   
1520/3058 KB   
1524/3058 KB   
1528/3058 KB   
1532/3058 KB   
1536/3058 KB   
1540/3058 KB   
1544/3058 KB   
1548/3058 KB   
1552/3058 KB   
1556/3058 KB   
1560/3058 KB   
1564/3058 KB   
1568/3058 KB   
1572/3058 KB   
1576/3058 KB   
1580/3058 KB   
1584/3058 KB   
1588/3058 KB   
1592/3058 KB   
1596/3058 KB   
1600/3058 KB   
1604/3058 KB   
1608/3058 KB   
1612/3058 KB   
1616/3058 KB   
1620/3058 KB   
1624/3058 KB   
1628/3058 KB   
1632/3058 KB   
1636/3058 KB   
1640/3058 KB   
1644/3058 KB   
1648/3058 KB   
1652/3058 KB   
1656/3058 KB   
1660/3058 KB   
1664/3058 KB   
1668/3058 KB   
1672/3058 KB   
1676/3058 KB   
1680/3058 KB   
1684/3058 KB   
1688/3058 KB   
1692/3058 KB   
1696/3058 KB   
1700/3058 KB   
1704/3058 KB   
1708/3058 KB   
1712/3058 KB   
1716/3058 KB   
1720/3058 KB   
1724/3058 KB   
1728/3058 KB   
1732/3058 KB   
1736/3058 KB   
1740/3058 KB   
1744/3058 KB   
1748/3058 KB   
1752/3058 KB   
1756/3058 KB   
1760/3058 KB   
1764/3058 KB   
1768/3058 KB   
1772/3058 KB   
1776/3058 KB   
1780/3058 KB   
1784/3058 KB   
1788/3058 KB   
1792/3058 KB   
1796/3058 KB   
1800/3058 KB   
1804/3058 KB   
1808/3058 KB   
1812/3058 KB   
1816/3058 KB   
1820/3058 KB   
1824/3058 KB   
1828/3058 KB   
1832/3058 KB   
1836/3058 KB   
1840/3058 KB   
1844/3058 KB   
1848/3058 KB   
1852/3058 KB   
1856/3058 KB   
1856/3058 KB   
1860/3058 KB   
1864/3058 KB   
1868/3058 KB   
1872/3058 KB   
1876/3058 KB   
1880/3058 KB   
1884/3058 KB   
1888/3058 KB   
1892/3058 KB   
1896/3058 KB   
1900/3058 KB   
1904/3058 KB   
1908/3058 KB   
1912/3058 KB   
1916/3058 KB   
1920/3058 KB   
1924/3058 KB   
1928/3058 KB   
1932/3058 KB   
1936/3058 KB   
1940/3058 KB   
1944/3058 KB   
1948/3058 KB   
1952/3058 KB   
1956/3058 KB   
1960/3058 KB   
1964/3058 KB   
1968/3058 KB   
1972/3058 KB   
1976/3058 KB   
1980/3058 KB   
1984/3058 KB   
1988/3058 KB   
1992/3058 KB   
1996/3058 KB   
2000/3058 KB   
2004/3058 KB   
2008/3058 KB   
2012/3058 KB   
2016/3058 KB   
3/25 KB   2016/3058 KB   
3/25 KB   2020/3058 KB   
3/25 KB   2024/3058 KB   
3/25 KB   2028/3058 KB   
3/25 KB   2032/3058 KB   
5/25 KB   2032/3058 KB   
8/25 KB   2032/3058 KB   
11/25 KB   2032/3058 KB   
11/25 KB   2036/3058 KB   
11/25 KB   2040/3058 KB   
11/25 KB   2044/3058 KB   
11/25 KB   2048/3058 KB   
13/25 KB   2048/3058 KB   
16/25 KB   2048/3058 KB   
19/25 KB   2048/3058 KB   
19/25 KB   2052/3058 KB   
19/25 KB   2056/3058 KB   
21/25 KB   2056/3058 KB   
21/25 KB   2060/3058 KB   
21/25 KB   2064/3058 KB   
24/25 KB   2064/3058 KB   
25/25 KB   2064/3058 KB   
25/25 KB   2068/3058 KB   
25/25 KB   2072/3058 KB   
25/25 KB   2076/3058 KB   
25/25 KB   2080/3058 KB   
25/25 KB   2084/3058 KB   
25/25 KB   2088/3058 KB   
25/25 KB   2092/3058 KB   
25/25 KB   2096/3058 KB   
25/25 KB   2100/3058 KB   
25/25 KB   2104/3058 KB   
25/25 KB   2108/3058 KB   
25/25 KB   2112/3058 KB   
25/25 KB   2116/3058 KB   
25/25 KB   2120/3058 KB   
25/25 KB   2124/3058 KB   
25/25 KB   2128/3058 KB   
25/25 KB   2132/3058 KB   
25/25 KB   2136/3058 KB   
25/25 KB   2140/3058 KB   
25/25 KB   2144/3058 KB   
25/25 KB   2148/3058 KB   
25/25 KB   2152/3058 KB   
25/25 KB   2156/3058 KB   
25/25 KB   2160/3058 KB   
25/25 KB   2164/3058 KB   
25/25 KB   2168/3058 KB   
25/25 KB   2172/3058 KB   
25/25 KB   2176/3058 KB   
25/25 KB   2180/3058 KB   
25/25 KB   2184/3058 KB   
25/25 KB   2188/3058 KB   
25/25 KB   2192/3058 KB   
25/25 KB   2196/3058 KB   
25/25 KB   2200/3058 KB   
25/25 KB   2204/3058 KB   
25/25 KB   2208/3058 KB   
25/25 KB   2212/3058 KB   
25/25 KB   2216/3058 KB   
25/25 KB   2220/3058 KB   
25/25 KB   2224/3058 KB   
4/187 KB   25/25 KB   2224/3058 KB   
4/187 KB   25/25 KB   2228/3058 KB   
4/187 KB   25/25 KB   2232/3058 KB   
8/187 KB   25/25 KB   2232/3058 KB   
8/187 KB   25/25 KB   2236/3058 KB   
8/187 KB   25/25 KB   2240/3058 KB   
12/187 KB   25/25 KB   2240/3058 KB   
16/187 KB   25/25 KB   2240/3058 KB   
16/187 KB   25/25 KB   2244/3058 KB   
16/187 KB   25/25 KB   2248/3058 KB   
16/187 KB   25/25 KB   2252/3058 KB   
16/187 KB   25/25 KB   2256/3058 KB   
                                      
20/187 KB   2256/3058 KB              
20/187 KB   2260/3058 KB   
20/187 KB   2264/3058 KB   
Downloaded: https://repo1.maven.org/maven2/org/apache/hadoop/hadoop-minicluster/2.6.5/hadoop-minicluster-2.6.5.jar (25 KB at 159.6 KB/sec)
24/187 KB   2264/3058 KB   
Downloading: https://repo1.maven.org/maven2/org/apache/hadoop/hadoop-mapreduce-client-jobclient/2.6.5/hadoop-mapreduce-client-jobclient-2.6.5-tests.jar
24/187 KB   2268/3058 KB   
24/187 KB   2272/3058 KB   
28/187 KB   2272/3058 KB   
32/187 KB   2272/3058 KB   
32/187 KB   2276/3058 KB   
32/187 KB   2280/3058 KB   
32/187 KB   2284/3058 KB   
32/187 KB   2288/3058 KB   
36/187 KB   2288/3058 KB   
40/187 KB   2288/3058 KB   
40/187 KB   2292/3058 KB   
40/187 KB   2296/3058 KB   
44/187 KB   2296/3058 KB   
44/187 KB   2300/3058 KB   
44/187 KB   2304/3058 KB   
48/187 KB   2304/3058 KB   
48/187 KB   2308/3058 KB   
48/187 KB   2312/3058 KB   
48/187 KB   2316/3058 KB   
48/187 KB   2320/3058 KB   
52/187 KB   2320/3058 KB   
56/187 KB   2320/3058 KB   
56/187 KB   2324/3058 KB   
60/187 KB   2324/3058 KB   
60/187 KB   2328/3058 KB   
60/187 KB   2332/3058 KB   
64/187 KB   2332/3058 KB   
64/187 KB   2336/3058 KB   
64/187 KB   2340/3058 KB   
64/187 KB   2344/3058 KB   
64/187 KB   2348/3058 KB   
64/187 KB   2352/3058 KB   
68/187 KB   2352/3058 KB   
72/187 KB   2352/3058 KB   
76/187 KB   2352/3058 KB   
80/187 KB   2352/3058 KB   
80/187 KB   2356/3058 KB   
80/187 KB   2360/3058 KB   
80/187 KB   2364/3058 KB   
80/187 KB   2368/3058 KB   
80/187 KB   2372/3058 KB   
80/187 KB   2376/3058 KB   
80/187 KB   2380/3058 KB   
80/187 KB   2384/3058 KB   
84/187 KB   2384/3058 KB   
88/187 KB   2384/3058 KB   
92/187 KB   2384/3058 KB   
96/187 KB   2384/3058 KB   
96/187 KB   2388/3058 KB   
96/187 KB   2392/3058 KB   
96/187 KB   2396/3058 KB   
96/187 KB   2400/3058 KB   
96/187 KB   2404/3058 KB   
96/187 KB   2408/3058 KB   
96/187 KB   2412/3058 KB   
96/187 KB   2416/3058 KB   
100/187 KB   2416/3058 KB   
104/187 KB   2416/3058 KB   
108/187 KB   2416/3058 KB   
112/187 KB   2416/3058 KB   
112/187 KB   2420/3058 KB   
112/187 KB   2424/3058 KB   
112/187 KB   2428/3058 KB   
112/187 KB   2432/3058 KB   
112/187 KB   2436/3058 KB   
112/187 KB   2440/3058 KB   
112/187 KB   2444/3058 KB   
116/187 KB   2444/3058 KB   
116/187 KB   2448/3058 KB   
120/187 KB   2448/3058 KB   
124/187 KB   2448/3058 KB   
128/187 KB   2448/3058 KB   
128/187 KB   2452/3058 KB   
128/187 KB   2456/3058 KB   
128/187 KB   2460/3058 KB   
128/187 KB   2464/3058 KB   
132/187 KB   2464/3058 KB   
132/187 KB   2468/3058 KB   
132/187 KB   2472/3058 KB   
136/187 KB   2472/3058 KB   
136/187 KB   2476/3058 KB   
136/187 KB   2480/3058 KB   
140/187 KB   2480/3058 KB   
144/187 KB   2480/3058 KB   
144/187 KB   2484/3058 KB   
144/187 KB   2488/3058 KB   
144/187 KB   2492/3058 KB   
144/187 KB   2496/3058 KB   
148/187 KB   2496/3058 KB   
148/187 KB   2500/3058 KB   
152/187 KB   2500/3058 KB   
152/187 KB   2504/3058 KB   
152/187 KB   2508/3058 KB   
156/187 KB   2508/3058 KB   
156/187 KB   2512/3058 KB   
160/187 KB   2512/3058 KB   
160/187 KB   2516/3058 KB   
160/187 KB   2520/3058 KB   
160/187 KB   2524/3058 KB   
160/187 KB   2528/3058 KB   
164/187 KB   2528/3058 KB   
168/187 KB   2528/3058 KB   
168/187 KB   2532/3058 KB   
168/187 KB   2536/3058 KB   
172/187 KB   2536/3058 KB   
172/187 KB   2540/3058 KB   
176/187 KB   2540/3058 KB   
176/187 KB   2544/3058 KB   
176/187 KB   2548/3058 KB   
176/187 KB   2552/3058 KB   
176/187 KB   2556/3058 KB   
176/187 KB   2560/3058 KB   
180/187 KB   2560/3058 KB   
184/187 KB   2560/3058 KB   
187/187 KB   2560/3058 KB   
187/187 KB   2564/3058 KB   
187/187 KB   2568/3058 KB   
187/187 KB   2572/3058 KB   
187/187 KB   2576/3058 KB   
187/187 KB   2580/3058 KB   
187/187 KB   2584/3058 KB   
187/187 KB   2588/3058 KB   
187/187 KB   2592/3058 KB   
187/187 KB   2596/3058 KB   
187/187 KB   2600/3058 KB   
187/187 KB   2604/3058 KB   
187/187 KB   2608/3058 KB   
187/187 KB   2612/3058 KB   
187/187 KB   2616/3058 KB   
187/187 KB   2620/3058 KB   
187/187 KB   2624/3058 KB   
187/187 KB   2628/3058 KB   
187/187 KB   2632/3058 KB   
187/187 KB   2636/3058 KB   
187/187 KB   2640/3058 KB   
187/187 KB   2644/3058 KB   
187/187 KB   2648/3058 KB   
187/187 KB   2652/3058 KB   
187/187 KB   2656/3058 KB   
187/187 KB   2660/3058 KB   
187/187 KB   2664/3058 KB   
187/187 KB   2668/3058 KB   
187/187 KB   2672/3058 KB   
187/187 KB   2676/3058 KB   
187/187 KB   2680/3058 KB   
187/187 KB   2684/3058 KB   
187/187 KB   2688/3058 KB   
187/187 KB   2692/3058 KB   
187/187 KB   2696/3058 KB   
187/187 KB   2700/3058 KB   
187/187 KB   2704/3058 KB   
187/187 KB   2708/3058 KB   
187/187 KB   2712/3058 KB   
187/187 KB   2716/3058 KB   
187/187 KB   2720/3058 KB   
187/187 KB   2724/3058 KB   
187/187 KB   2728/3058 KB   
187/187 KB   2732/3058 KB   
187/187 KB   2736/3058 KB   
187/187 KB   2740/3058 KB   
187/187 KB   2744/3058 KB   
187/187 KB   2748/3058 KB   
187/187 KB   2752/3058 KB   
187/187 KB   2756/3058 KB   
187/187 KB   2760/3058 KB   
187/187 KB   2764/3058 KB   
187/187 KB   2768/3058 KB   
187/187 KB   2772/3058 KB   
187/187 KB   2776/3058 KB   
187/187 KB   2780/3058 KB   
187/187 KB   2784/3058 KB   
                            
Downloaded: https://repo1.maven.org/maven2/org/apache/hadoop/hadoop-yarn-server-applicationhistoryservice/2.6.5/hadoop-yarn-server-applicationhistoryservice-2.6.5.jar (187 KB at 1075.3 KB/sec)
Downloading: https://repo1.maven.org/maven2/org/apache/hadoop/hadoop-yarn-server-web-proxy/2.6.5/hadoop-yarn-server-web-proxy-2.6.5.jar
2788/3058 KB                
2792/3058 KB   
2796/3058 KB   
2800/3058 KB   
2804/3058 KB   
2808/3058 KB   
2812/3058 KB   
2816/3058 KB   
2820/3058 KB   
2824/3058 KB   
2828/3058 KB   
2832/3058 KB   
2836/3058 KB   
2840/3058 KB   
2844/3058 KB   
2848/3058 KB   
2852/3058 KB   
2856/3058 KB   
2860/3058 KB   
2864/3058 KB   
2868/3058 KB   
2872/3058 KB   
2876/3058 KB   
2880/3058 KB   
2884/3058 KB   
2888/3058 KB   
2891/3058 KB   
2895/3058 KB   
2899/3058 KB   
2903/3058 KB   
2907/3058 KB   
2911/3058 KB   
2915/3058 KB   
2919/3058 KB   
2923/3058 KB   
2927/3058 KB   
2931/3058 KB   
2935/3058 KB   
2939/3058 KB   
2943/3058 KB   
2947/3058 KB   
2951/3058 KB   
2955/3058 KB   
2959/3058 KB   
2963/3058 KB   
2967/3058 KB   
2971/3058 KB   
2975/3058 KB   
2979/3058 KB   
2983/3058 KB   
2987/3058 KB   
2991/3058 KB   
2995/3058 KB   
2999/3058 KB   
3003/3058 KB   
3007/3058 KB   
3011/3058 KB   
3015/3058 KB   
3019/3058 KB   
3023/3058 KB   
3027/3058 KB   
3031/3058 KB   
3035/3058 KB   
4/52 KB   3035/3058 KB   
8/52 KB   3035/3058 KB   
12/52 KB   3035/3058 KB   
12/52 KB   3039/3058 KB   
12/52 KB   3043/3058 KB   
16/52 KB   3043/3058 KB   
16/52 KB   3047/3058 KB   
16/52 KB   3051/3058 KB   
16/52 KB   3055/3058 KB   
16/52 KB   3058/3058 KB   
20/52 KB   3058/3058 KB   
24/52 KB   3058/3058 KB   
28/52 KB   3058/3058 KB   
32/52 KB   3058/3058 KB   
36/52 KB   3058/3058 KB   
40/52 KB   3058/3058 KB   
44/52 KB   3058/3058 KB   
48/52 KB   3058/3058 KB   
52/52 KB   3058/3058 KB   
                          
Downloaded: https://repo1.maven.org/maven2/org/apache/hadoop/hadoop-hdfs/2.6.5/hadoop-hdfs-2.6.5-tests.jar (3058 KB at 15923.4 KB/sec)
Downloading: https://repo1.maven.org/maven2/org/apache/hadoop/hadoop-mapreduce-client-hs/2.6.5/hadoop-mapreduce-client-hs-2.6.5.jar
                          
Downloaded: https://repo1.maven.org/maven2/org/apache/hadoop/hadoop-yarn-server-web-proxy/2.6.5/hadoop-yarn-server-web-proxy-2.6.5.jar (52 KB at 265.8 KB/sec)
3/1773 KB                 
5/1773 KB   
8/1773 KB   
11/1773 KB   
13/1773 KB   
16/1773 KB   
19/1773 KB   
3/1486 KB   19/1773 KB   
3/1486 KB   21/1773 KB   
5/1486 KB   21/1773 KB   
5/1486 KB   24/1773 KB   
8/1486 KB   24/1773 KB   
8/1486 KB   27/1773 KB   
11/1486 KB   27/1773 KB   
11/1486 KB   29/1773 KB   
13/1486 KB   29/1773 KB   
16/1486 KB   29/1773 KB   
16/1486 KB   32/1773 KB   
19/1486 KB   32/1773 KB   
21/1486 KB   32/1773 KB   
24/1486 KB   32/1773 KB   
27/1486 KB   32/1773 KB   
29/1486 KB   32/1773 KB   
32/1486 KB   32/1773 KB   
36/1486 KB   32/1773 KB   
40/1486 KB   32/1773 KB   
40/1486 KB   36/1773 KB   
44/1486 KB   36/1773 KB   
44/1486 KB   40/1773 KB   
48/1486 KB   40/1773 KB   
48/1486 KB   44/1773 KB   
48/1486 KB   48/1773 KB   
52/1486 KB   48/1773 KB   
56/1486 KB   52/1773 KB   
52/1486 KB   52/1773 KB   
60/1486 KB   52/1773 KB   
60/1486 KB   56/1773 KB   
64/1486 KB   56/1773 KB   
64/1486 KB   60/1773 KB   
64/1486 KB   64/1773 KB   
68/1486 KB   64/1773 KB   
72/1486 KB   64/1773 KB   
72/1486 KB   68/1773 KB   
76/1486 KB   68/1773 KB   
76/1486 KB   72/1773 KB   
80/1486 KB   72/1773 KB   
80/1486 KB   76/1773 KB   
80/1486 KB   80/1773 KB   
84/1486 KB   80/1773 KB   
88/1486 KB   80/1773 KB   
92/1486 KB   80/1773 KB   
92/1486 KB   84/1773 KB   
96/1486 KB   84/1773 KB   
96/1486 KB   88/1773 KB   
96/1486 KB   92/1773 KB   
96/1486 KB   96/1773 KB   
100/1486 KB   96/1773 KB   
104/1486 KB   96/1773 KB   
108/1486 KB   96/1773 KB   
108/1486 KB   100/1773 KB   
112/1486 KB   100/1773 KB   
112/1486 KB   104/1773 KB   
112/1486 KB   108/1773 KB   
112/1486 KB   112/1773 KB   
116/1486 KB   112/1773 KB   
120/1486 KB   112/1773 KB   
124/1486 KB   112/1773 KB   
124/1486 KB   116/1773 KB   
128/1486 KB   116/1773 KB   
128/1486 KB   120/1773 KB   
128/1486 KB   124/1773 KB   
128/1486 KB   128/1773 KB   
128/1486 KB   128/1773 KB   4/254 KB   
132/1486 KB   128/1773 KB   4/254 KB   
132/1486 KB   128/1773 KB   8/254 KB   
136/1486 KB   128/1773 KB   8/254 KB   
136/1486 KB   128/1773 KB   12/254 KB   
140/1486 KB   128/1773 KB   12/254 KB   
140/1486 KB   132/1773 KB   12/254 KB   
140/1486 KB   132/1773 KB   16/254 KB   
144/1486 KB   132/1773 KB   16/254 KB   
144/1486 KB   136/1773 KB   16/254 KB   
144/1486 KB   140/1773 KB   16/254 KB   
144/1486 KB   144/1773 KB   16/254 KB   
148/1486 KB   144/1773 KB   16/254 KB   
152/1486 KB   144/1773 KB   16/254 KB   
152/1486 KB   144/1773 KB   20/254 KB   
156/1486 KB   144/1773 KB   20/254 KB   
156/1486 KB   144/1773 KB   24/254 KB   
160/1486 KB   144/1773 KB   24/254 KB   
160/1486 KB   148/1773 KB   24/254 KB   
160/1486 KB   148/1773 KB   28/254 KB   
160/1486 KB   152/1773 KB   28/254 KB   
160/1486 KB   152/1773 KB   32/254 KB   
160/1486 KB   156/1773 KB   32/254 KB   
160/1486 KB   160/1773 KB   32/254 KB   
164/1486 KB   160/1773 KB   32/254 KB   
168/1486 KB   160/1773 KB   32/254 KB   
172/1486 KB   160/1773 KB   32/254 KB   
176/1486 KB   160/1773 KB   32/254 KB   
176/1486 KB   160/1773 KB   36/254 KB   
176/1486 KB   164/1773 KB   36/254 KB   
176/1486 KB   164/1773 KB   40/254 KB   
176/1486 KB   168/1773 KB   40/254 KB   
176/1486 KB   168/1773 KB   44/254 KB   
176/1486 KB   172/1773 KB   44/254 KB   
176/1486 KB   172/1773 KB   48/254 KB   
176/1486 KB   176/1773 KB   48/254 KB   
180/1486 KB   176/1773 KB   48/254 KB   
184/1486 KB   176/1773 KB   48/254 KB   
188/1486 KB   176/1773 KB   48/254 KB   
192/1486 KB   176/1773 KB   48/254 KB   
192/1486 KB   180/1773 KB   48/254 KB   
192/1486 KB   184/1773 KB   48/254 KB   
192/1486 KB   188/1773 KB   48/254 KB   
192/1486 KB   192/1773 KB   48/254 KB   
192/1486 KB   192/1773 KB   52/254 KB   
192/1486 KB   192/1773 KB   56/254 KB   
192/1486 KB   192/1773 KB   60/254 KB   
192/1486 KB   192/1773 KB   64/254 KB   
196/1486 KB   192/1773 KB   64/254 KB   
200/1486 KB   192/1773 KB   64/254 KB   
204/1486 KB   192/1773 KB   64/254 KB   
208/1486 KB   192/1773 KB   64/254 KB   
208/1486 KB   196/1773 KB   64/254 KB   
208/1486 KB   200/1773 KB   64/254 KB   
208/1486 KB   204/1773 KB   64/254 KB   
208/1486 KB   208/1773 KB   64/254 KB   
208/1486 KB   208/1773 KB   68/254 KB   
208/1486 KB   208/1773 KB   72/254 KB   
208/1486 KB   208/1773 KB   76/254 KB   
208/1486 KB   208/1773 KB   80/254 KB   
212/1486 KB   208/1773 KB   80/254 KB   
216/1486 KB   208/1773 KB   80/254 KB   
220/1486 KB   208/1773 KB   80/254 KB   
224/1486 KB   208/1773 KB   80/254 KB   
224/1486 KB   212/1773 KB   80/254 KB   
224/1486 KB   216/1773 KB   80/254 KB   
224/1486 KB   220/1773 KB   80/254 KB   
224/1486 KB   224/1773 KB   80/254 KB   
224/1486 KB   224/1773 KB   84/254 KB   
224/1486 KB   224/1773 KB   88/254 KB   
224/1486 KB   224/1773 KB   92/254 KB   
228/1486 KB   224/1773 KB   92/254 KB   
228/1486 KB   224/1773 KB   96/254 KB   
232/1486 KB   224/1773 KB   96/254 KB   
236/1486 KB   224/1773 KB   96/254 KB   
240/1486 KB   224/1773 KB   96/254 KB   
240/1486 KB   228/1773 KB   96/254 KB   
240/1486 KB   232/1773 KB   96/254 KB   
240/1486 KB   236/1773 KB   96/254 KB   
240/1486 KB   240/1773 KB   96/254 KB   
240/1486 KB   240/1773 KB   100/254 KB   
240/1486 KB   240/1773 KB   104/254 KB   
244/1486 KB   240/1773 KB   104/254 KB   
244/1486 KB   240/1773 KB   108/254 KB   
248/1486 KB   240/1773 KB   108/254 KB   
248/1486 KB   240/1773 KB   112/254 KB   
252/1486 KB   240/1773 KB   112/254 KB   
252/1486 KB   244/1773 KB   112/254 KB   
256/1486 KB   244/1773 KB   112/254 KB   
256/1486 KB   248/1773 KB   112/254 KB   
256/1486 KB   252/1773 KB   112/254 KB   
256/1486 KB   256/1773 KB   112/254 KB   
260/1486 KB   256/1773 KB   112/254 KB   
264/1486 KB   256/1773 KB   112/254 KB   
268/1486 KB   256/1773 KB   112/254 KB   
268/1486 KB   260/1773 KB   112/254 KB   
272/1486 KB   260/1773 KB   112/254 KB   
272/1486 KB   264/1773 KB   112/254 KB   
272/1486 KB   264/1773 KB   116/254 KB   
272/1486 KB   268/1773 KB   116/254 KB   
272/1486 KB   268/1773 KB   120/254 KB   
272/1486 KB   272/1773 KB   120/254 KB   
272/1486 KB   272/1773 KB   124/254 KB   
272/1486 KB   272/1773 KB   128/254 KB   
276/1486 KB   272/1773 KB   128/254 KB   
280/1486 KB   272/1773 KB   128/254 KB   
284/1486 KB   272/1773 KB   128/254 KB   
284/1486 KB   276/1773 KB   128/254 KB   
288/1486 KB   276/1773 KB   128/254 KB   
288/1486 KB   280/1773 KB   128/254 KB   
288/1486 KB   284/1773 KB   128/254 KB   
288/1486 KB   284/1773 KB   132/254 KB   
288/1486 KB   288/1773 KB   132/254 KB   
288/1486 KB   288/1773 KB   136/254 KB   
288/1486 KB   288/1773 KB   140/254 KB   
288/1486 KB   288/1773 KB   144/254 KB   
292/1486 KB   288/1773 KB   144/254 KB   
296/1486 KB   288/1773 KB   144/254 KB   
296/1486 KB   292/1773 KB   144/254 KB   
300/1486 KB   292/1773 KB   144/254 KB   
300/1486 KB   296/1773 KB   144/254 KB   
304/1486 KB   296/1773 KB   144/254 KB   
304/1486 KB   300/1773 KB   144/254 KB   
304/1486 KB   300/1773 KB   148/254 KB   
304/1486 KB   304/1773 KB   148/254 KB   
304/1486 KB   304/1773 KB   152/254 KB   
304/1486 KB   304/1773 KB   156/254 KB   
304/1486 KB   304/1773 KB   160/254 KB   
308/1486 KB   304/1773 KB   160/254 KB   
312/1486 KB   304/1773 KB   160/254 KB   
312/1486 KB   308/1773 KB   160/254 KB   
316/1486 KB   308/1773 KB   160/254 KB   
316/1486 KB   312/1773 KB   160/254 KB   
320/1486 KB   312/1773 KB   160/254 KB   
320/1486 KB   316/1773 KB   160/254 KB   
320/1486 KB   320/1773 KB   160/254 KB   
320/1486 KB   320/1773 KB   164/254 KB   
320/1486 KB   320/1773 KB   168/254 KB   
320/1486 KB   320/1773 KB   172/254 KB   
320/1486 KB   320/1773 KB   176/254 KB   
324/1486 KB   320/1773 KB   176/254 KB   
328/1486 KB   320/1773 KB   176/254 KB   
332/1486 KB   320/1773 KB   176/254 KB   
332/1486 KB   324/1773 KB   176/254 KB   
336/1486 KB   324/1773 KB   176/254 KB   
336/1486 KB   328/1773 KB   176/254 KB   
336/1486 KB   332/1773 KB   176/254 KB   
336/1486 KB   336/1773 KB   176/254 KB   
336/1486 KB   336/1773 KB   180/254 KB   
336/1486 KB   336/1773 KB   184/254 KB   
340/1486 KB   336/1773 KB   184/254 KB   
340/1486 KB   336/1773 KB   188/254 KB   
344/1486 KB   336/1773 KB   188/254 KB   
344/1486 KB   336/1773 KB   192/254 KB   
348/1486 KB   336/1773 KB   192/254 KB   
348/1486 KB   340/1773 KB   192/254 KB   
352/1486 KB   340/1773 KB   192/254 KB   
352/1486 KB   344/1773 KB   192/254 KB   
352/1486 KB   348/1773 KB   192/254 KB   
352/1486 KB   352/1773 KB   192/254 KB   
352/1486 KB   352/1773 KB   196/254 KB   
356/1486 KB   352/1773 KB   196/254 KB   
356/1486 KB   352/1773 KB   200/254 KB   
360/1486 KB   352/1773 KB   200/254 KB   
360/1486 KB   352/1773 KB   204/254 KB   
364/1486 KB   352/1773 KB   204/254 KB   
364/1486 KB   352/1773 KB   208/254 KB   
368/1486 KB   352/1773 KB   208/254 KB   
368/1486 KB   356/1773 KB   208/254 KB   
368/1486 KB   360/1773 KB   208/254 KB   
368/1486 KB   364/1773 KB   208/254 KB   
368/1486 KB   368/1773 KB   208/254 KB   
372/1486 KB   368/1773 KB   208/254 KB   
376/1486 KB   368/1773 KB   208/254 KB   
376/1486 KB   368/1773 KB   212/254 KB   
380/1486 KB   368/1773 KB   212/254 KB   
380/1486 KB   368/1773 KB   216/254 KB   
384/1486 KB   368/1773 KB   216/254 KB   
384/1486 KB   372/1773 KB   216/254 KB   
384/1486 KB   372/1773 KB   220/254 KB   
384/1486 KB   376/1773 KB   220/254 KB   
384/1486 KB   380/1773 KB   220/254 KB   
384/1486 KB   380/1773 KB   224/254 KB   
384/1486 KB   384/1773 KB   224/254 KB   
388/1486 KB   384/1773 KB   224/254 KB   
392/1486 KB   384/1773 KB   224/254 KB   
396/1486 KB   384/1773 KB   224/254 KB   
396/1486 KB   388/1773 KB   224/254 KB   
400/1486 KB   388/1773 KB   224/254 KB   
400/1486 KB   392/1773 KB   224/254 KB   
400/1486 KB   396/1773 KB   224/254 KB   
400/1486 KB   400/1773 KB   224/254 KB   
400/1486 KB   400/1773 KB   228/254 KB   
400/1486 KB   400/1773 KB   232/254 KB   
400/1486 KB   400/1773 KB   236/254 KB   
400/1486 KB   400/1773 KB   240/254 KB   
404/1486 KB   400/1773 KB   240/254 KB   
408/1486 KB   400/1773 KB   240/254 KB   
412/1486 KB   400/1773 KB   240/254 KB   
416/1486 KB   400/1773 KB   240/254 KB   
420/1486 KB   400/1773 KB   240/254 KB   
420/1486 KB   404/1773 KB   240/254 KB   
424/1486 KB   404/1773 KB   240/254 KB   
428/1486 KB   404/1773 KB   240/254 KB   
428/1486 KB   404/1773 KB   244/254 KB   
428/1486 KB   408/1773 KB   244/254 KB   
432/1486 KB   408/1773 KB   244/254 KB   
432/1486 KB   408/1773 KB   248/254 KB   
432/1486 KB   412/1773 KB   248/254 KB   
432/1486 KB   412/1773 KB   252/254 KB   
432/1486 KB   416/1773 KB   254/254 KB   
432/1486 KB   416/1773 KB   254/254 KB   
436/1486 KB   416/1773 KB   254/254 KB   
436/1486 KB   420/1773 KB   254/254 KB   
440/1486 KB   420/1773 KB   254/254 KB   
444/1486 KB   420/1773 KB   254/254 KB   
444/1486 KB   424/1773 KB   254/254 KB   
448/1486 KB   424/1773 KB   254/254 KB   
448/1486 KB   428/1773 KB   254/254 KB   
448/1486 KB   432/1773 KB   254/254 KB   
452/1486 KB   432/1773 KB   254/254 KB   
456/1486 KB   432/1773 KB   254/254 KB   
456/1486 KB   436/1773 KB   254/254 KB   
460/1486 KB   436/1773 KB   254/254 KB   
464/1486 KB   436/1773 KB   254/254 KB   
464/1486 KB   440/1773 KB   254/254 KB   
464/1486 KB   444/1773 KB   254/254 KB   
464/1486 KB   448/1773 KB   254/254 KB   
468/1486 KB   448/1773 KB   254/254 KB   
472/1486 KB   448/1773 KB   254/254 KB   
476/1486 KB   448/1773 KB   254/254 KB   
480/1486 KB   448/1773 KB   254/254 KB   
480/1486 KB   452/1773 KB   254/254 KB   
480/1486 KB   456/1773 KB   254/254 KB   
480/1486 KB   460/1773 KB   254/254 KB   
480/1486 KB   464/1773 KB   254/254 KB   
484/1486 KB   464/1773 KB   254/254 KB   
488/1486 KB   464/1773 KB   254/254 KB   
492/1486 KB   464/1773 KB   254/254 KB   
496/1486 KB   464/1773 KB   254/254 KB   
496/1486 KB   468/1773 KB   254/254 KB   
496/1486 KB   472/1773 KB   254/254 KB   
496/1486 KB   476/1773 KB   254/254 KB   
496/1486 KB   480/1773 KB   254/254 KB   
500/1486 KB   480/1773 KB   254/254 KB   
504/1486 KB   480/1773 KB   254/254 KB   
508/1486 KB   480/1773 KB   254/254 KB   
512/1486 KB   480/1773 KB   254/254 KB   
512/1486 KB   484/1773 KB   254/254 KB   
512/1486 KB   488/1773 KB   254/254 KB   
516/1486 KB   488/1773 KB   254/254 KB   
516/1486 KB   492/1773 KB   254/254 KB   
520/1486 KB   492/1773 KB   254/254 KB   
520/1486 KB   496/1773 KB   254/254 KB   
524/1486 KB   496/1773 KB   254/254 KB   
528/1486 KB   496/1773 KB   254/254 KB   
532/1486 KB   496/1773 KB   254/254 KB   
536/1486 KB   496/1773 KB   254/254 KB   
536/1486 KB   500/1773 KB   254/254 KB   
540/1486 KB   500/1773 KB   254/254 KB   
540/1486 KB   504/1773 KB   254/254 KB   
544/1486 KB   504/1773 KB   254/254 KB   
544/1486 KB   508/1773 KB   254/254 KB   
544/1486 KB   512/1773 KB   254/254 KB   
548/1486 KB   512/1773 KB   254/254 KB   
552/1486 KB   512/1773 KB   254/254 KB   
556/1486 KB   512/1773 KB   254/254 KB   
                                         
560/1486 KB   512/1773 KB                
Downloaded: https://repo1.maven.org/maven2/org/apache/hadoop/hadoop-mapreduce-client-hs/2.6.5/hadoop-mapreduce-client-hs-2.6.5.jar (254 KB at 837.1 KB/sec)
560/1486 KB   516/1773 KB   
560/1486 KB   520/1773 KB   
560/1486 KB   524/1773 KB   
564/1486 KB   524/1773 KB   
564/1486 KB   528/1773 KB   
568/1486 KB   528/1773 KB   
572/1486 KB   528/1773 KB   
576/1486 KB   528/1773 KB   
576/1486 KB   532/1773 KB   
576/1486 KB   536/1773 KB   
576/1486 KB   540/1773 KB   
580/1486 KB   540/1773 KB   
580/1486 KB   544/1773 KB   
584/1486 KB   544/1773 KB   
588/1486 KB   544/1773 KB   
592/1486 KB   544/1773 KB   
592/1486 KB   548/1773 KB   
592/1486 KB   552/1773 KB   
592/1486 KB   556/1773 KB   
596/1486 KB   556/1773 KB   
596/1486 KB   560/1773 KB   
600/1486 KB   560/1773 KB   
604/1486 KB   560/1773 KB   
608/1486 KB   560/1773 KB   
608/1486 KB   564/1773 KB   
608/1486 KB   568/1773 KB   
608/1486 KB   572/1773 KB   
612/1486 KB   572/1773 KB   
612/1486 KB   576/1773 KB   
616/1486 KB   576/1773 KB   
620/1486 KB   576/1773 KB   
624/1486 KB   576/1773 KB   
624/1486 KB   580/1773 KB   
624/1486 KB   584/1773 KB   
624/1486 KB   588/1773 KB   
628/1486 KB   592/1773 KB   
628/1486 KB   592/1773 KB   
632/1486 KB   592/1773 KB   
636/1486 KB   592/1773 KB   
640/1486 KB   592/1773 KB   
640/1486 KB   596/1773 KB   
640/1486 KB   600/1773 KB   
640/1486 KB   604/1773 KB   
640/1486 KB   608/1773 KB   
644/1486 KB   608/1773 KB   
648/1486 KB   608/1773 KB   
652/1486 KB   608/1773 KB   
656/1486 KB   608/1773 KB   
656/1486 KB   612/1773 KB   
656/1486 KB   616/1773 KB   
656/1486 KB   620/1773 KB   
660/1486 KB   620/1773 KB   
660/1486 KB   624/1773 KB   
664/1486 KB   624/1773 KB   
668/1486 KB   624/1773 KB   
672/1486 KB   624/1773 KB   
672/1486 KB   628/1773 KB   
672/1486 KB   632/1773 KB   
672/1486 KB   636/1773 KB   
676/1486 KB   636/1773 KB   
676/1486 KB   640/1773 KB   
680/1486 KB   640/1773 KB   
684/1486 KB   640/1773 KB   
688/1486 KB   640/1773 KB   
688/1486 KB   644/1773 KB   
688/1486 KB   648/1773 KB   
692/1486 KB   648/1773 KB   
692/1486 KB   652/1773 KB   
696/1486 KB   652/1773 KB   
696/1486 KB   656/1773 KB   
700/1486 KB   656/1773 KB   
704/1486 KB   656/1773 KB   
704/1486 KB   660/1773 KB   
708/1486 KB   660/1773 KB   
708/1486 KB   664/1773 KB   
712/1486 KB   664/1773 KB   
712/1486 KB   668/1773 KB   
716/1486 KB   668/1773 KB   
716/1486 KB   672/1773 KB   
720/1486 KB   672/1773 KB   
720/1486 KB   676/1773 KB   
724/1486 KB   676/1773 KB   
724/1486 KB   680/1773 KB   
728/1486 KB   680/1773 KB   
728/1486 KB   684/1773 KB   
732/1486 KB   684/1773 KB   
732/1486 KB   688/1773 KB   
736/1486 KB   688/1773 KB   
740/1486 KB   688/1773 KB   
740/1486 KB   692/1773 KB   
744/1486 KB   692/1773 KB   
744/1486 KB   696/1773 KB   
748/1486 KB   696/1773 KB   
748/1486 KB   700/1773 KB   
752/1486 KB   700/1773 KB   
752/1486 KB   704/1773 KB   
756/1486 KB   704/1773 KB   
756/1486 KB   708/1773 KB   
760/1486 KB   708/1773 KB   
760/1486 KB   712/1773 KB   
764/1486 KB   712/1773 KB   
764/1486 KB   716/1773 KB   
768/1486 KB   716/1773 KB   
768/1486 KB   720/1773 KB   
772/1486 KB   720/1773 KB   
772/1486 KB   724/1773 KB   
776/1486 KB   724/1773 KB   
780/1486 KB   724/1773 KB   
780/1486 KB   728/1773 KB   
784/1486 KB   728/1773 KB   
784/1486 KB   732/1773 KB   
784/1486 KB   736/1773 KB   
788/1486 KB   736/1773 KB   
792/1486 KB   736/1773 KB   
792/1486 KB   740/1773 KB   
796/1486 KB   740/1773 KB   
796/1486 KB   744/1773 KB   
800/1486 KB   744/1773 KB   
800/1486 KB   748/1773 KB   
800/1486 KB   752/1773 KB   
804/1486 KB   752/1773 KB   
804/1486 KB   756/1773 KB   
808/1486 KB   756/1773 KB   
812/1486 KB   756/1773 KB   
812/1486 KB   760/1773 KB   
816/1486 KB   760/1773 KB   
816/1486 KB   764/1773 KB   
816/1486 KB   768/1773 KB   
820/1486 KB   768/1773 KB   
824/1486 KB   768/1773 KB   
828/1486 KB   768/1773 KB   
828/1486 KB   772/1773 KB   
832/1486 KB   772/1773 KB   
832/1486 KB   776/1773 KB   
832/1486 KB   780/1773 KB   
832/1486 KB   784/1773 KB   
836/1486 KB   784/1773 KB   
840/1486 KB   784/1773 KB   
844/1486 KB   784/1773 KB   
848/1486 KB   784/1773 KB   
848/1486 KB   788/1773 KB   
848/1486 KB   792/1773 KB   
848/1486 KB   796/1773 KB   
848/1486 KB   800/1773 KB   
852/1486 KB   800/1773 KB   
856/1486 KB   800/1773 KB   
860/1486 KB   800/1773 KB   
864/1486 KB   800/1773 KB   
864/1486 KB   804/1773 KB   
864/1486 KB   808/1773 KB   
864/1486 KB   812/1773 KB   
864/1486 KB   816/1773 KB   
868/1486 KB   816/1773 KB   
872/1486 KB   816/1773 KB   
876/1486 KB   816/1773 KB   
880/1486 KB   816/1773 KB   
880/1486 KB   820/1773 KB   
880/1486 KB   824/1773 KB   
880/1486 KB   828/1773 KB   
880/1486 KB   832/1773 KB   
884/1486 KB   832/1773 KB   
888/1486 KB   832/1773 KB   
892/1486 KB   832/1773 KB   
896/1486 KB   832/1773 KB   
896/1486 KB   836/1773 KB   
896/1486 KB   840/1773 KB   
896/1486 KB   844/1773 KB   
896/1486 KB   848/1773 KB   
900/1486 KB   848/1773 KB   
904/1486 KB   848/1773 KB   
908/1486 KB   848/1773 KB   
912/1486 KB   848/1773 KB   
912/1486 KB   852/1773 KB   
912/1486 KB   856/1773 KB   
912/1486 KB   860/1773 KB   
912/1486 KB   864/1773 KB   
916/1486 KB   864/1773 KB   
920/1486 KB   864/1773 KB   
924/1486 KB   864/1773 KB   
928/1486 KB   864/1773 KB   
928/1486 KB   868/1773 KB   
928/1486 KB   872/1773 KB   
928/1486 KB   876/1773 KB   
928/1486 KB   880/1773 KB   
932/1486 KB   880/1773 KB   
936/1486 KB   880/1773 KB   
940/1486 KB   880/1773 KB   
944/1486 KB   880/1773 KB   
944/1486 KB   884/1773 KB   
944/1486 KB   888/1773 KB   
944/1486 KB   892/1773 KB   
944/1486 KB   896/1773 KB   
948/1486 KB   896/1773 KB   
952/1486 KB   896/1773 KB   
956/1486 KB   896/1773 KB   
960/1486 KB   896/1773 KB   
960/1486 KB   900/1773 KB   
960/1486 KB   904/1773 KB   
960/1486 KB   908/1773 KB   
960/1486 KB   912/1773 KB   
964/1486 KB   912/1773 KB   
968/1486 KB   912/1773 KB   
972/1486 KB   912/1773 KB   
976/1486 KB   912/1773 KB   
976/1486 KB   916/1773 KB   
976/1486 KB   920/1773 KB   
976/1486 KB   924/1773 KB   
976/1486 KB   928/1773 KB   
980/1486 KB   928/1773 KB   
984/1486 KB   928/1773 KB   
988/1486 KB   928/1773 KB   
992/1486 KB   928/1773 KB   
992/1486 KB   932/1773 KB   
992/1486 KB   936/1773 KB   
992/1486 KB   940/1773 KB   
992/1486 KB   944/1773 KB   
996/1486 KB   944/1773 KB   
1000/1486 KB   944/1773 KB   
1004/1486 KB   944/1773 KB   
1008/1486 KB   944/1773 KB   
1008/1486 KB   948/1773 KB   
1008/1486 KB   952/1773 KB   
1008/1486 KB   956/1773 KB   
1012/1486 KB   956/1773 KB   
1016/1486 KB   956/1773 KB   
1016/1486 KB   960/1773 KB   
1020/1486 KB   960/1773 KB   
1024/1486 KB   960/1773 KB   
1028/1486 KB   960/1773 KB   
1028/1486 KB   964/1773 KB   
1032/1486 KB   964/1773 KB   
1032/1486 KB   968/1773 KB   
1036/1486 KB   968/1773 KB   
1036/1486 KB   972/1773 KB   
1040/1486 KB   972/1773 KB   
1040/1486 KB   976/1773 KB   
1044/1486 KB   976/1773 KB   
1048/1486 KB   976/1773 KB   
1052/1486 KB   976/1773 KB   
1056/1486 KB   976/1773 KB   
1056/1486 KB   980/1773 KB   
1056/1486 KB   984/1773 KB   
1056/1486 KB   988/1773 KB   
1056/1486 KB   992/1773 KB   
1060/1486 KB   992/1773 KB   
1064/1486 KB   992/1773 KB   
1068/1486 KB   992/1773 KB   
1072/1486 KB   992/1773 KB   
1072/1486 KB   996/1773 KB   
1072/1486 KB   1000/1773 KB   
1072/1486 KB   1004/1773 KB   
1076/1486 KB   1004/1773 KB   
1076/1486 KB   1008/1773 KB   
1080/1486 KB   1008/1773 KB   
1084/1486 KB   1008/1773 KB   
1088/1486 KB   1008/1773 KB   
1092/1486 KB   1008/1773 KB   
1096/1486 KB   1008/1773 KB   
1096/1486 KB   1012/1773 KB   
1100/1486 KB   1012/1773 KB   
1104/1486 KB   1012/1773 KB   
1104/1486 KB   1016/1773 KB   
1104/1486 KB   1020/1773 KB   
1104/1486 KB   1024/1773 KB   
1108/1486 KB   1024/1773 KB   
1112/1486 KB   1024/1773 KB   
1116/1486 KB   1024/1773 KB   
1120/1486 KB   1024/1773 KB   
1120/1486 KB   1028/1773 KB   
1120/1486 KB   1032/1773 KB   
1120/1486 KB   1036/1773 KB   
1120/1486 KB   1040/1773 KB   
1124/1486 KB   1040/1773 KB   
1128/1486 KB   1040/1773 KB   
1132/1486 KB   1040/1773 KB   
1136/1486 KB   1040/1773 KB   
1136/1486 KB   1044/1773 KB   
1140/1486 KB   1044/1773 KB   
1142/1486 KB   1044/1773 KB   
1142/1486 KB   1048/1773 KB   
1142/1486 KB   1052/1773 KB   
1142/1486 KB   1056/1773 KB   
1146/1486 KB   1056/1773 KB   
1150/1486 KB   1056/1773 KB   
1154/1486 KB   1056/1773 KB   
1158/1486 KB   1056/1773 KB   
1158/1486 KB   1060/1773 KB   
1158/1486 KB   1064/1773 KB   
1158/1486 KB   1068/1773 KB   
1158/1486 KB   1072/1773 KB   
1162/1486 KB   1072/1773 KB   
1166/1486 KB   1072/1773 KB   
1170/1486 KB   1072/1773 KB   
1174/1486 KB   1072/1773 KB   
1174/1486 KB   1076/1773 KB   
1174/1486 KB   1080/1773 KB   
1174/1486 KB   1084/1773 KB   
1178/1486 KB   1084/1773 KB   
1178/1486 KB   1088/1773 KB   
1182/1486 KB   1088/1773 KB   
1186/1486 KB   1088/1773 KB   
1190/1486 KB   1088/1773 KB   
1194/1486 KB   1088/1773 KB   
1198/1486 KB   1088/1773 KB   
1198/1486 KB   1092/1773 KB   
1202/1486 KB   1092/1773 KB   
1206/1486 KB   1092/1773 KB   
1206/1486 KB   1096/1773 KB   
1206/1486 KB   1100/1773 KB   
1206/1486 KB   1104/1773 KB   
1210/1486 KB   1104/1773 KB   
1214/1486 KB   1104/1773 KB   
1218/1486 KB   1104/1773 KB   
1222/1486 KB   1104/1773 KB   
1222/1486 KB   1108/1773 KB   
1222/1486 KB   1112/1773 KB   
1222/1486 KB   1116/1773 KB   
1222/1486 KB   1120/1773 KB   
1226/1486 KB   1120/1773 KB   
1230/1486 KB   1120/1773 KB   
1234/1486 KB   1120/1773 KB   
1238/1486 KB   1120/1773 KB   
1238/1486 KB   1124/1773 KB   
1242/1486 KB   1124/1773 KB   
1242/1486 KB   1128/1773 KB   
1246/1486 KB   1128/1773 KB   
1246/1486 KB   1132/1773 KB   
1250/1486 KB   1132/1773 KB   
1254/1486 KB   1136/1773 KB   
1254/1486 KB   1136/1773 KB   
1258/1486 KB   1136/1773 KB   
1262/1486 KB   1136/1773 KB   
1262/1486 KB   1140/1773 KB   
1266/1486 KB   1140/1773 KB   
1266/1486 KB   1144/1773 KB   
1270/1486 KB   1144/1773 KB   
1270/1486 KB   1148/1773 KB   
1270/1486 KB   1152/1773 KB   
1274/1486 KB   1152/1773 KB   
1278/1486 KB   1152/1773 KB   
1282/1486 KB   1152/1773 KB   
1286/1486 KB   1152/1773 KB   
1286/1486 KB   1156/1773 KB   
1286/1486 KB   1160/1773 KB   
1286/1486 KB   1164/1773 KB   
1286/1486 KB   1168/1773 KB   
1290/1486 KB   1168/1773 KB   
1294/1486 KB   1168/1773 KB   
1298/1486 KB   1168/1773 KB   
1302/1486 KB   1168/1773 KB   
1302/1486 KB   1172/1773 KB   
1302/1486 KB   1176/1773 KB   
1302/1486 KB   1180/1773 KB   
1302/1486 KB   1184/1773 KB   
1306/1486 KB   1184/1773 KB   
1310/1486 KB   1184/1773 KB   
1314/1486 KB   1184/1773 KB   
1318/1486 KB   1184/1773 KB   
1318/1486 KB   1188/1773 KB   
1318/1486 KB   1192/1773 KB   
1318/1486 KB   1196/1773 KB   
1318/1486 KB   1200/1773 KB   
1322/1486 KB   1200/1773 KB   
1326/1486 KB   1200/1773 KB   
1330/1486 KB   1200/1773 KB   
1334/1486 KB   1200/1773 KB   
1334/1486 KB   1204/1773 KB   
1334/1486 KB   1208/1773 KB   
1334/1486 KB   1212/1773 KB   
1338/1486 KB   1212/1773 KB   
1342/1486 KB   1212/1773 KB   
1342/1486 KB   1216/1773 KB   
1346/1486 KB   1216/1773 KB   
1350/1486 KB   1216/1773 KB   
1350/1486 KB   1220/1773 KB   
1354/1486 KB   1220/1773 KB   
1354/1486 KB   1224/1773 KB   
1358/1486 KB   1224/1773 KB   
1358/1486 KB   1228/1773 KB   
1362/1486 KB   1228/1773 KB   
1366/1486 KB   1232/1773 KB   
1366/1486 KB   1232/1773 KB   
1370/1486 KB   1232/1773 KB   
1374/1486 KB   1232/1773 KB   
1374/1486 KB   1236/1773 KB   
1378/1486 KB   1236/1773 KB   
1382/1486 KB   1236/1773 KB   
1382/1486 KB   1240/1773 KB   
1382/1486 KB   1244/1773 KB   
1382/1486 KB   1248/1773 KB   
1386/1486 KB   1248/1773 KB   
1390/1486 KB   1248/1773 KB   
1394/1486 KB   1248/1773 KB   
1398/1486 KB   1248/1773 KB   
1398/1486 KB   1252/1773 KB   
1398/1486 KB   1256/1773 KB   
1398/1486 KB   1260/1773 KB   
1398/1486 KB   1264/1773 KB   
1402/1486 KB   1264/1773 KB   
1406/1486 KB   1264/1773 KB   
1410/1486 KB   1264/1773 KB   
1414/1486 KB   1264/1773 KB   
1414/1486 KB   1268/1773 KB   
1414/1486 KB   1272/1773 KB   
1414/1486 KB   1276/1773 KB   
1414/1486 KB   1280/1773 KB   
1418/1486 KB   1280/1773 KB   
1422/1486 KB   1280/1773 KB   
1426/1486 KB   1280/1773 KB   
1430/1486 KB   1280/1773 KB   
1430/1486 KB   1284/1773 KB   
1430/1486 KB   1288/1773 KB   
1430/1486 KB   1292/1773 KB   
1430/1486 KB   1296/1773 KB   
1434/1486 KB   1296/1773 KB   
1438/1486 KB   1296/1773 KB   
1442/1486 KB   1296/1773 KB   
1446/1486 KB   1296/1773 KB   
1446/1486 KB   1300/1773 KB   
1446/1486 KB   1304/1773 KB   
1446/1486 KB   1308/1773 KB   
1446/1486 KB   1312/1773 KB   
1450/1486 KB   1312/1773 KB   
1454/1486 KB   1312/1773 KB   
1458/1486 KB   1312/1773 KB   
1462/1486 KB   1312/1773 KB   
1462/1486 KB   1316/1773 KB   
1462/1486 KB   1320/1773 KB   
1462/1486 KB   1324/1773 KB   
1462/1486 KB   1328/1773 KB   
1466/1486 KB   1328/1773 KB   
1470/1486 KB   1328/1773 KB   
1474/1486 KB   1328/1773 KB   
1478/1486 KB   1328/1773 KB   
1482/1486 KB   1328/1773 KB   
1482/1486 KB   1332/1773 KB   
1486/1486 KB   1332/1773 KB   
1486/1486 KB   1336/1773 KB   
1486/1486 KB   1340/1773 KB   
1486/1486 KB   1344/1773 KB   
1486/1486 KB   1348/1773 KB   
1486/1486 KB   1352/1773 KB   
1486/1486 KB   1356/1773 KB   
1486/1486 KB   1360/1773 KB   
1486/1486 KB   1364/1773 KB   
1486/1486 KB   1368/1773 KB   
1486/1486 KB   1372/1773 KB   
1486/1486 KB   1376/1773 KB   
1486/1486 KB   1380/1773 KB   
1486/1486 KB   1384/1773 KB   
1486/1486 KB   1388/1773 KB   
1486/1486 KB   1392/1773 KB   
1486/1486 KB   1396/1773 KB   
1486/1486 KB   1400/1773 KB   
1486/1486 KB   1404/1773 KB   
1486/1486 KB   1408/1773 KB   
1486/1486 KB   1412/1773 KB   
1486/1486 KB   1416/1773 KB   
1486/1486 KB   1420/1773 KB   
1486/1486 KB   1424/1773 KB   
1486/1486 KB   1428/1773 KB   
1486/1486 KB   1432/1773 KB   
1486/1486 KB   1436/1773 KB   
1486/1486 KB   1440/1773 KB   
1486/1486 KB   1444/1773 KB   
1486/1486 KB   1448/1773 KB   
1486/1486 KB   1452/1773 KB   
1486/1486 KB   1456/1773 KB   
1486/1486 KB   1460/1773 KB   
1486/1486 KB   1464/1773 KB   
1486/1486 KB   1468/1773 KB   
1486/1486 KB   1472/1773 KB   
1486/1486 KB   1476/1773 KB   
1486/1486 KB   1480/1773 KB   
1486/1486 KB   1484/1773 KB   
1486/1486 KB   1488/1773 KB   
1486/1486 KB   1492/1773 KB   
1486/1486 KB   1496/1773 KB   
1486/1486 KB   1500/1773 KB   
1486/1486 KB   1504/1773 KB   
1486/1486 KB   1508/1773 KB   
1486/1486 KB   1512/1773 KB   
1486/1486 KB   1516/1773 KB   
1486/1486 KB   1520/1773 KB   
1486/1486 KB   1524/1773 KB   
1486/1486 KB   1528/1773 KB   
1486/1486 KB   1532/1773 KB   
1486/1486 KB   1536/1773 KB   
                              
Downloaded: https://repo1.maven.org/maven2/org/apache/hadoop/hadoop-mapreduce-client-jobclient/2.6.5/hadoop-mapreduce-client-jobclient-2.6.5-tests.jar (1486 KB at 4047.2 KB/sec)
1540/1773 KB                  
1544/1773 KB   
1548/1773 KB   
1552/1773 KB   
1556/1773 KB   
1560/1773 KB   
1564/1773 KB   
1568/1773 KB   
1572/1773 KB   
1576/1773 KB   
1580/1773 KB   
1584/1773 KB   
1588/1773 KB   
1592/1773 KB   
1596/1773 KB   
1600/1773 KB   
1604/1773 KB   
1608/1773 KB   
1612/1773 KB   
1616/1773 KB   
1620/1773 KB   
1624/1773 KB   
1628/1773 KB   
1632/1773 KB   
1636/1773 KB   
1640/1773 KB   
1644/1773 KB   
1648/1773 KB   
1652/1773 KB   
1656/1773 KB   
1660/1773 KB   
1664/1773 KB   
1668/1773 KB   
1672/1773 KB   
1676/1773 KB   
1680/1773 KB   
1684/1773 KB   
1688/1773 KB   
1692/1773 KB   
1696/1773 KB   
1700/1773 KB   
1704/1773 KB   
1708/1773 KB   
1712/1773 KB   
1716/1773 KB   
1720/1773 KB   
1724/1773 KB   
1728/1773 KB   
1732/1773 KB   
1736/1773 KB   
1740/1773 KB   
1744/1773 KB   
1748/1773 KB   
1752/1773 KB   
1756/1773 KB   
1760/1773 KB   
1764/1773 KB   
1768/1773 KB   
1772/1773 KB   
1773/1773 KB   
               
Downloaded: https://repo1.maven.org/maven2/org/apache/hadoop/hadoop-common/2.6.5/hadoop-common-2.6.5-tests.jar (1773 KB at 4569.6 KB/sec)
4/1162 KB      
8/1162 KB   
12/1162 KB   
16/1162 KB   
20/1162 KB   
24/1162 KB   
28/1162 KB   
32/1162 KB   
36/1162 KB   
40/1162 KB   
44/1162 KB   
48/1162 KB   
52/1162 KB   
56/1162 KB   
60/1162 KB   
64/1162 KB   
68/1162 KB   
72/1162 KB   
76/1162 KB   
80/1162 KB   
84/1162 KB   
88/1162 KB   
92/1162 KB   
96/1162 KB   
100/1162 KB   
104/1162 KB   
108/1162 KB   
112/1162 KB   
116/1162 KB   
120/1162 KB   
124/1162 KB   
128/1162 KB   
132/1162 KB   
136/1162 KB   
140/1162 KB   
144/1162 KB   
148/1162 KB   
152/1162 KB   
156/1162 KB   
160/1162 KB   
164/1162 KB   
168/1162 KB   
172/1162 KB   
176/1162 KB   
180/1162 KB   
184/1162 KB   
188/1162 KB   
192/1162 KB   
196/1162 KB   
200/1162 KB   
204/1162 KB   
208/1162 KB   
212/1162 KB   
216/1162 KB   
220/1162 KB   
224/1162 KB   
228/1162 KB   
232/1162 KB   
236/1162 KB   
240/1162 KB   
244/1162 KB   
248/1162 KB   
252/1162 KB   
256/1162 KB   
260/1162 KB   
264/1162 KB   
268/1162 KB   
272/1162 KB   
276/1162 KB   
280/1162 KB   
284/1162 KB   
288/1162 KB   
292/1162 KB   
296/1162 KB   
300/1162 KB   
304/1162 KB   
308/1162 KB   
312/1162 KB   
316/1162 KB   
320/1162 KB   
324/1162 KB   
328/1162 KB   
332/1162 KB   
336/1162 KB   
340/1162 KB   
344/1162 KB   
348/1162 KB   
352/1162 KB   
356/1162 KB   
360/1162 KB   
364/1162 KB   
368/1162 KB   
372/1162 KB   
376/1162 KB   
380/1162 KB   
384/1162 KB   
388/1162 KB   
392/1162 KB   
396/1162 KB   
400/1162 KB   
404/1162 KB   
408/1162 KB   
412/1162 KB   
416/1162 KB   
420/1162 KB   
424/1162 KB   
428/1162 KB   
432/1162 KB   
436/1162 KB   
440/1162 KB   
444/1162 KB   
448/1162 KB   
452/1162 KB   
456/1162 KB   
460/1162 KB   
464/1162 KB   
468/1162 KB   
472/1162 KB   
476/1162 KB   
480/1162 KB   
484/1162 KB   
488/1162 KB   
492/1162 KB   
496/1162 KB   
500/1162 KB   
504/1162 KB   
508/1162 KB   
512/1162 KB   
516/1162 KB   
520/1162 KB   
524/1162 KB   
528/1162 KB   
532/1162 KB   
536/1162 KB   
540/1162 KB   
544/1162 KB   
548/1162 KB   
552/1162 KB   
556/1162 KB   
560/1162 KB   
564/1162 KB   
568/1162 KB   
572/1162 KB   
576/1162 KB   
580/1162 KB   
584/1162 KB   
588/1162 KB   
592/1162 KB   
596/1162 KB   
600/1162 KB   
604/1162 KB   
608/1162 KB   
612/1162 KB   
616/1162 KB   
620/1162 KB   
624/1162 KB   
628/1162 KB   
632/1162 KB   
636/1162 KB   
640/1162 KB   
644/1162 KB   
648/1162 KB   
652/1162 KB   
656/1162 KB   
660/1162 KB   
664/1162 KB   
668/1162 KB   
672/1162 KB   
676/1162 KB   
680/1162 KB   
684/1162 KB   
688/1162 KB   
692/1162 KB   
696/1162 KB   
700/1162 KB   
704/1162 KB   
708/1162 KB   
712/1162 KB   
716/1162 KB   
720/1162 KB   
724/1162 KB   
728/1162 KB   
732/1162 KB   
736/1162 KB   
740/1162 KB   
744/1162 KB   
748/1162 KB   
752/1162 KB   
756/1162 KB   
760/1162 KB   
764/1162 KB   
768/1162 KB   
772/1162 KB   
776/1162 KB   
780/1162 KB   
784/1162 KB   
788/1162 KB   
792/1162 KB   
796/1162 KB   
800/1162 KB   
804/1162 KB   
808/1162 KB   
812/1162 KB   
816/1162 KB   
820/1162 KB   
824/1162 KB   
828/1162 KB   
832/1162 KB   
836/1162 KB   
840/1162 KB   
844/1162 KB   
848/1162 KB   
852/1162 KB   
856/1162 KB   
860/1162 KB   
864/1162 KB   
868/1162 KB   
872/1162 KB   
876/1162 KB   
880/1162 KB   
884/1162 KB   
888/1162 KB   
892/1162 KB   
896/1162 KB   
900/1162 KB   
904/1162 KB   
908/1162 KB   
912/1162 KB   
916/1162 KB   
920/1162 KB   
924/1162 KB   
928/1162 KB   
932/1162 KB   
936/1162 KB   
940/1162 KB   
944/1162 KB   
948/1162 KB   
952/1162 KB   
956/1162 KB   
960/1162 KB   
964/1162 KB   
968/1162 KB   
972/1162 KB   
976/1162 KB   
980/1162 KB   
984/1162 KB   
988/1162 KB   
992/1162 KB   
996/1162 KB   
1000/1162 KB   
1004/1162 KB   
1008/1162 KB   
1012/1162 KB   
1016/1162 KB   
1020/1162 KB   
1024/1162 KB   
1028/1162 KB   
1032/1162 KB   
1036/1162 KB   
1040/1162 KB   
1044/1162 KB   
1048/1162 KB   
1052/1162 KB   
1056/1162 KB   
1060/1162 KB   
1064/1162 KB   
1068/1162 KB   
1072/1162 KB   
1076/1162 KB   
1080/1162 KB   
1084/1162 KB   
1088/1162 KB   
1092/1162 KB   
1096/1162 KB   
1100/1162 KB   
1104/1162 KB   
1108/1162 KB   
1112/1162 KB   
1116/1162 KB   
1120/1162 KB   
1124/1162 KB   
1128/1162 KB   
1132/1162 KB   
1136/1162 KB   
1140/1162 KB   
1144/1162 KB   
1148/1162 KB   
1152/1162 KB   
1156/1162 KB   
1160/1162 KB   
1162/1162 KB   
               
Downloaded: https://repo1.maven.org/maven2/org/apache/hadoop/hadoop-yarn-server-resourcemanager/2.6.5/hadoop-yarn-server-resourcemanager-2.6.5.jar (1162 KB at 2410.1 KB/sec)
[INFO] 
[INFO] --- maven-clean-plugin:2.5:clean (default-clean) @ alluxio-tests ---
[INFO] 
[INFO] --- maven-enforcer-plugin:1.0:enforce (enforce-maven) @ alluxio-tests ---
[INFO] 
[INFO] --- maven-enforcer-plugin:1.0:enforce (enforce-versions) @ alluxio-tests ---
[INFO] 
[INFO] --- maven-checkstyle-plugin:2.17:check (checkstyle) @ alluxio-tests ---
[INFO] Starting audit...
Audit done.
[INFO] 
[INFO] --- license-maven-plugin:2.9:check (default) @ alluxio-tests ---
[INFO] Checking licenses...
[INFO] 
[INFO] --- maven-resources-plugin:2.6:resources (default-resources) @ alluxio-tests ---
[INFO] Using 'UTF-8' encoding to copy filtered resources.
[INFO] skip non existing resourceDirectory /home/jenkins/workspace/alluxio-ubuntu-testing/PROFILE_OPTS/-PcontractTest/label/spark-k8s-testing/tests/src/main/resources
[INFO] 
[INFO] --- maven-compiler-plugin:3.2:compile (default-compile) @ alluxio-tests ---
[INFO] No sources to compile
[INFO] 
[INFO] >>> findbugs-maven-plugin:3.0.2:check (default) > :findbugs @ alluxio-tests >>>
[INFO] 
[INFO] --- findbugs-maven-plugin:3.0.2:findbugs (findbugs) @ alluxio-tests ---
[INFO] 
[INFO] <<< findbugs-maven-plugin:3.0.2:check (default) < :findbugs @ alluxio-tests <<<
[INFO] 
[INFO] --- findbugs-maven-plugin:3.0.2:check (default) @ alluxio-tests ---
[INFO] 
[INFO] --- maven-resources-plugin:2.6:testResources (default-testResources) @ alluxio-tests ---
[INFO] Using 'UTF-8' encoding to copy filtered resources.
[INFO] Copying 2 resources
[INFO] 
[INFO] --- maven-compiler-plugin:3.2:testCompile (default-testCompile) @ alluxio-tests ---
[INFO] Changes detected - recompiling the module!
[INFO] Compiling 133 source files to /home/jenkins/workspace/alluxio-ubuntu-testing/PROFILE_OPTS/-PcontractTest/label/spark-k8s-testing/tests/target/test-classes
[INFO] /home/jenkins/workspace/alluxio-ubuntu-testing/PROFILE_OPTS/-PcontractTest/label/spark-k8s-testing/tests/src/test/java/alluxio/client/ReadOnlyMountIntegrationTest.java: Some input files use or override a deprecated API.
[INFO] /home/jenkins/workspace/alluxio-ubuntu-testing/PROFILE_OPTS/-PcontractTest/label/spark-k8s-testing/tests/src/test/java/alluxio/client/ReadOnlyMountIntegrationTest.java: Recompile with -Xlint:deprecation for details.
[INFO] /home/jenkins/workspace/alluxio-ubuntu-testing/PROFILE_OPTS/-PcontractTest/label/spark-k8s-testing/tests/src/test/java/alluxio/master/MasterFaultToleranceIntegrationTest.java: Some input files use unchecked or unsafe operations.
[INFO] /home/jenkins/workspace/alluxio-ubuntu-testing/PROFILE_OPTS/-PcontractTest/label/spark-k8s-testing/tests/src/test/java/alluxio/master/MasterFaultToleranceIntegrationTest.java: Recompile with -Xlint:unchecked for details.
[INFO] 
[INFO] --- maven-surefire-plugin:2.19.1:test (default-test) @ alluxio-tests ---
[INFO] Surefire report directory: /home/jenkins/workspace/alluxio-ubuntu-testing/PROFILE_OPTS/-PcontractTest/label/spark-k8s-testing/tests/target/surefire-reports

-------------------------------------------------------
 T E S T S
-------------------------------------------------------
Java HotSpot(TM) 64-Bit Server VM warning: ignoring option MaxPermSize=512M; support was removed in 8.0
Java HotSpot(TM) 64-Bit Server VM warning: ignoring option MaxPermSize=512M; support was removed in 8.0
Java HotSpot(TM) 64-Bit Server VM warning: ignoring option MaxPermSize=512M; support was removed in 8.0
Java HotSpot(TM) 64-Bit Server VM warning: ignoring option MaxPermSize=512M; support was removed in 8.0
Running alluxio.cli.GetConfTest
Running alluxio.cli.fs.command.CatCommandIntegrationTest
Running alluxio.cli.fs.FileSystemShellUtilsTest
Running alluxio.cli.ConfigurationDocGeneratorTest
Tests run: 3, Failures: 0, Errors: 0, Skipped: 0, Time elapsed: 0.367 sec - in alluxio.cli.GetConfTest
Tests run: 28, Failures: 0, Errors: 0, Skipped: 0, Time elapsed: 0.434 sec - in alluxio.cli.ConfigurationDocGeneratorTest
Java HotSpot(TM) 64-Bit Server VM warning: ignoring option MaxPermSize=512M; support was removed in 8.0
Java HotSpot(TM) 64-Bit Server VM warning: ignoring option MaxPermSize=512M; support was removed in 8.0
Running alluxio.cli.fs.command.CheckConsistencyCommandIntegrationTest
Running alluxio.cli.fs.command.ChecksumCommandIntegrationTest
Tests run: 2, Failures: 0, Errors: 0, Skipped: 0, Time elapsed: 5.685 sec - in alluxio.cli.fs.command.ChecksumCommandIntegrationTest
Tests run: 2, Failures: 0, Errors: 0, Skipped: 0, Time elapsed: 6.055 sec - in alluxio.cli.fs.command.CheckConsistencyCommandIntegrationTest
Java HotSpot(TM) 64-Bit Server VM warning: ignoring option MaxPermSize=512M; support was removed in 8.0
Java HotSpot(TM) 64-Bit Server VM warning: ignoring option MaxPermSize=512M; support was removed in 8.0
Running alluxio.cli.fs.command.ChgrpCommandIntegrationTest
Running alluxio.cli.fs.command.ChmodCommandIntegrationTest
Tests run: 4, Failures: 0, Errors: 0, Skipped: 0, Time elapsed: 8.029 sec - in alluxio.cli.fs.command.CatCommandIntegrationTest
Tests run: 4, Failures: 0, Errors: 0, Skipped: 0, Time elapsed: 8.066 sec - in alluxio.cli.fs.FileSystemShellUtilsTest
Java HotSpot(TM) 64-Bit Server VM warning: ignoring option MaxPermSize=512M; support was removed in 8.0
Java HotSpot(TM) 64-Bit Server VM warning: ignoring option MaxPermSize=512M; support was removed in 8.0
Running alluxio.cli.fs.command.ChownCommandIntegrationTest
Running alluxio.cli.fs.command.CopyFromLocalCommandIntegrationTest
Tests run: 2, Failures: 0, Errors: 0, Skipped: 0, Time elapsed: 5.563 sec - in alluxio.cli.fs.command.ChgrpCommandIntegrationTest
Java HotSpot(TM) 64-Bit Server VM warning: ignoring option MaxPermSize=512M; support was removed in 8.0
Running alluxio.cli.fs.command.CopyToLocalCommandIntegrationTest
Tests run: 3, Failures: 0, Errors: 0, Skipped: 0, Time elapsed: 6.739 sec - in alluxio.cli.fs.command.ChmodCommandIntegrationTest
Java HotSpot(TM) 64-Bit Server VM warning: ignoring option MaxPermSize=512M; support was removed in 8.0
Running alluxio.cli.fs.command.CountCommandTest
Tests run: 7, Failures: 0, Errors: 0, Skipped: 0, Time elapsed: 11.369 sec - in alluxio.cli.fs.command.ChownCommandIntegrationTest
Java HotSpot(TM) 64-Bit Server VM warning: ignoring option MaxPermSize=512M; support was removed in 8.0
Tests run: 2, Failures: 0, Errors: 0, Skipped: 0, Time elapsed: 5.643 sec - in alluxio.cli.fs.command.CountCommandTest
Running alluxio.cli.fs.command.CpCommandIntegrationTest
Java HotSpot(TM) 64-Bit Server VM warning: ignoring option MaxPermSize=512M; support was removed in 8.0
Running alluxio.cli.fs.command.DuCommandIntegrationTest
Tests run: 1, Failures: 0, Errors: 0, Skipped: 0, Time elapsed: 4.286 sec - in alluxio.cli.fs.command.DuCommandIntegrationTest
Java HotSpot(TM) 64-Bit Server VM warning: ignoring option MaxPermSize=512M; support was removed in 8.0
Running alluxio.cli.fs.command.FileInfoCommandIntegrationTest
Tests run: 9, Failures: 0, Errors: 0, Skipped: 0, Time elapsed: 14.405 sec - in alluxio.cli.fs.command.CopyToLocalCommandIntegrationTest
Java HotSpot(TM) 64-Bit Server VM warning: ignoring option MaxPermSize=512M; support was removed in 8.0
Running alluxio.cli.fs.command.FreeCommandIntegrationTest
Tests run: 2, Failures: 0, Errors: 0, Skipped: 0, Time elapsed: 5.616 sec - in alluxio.cli.fs.command.FileInfoCommandIntegrationTest
Java HotSpot(TM) 64-Bit Server VM warning: ignoring option MaxPermSize=512M; support was removed in 8.0
Running alluxio.cli.fs.command.HeadCommandIntegrationTest
Tests run: 19, Failures: 0, Errors: 0, Skipped: 0, Time elapsed: 25.711 sec - in alluxio.cli.fs.command.CopyFromLocalCommandIntegrationTest
Java HotSpot(TM) 64-Bit Server VM warning: ignoring option MaxPermSize=512M; support was removed in 8.0
Running alluxio.cli.fs.command.HelpCommandIntegrationTest
Tests run: 8, Failures: 0, Errors: 0, Skipped: 0, Time elapsed: 13.186 sec - in alluxio.cli.fs.command.FreeCommandIntegrationTest
Java HotSpot(TM) 64-Bit Server VM warning: ignoring option MaxPermSize=512M; support was removed in 8.0
Running alluxio.cli.fs.command.LeaderCommandIntegrationTest
Tests run: 4, Failures: 0, Errors: 0, Skipped: 0, Time elapsed: 7.743 sec - in alluxio.cli.fs.command.HelpCommandIntegrationTest
Java HotSpot(TM) 64-Bit Server VM warning: ignoring option MaxPermSize=512M; support was removed in 8.0
Running alluxio.cli.fs.command.LoadCommandIntegrationTest
Tests run: 7, Failures: 0, Errors: 0, Skipped: 0, Time elapsed: 11.633 sec - in alluxio.cli.fs.command.HeadCommandIntegrationTest
Java HotSpot(TM) 64-Bit Server VM warning: ignoring option MaxPermSize=512M; support was removed in 8.0
Running alluxio.cli.fs.command.LocationCommandIntegrationTest
Tests run: 1, Failures: 0, Errors: 0, Skipped: 0, Time elapsed: 4.136 sec - in alluxio.cli.fs.command.LeaderCommandIntegrationTest
Java HotSpot(TM) 64-Bit Server VM warning: ignoring option MaxPermSize=512M; support was removed in 8.0
Running alluxio.cli.fs.command.LsCommandIntegrationTest
Tests run: 1, Failures: 0, Errors: 0, Skipped: 0, Time elapsed: 4.233 sec - in alluxio.cli.fs.command.LocationCommandIntegrationTest
Tests run: 2, Failures: 0, Errors: 0, Skipped: 0, Time elapsed: 5.857 sec - in alluxio.cli.fs.command.LoadCommandIntegrationTest
Java HotSpot(TM) 64-Bit Server VM warning: ignoring option MaxPermSize=512M; support was removed in 8.0
Java HotSpot(TM) 64-Bit Server VM warning: ignoring option MaxPermSize=512M; support was removed in 8.0
Running alluxio.cli.fs.command.MkdirCommandIntegrationTest
Running alluxio.cli.fs.command.MountCommandTest
Tests run: 30, Failures: 0, Errors: 0, Skipped: 0, Time elapsed: 37.656 sec - in alluxio.cli.fs.command.CpCommandIntegrationTest
Java HotSpot(TM) 64-Bit Server VM warning: ignoring option MaxPermSize=512M; support was removed in 8.0
Running alluxio.cli.fs.command.MvCommandIntegrationTest
Tests run: 6, Failures: 0, Errors: 0, Skipped: 0, Time elapsed: 10.251 sec - in alluxio.cli.fs.command.MkdirCommandIntegrationTest
Java HotSpot(TM) 64-Bit Server VM warning: ignoring option MaxPermSize=512M; support was removed in 8.0
Running alluxio.cli.fs.command.PersistCommandTest
Tests run: 11, Failures: 0, Errors: 0, Skipped: 0, Time elapsed: 16.399 sec - in alluxio.cli.fs.command.LsCommandIntegrationTest
Java HotSpot(TM) 64-Bit Server VM warning: ignoring option MaxPermSize=512M; support was removed in 8.0
Running alluxio.cli.fs.command.PinCommandIntegrationTest
Tests run: 10, Failures: 0, Errors: 0, Skipped: 0, Time elapsed: 18.091 sec - in alluxio.cli.fs.command.MountCommandTest
Java HotSpot(TM) 64-Bit Server VM warning: ignoring option MaxPermSize=512M; support was removed in 8.0
Tests run: 3, Failures: 0, Errors: 0, Skipped: 0, Time elapsed: 9.734 sec - in alluxio.cli.fs.command.MvCommandIntegrationTest
Running alluxio.cli.fs.command.RmCommandIntegrationTest
Java HotSpot(TM) 64-Bit Server VM warning: ignoring option MaxPermSize=512M; support was removed in 8.0
Running alluxio.cli.fs.command.RmrCommandIntegrationTest
Tests run: 2, Failures: 0, Errors: 0, Skipped: 0, Time elapsed: 9.244 sec - in alluxio.cli.fs.command.PinCommandIntegrationTest
Java HotSpot(TM) 64-Bit Server VM warning: ignoring option MaxPermSize=512M; support was removed in 8.0
Running alluxio.cli.fs.command.SetTtlCommandIntegrationTest
Tests run: 2, Failures: 0, Errors: 0, Skipped: 0, Time elapsed: 9.26 sec - in alluxio.cli.fs.command.RmrCommandIntegrationTest
Java HotSpot(TM) 64-Bit Server VM warning: ignoring option MaxPermSize=512M; support was removed in 8.0
Running alluxio.cli.fs.command.StatCommandIntegrationTest
Tests run: 4, Failures: 0, Errors: 0, Skipped: 0, Time elapsed: 11.62 sec - in alluxio.cli.fs.command.RmCommandIntegrationTest
Java HotSpot(TM) 64-Bit Server VM warning: ignoring option MaxPermSize=512M; support was removed in 8.0
Running alluxio.cli.fs.command.TailCommandIntegrationTest
Tests run: 7, Failures: 0, Errors: 0, Skipped: 0, Time elapsed: 14.809 sec - in alluxio.cli.fs.command.SetTtlCommandIntegrationTest
Java HotSpot(TM) 64-Bit Server VM warning: ignoring option MaxPermSize=512M; support was removed in 8.0
Running alluxio.cli.fs.command.TestCommandIntegrationTest
Tests run: 5, Failures: 0, Errors: 0, Skipped: 0, Time elapsed: 12.868 sec - in alluxio.cli.fs.command.StatCommandIntegrationTest
Java HotSpot(TM) 64-Bit Server VM warning: ignoring option MaxPermSize=512M; support was removed in 8.0
Running alluxio.cli.fs.command.TouchCommandIntegrationTest
Tests run: 7, Failures: 0, Errors: 0, Skipped: 0, Time elapsed: 15.342 sec - in alluxio.cli.fs.command.TailCommandIntegrationTest
Java HotSpot(TM) 64-Bit Server VM warning: ignoring option MaxPermSize=512M; support was removed in 8.0
Running alluxio.cli.fs.command.UnsetTtlTest
Tests run: 7, Failures: 0, Errors: 0, Skipped: 0, Time elapsed: 41.163 sec - in alluxio.cli.fs.command.PersistCommandTest
Tests run: 2, Failures: 0, Errors: 0, Skipped: 0, Time elapsed: 9.051 sec - in alluxio.cli.fs.command.TouchCommandIntegrationTest
Java HotSpot(TM) 64-Bit Server VM warning: ignoring option MaxPermSize=512M; support was removed in 8.0
Java HotSpot(TM) 64-Bit Server VM warning: ignoring option MaxPermSize=512M; support was removed in 8.0
Running alluxio.client.BufferedBlockInStreamIntegrationTest
Running alluxio.client.FileInStreamIntegrationTest
Tests run: 1, Failures: 0, Errors: 0, Skipped: 0, Time elapsed: 7.722 sec - in alluxio.cli.fs.command.UnsetTtlTest
Java HotSpot(TM) 64-Bit Server VM warning: ignoring option MaxPermSize=512M; support was removed in 8.0
Running alluxio.client.FileOutStreamAsyncWriteIntegrationTest
Tests run: 4, Failures: 0, Errors: 0, Skipped: 0, Time elapsed: 8.458 sec - in alluxio.client.BufferedBlockInStreamIntegrationTest
Java HotSpot(TM) 64-Bit Server VM warning: ignoring option MaxPermSize=512M; support was removed in 8.0
Running alluxio.client.FileOutStreamIntegrationTest
Tests run: 17, Failures: 0, Errors: 0, Skipped: 0, Time elapsed: 26.039 sec - in alluxio.cli.fs.command.TestCommandIntegrationTest
Java HotSpot(TM) 64-Bit Server VM warning: ignoring option MaxPermSize=512M; support was removed in 8.0
Running alluxio.client.FileSystemIntegrationTest
Tests run: 2, Failures: 0, Errors: 0, Skipped: 0, Time elapsed: 12.136 sec - in alluxio.client.FileOutStreamAsyncWriteIntegrationTest
Java HotSpot(TM) 64-Bit Server VM warning: ignoring option MaxPermSize=512M; support was removed in 8.0
Running alluxio.client.FileSystemUtilsIntegrationTest
Tests run: 12, Failures: 0, Errors: 0, Skipped: 0, Time elapsed: 26.372 sec - in alluxio.client.FileInStreamIntegrationTest
Java HotSpot(TM) 64-Bit Server VM warning: ignoring option MaxPermSize=512M; support was removed in 8.0
Running alluxio.client.FreeAndDeleteIntegrationTest
Tests run: 2, Failures: 0, Errors: 0, Skipped: 0, Time elapsed: 12.208 sec - in alluxio.client.FileSystemUtilsIntegrationTest
Java HotSpot(TM) 64-Bit Server VM warning: ignoring option MaxPermSize=512M; support was removed in 8.0
Running alluxio.client.IsolatedFileSystemIntegrationTest
Tests run: 1, Failures: 0, Errors: 0, Skipped: 0, Time elapsed: 7.624 sec - in alluxio.client.FreeAndDeleteIntegrationTest
Java HotSpot(TM) 64-Bit Server VM warning: ignoring option MaxPermSize=512M; support was removed in 8.0
Running alluxio.client.LocalBlockInStreamIntegrationTest
Tests run: 7, Failures: 0, Errors: 0, Skipped: 0, Time elapsed: 8.015 sec - in alluxio.client.LocalBlockInStreamIntegrationTest
Java HotSpot(TM) 64-Bit Server VM warning: ignoring option MaxPermSize=512M; support was removed in 8.0
Running alluxio.client.MetaMasterIntegrationTest
Tests run: 6, Failures: 0, Errors: 0, Skipped: 0, Time elapsed: 23.675 sec - in alluxio.client.IsolatedFileSystemIntegrationTest
Java HotSpot(TM) 64-Bit Server VM warning: ignoring option MaxPermSize=512M; support was removed in 8.0
Tests run: 2, Failures: 0, Errors: 0, Skipped: 0, Time elapsed: 8.382 sec - in alluxio.client.MetaMasterIntegrationTest
Running alluxio.client.MultiUfsMountIntegrationTest
Java HotSpot(TM) 64-Bit Server VM warning: ignoring option MaxPermSize=512M; support was removed in 8.0
Running alluxio.client.NettyChannelCloseIntegrationTest
Tests run: 30, Failures: 0, Errors: 0, Skipped: 0, Time elapsed: 40.763 sec - in alluxio.client.FileSystemIntegrationTest
Java HotSpot(TM) 64-Bit Server VM warning: ignoring option MaxPermSize=512M; support was removed in 8.0
Running alluxio.client.PersistMultipleMountsIntegrationTest
Tests run: 2, Failures: 0, Errors: 0, Skipped: 0, Time elapsed: 9.983 sec - in alluxio.client.NettyChannelCloseIntegrationTest
Java HotSpot(TM) 64-Bit Server VM warning: ignoring option MaxPermSize=512M; support was removed in 8.0
Running alluxio.client.PersistPermissionIntegrationTest
Tests run: 2, Failures: 0, Errors: 0, Skipped: 0, Time elapsed: 8.842 sec - in alluxio.client.PersistMultipleMountsIntegrationTest
Java HotSpot(TM) 64-Bit Server VM warning: ignoring option MaxPermSize=512M; support was removed in 8.0
Tests run: 28, Failures: 0, Errors: 0, Skipped: 0, Time elapsed: 56.205 sec - in alluxio.client.FileOutStreamIntegrationTest
Running alluxio.client.ReadOnlyMountIntegrationTest
Java HotSpot(TM) 64-Bit Server VM warning: ignoring option MaxPermSize=512M; support was removed in 8.0
Running alluxio.client.RemoteReadIntegrationTest
Tests run: 9, Failures: 0, Errors: 0, Skipped: 0, Time elapsed: 16.98 sec - in alluxio.client.MultiUfsMountIntegrationTest
Java HotSpot(TM) 64-Bit Server VM warning: ignoring option MaxPermSize=512M; support was removed in 8.0
Running alluxio.client.UnderStorageReadIntegrationTest
Tests run: 3, Failures: 0, Errors: 0, Skipped: 0, Time elapsed: 13.035 sec - in alluxio.client.PersistPermissionIntegrationTest
Java HotSpot(TM) 64-Bit Server VM warning: ignoring option MaxPermSize=512M; support was removed in 8.0
Running alluxio.client.concurrent.FileInStreamConcurrencyIntegrationTest
Tests run: 10, Failures: 0, Errors: 0, Skipped: 0, Time elapsed: 17.248 sec - in alluxio.client.ReadOnlyMountIntegrationTest
Java HotSpot(TM) 64-Bit Server VM warning: ignoring option MaxPermSize=512M; support was removed in 8.0
Running alluxio.client.keyvalue.KeyValuePartitionIntegrationTest
Tests run: 5, Failures: 0, Errors: 0, Skipped: 0, Time elapsed: 13.295 sec - in alluxio.client.UnderStorageReadIntegrationTest
Java HotSpot(TM) 64-Bit Server VM warning: ignoring option MaxPermSize=512M; support was removed in 8.0
Running alluxio.client.keyvalue.KeyValueSystemIntegrationTest
Tests run: 1, Failures: 0, Errors: 0, Skipped: 1, Time elapsed: 0.022 sec - in alluxio.client.keyvalue.KeyValueSystemIntegrationTest
Java HotSpot(TM) 64-Bit Server VM warning: ignoring option MaxPermSize=512M; support was removed in 8.0
Tests run: 1, Failures: 0, Errors: 0, Skipped: 0, Time elapsed: 7.768 sec - in alluxio.client.concurrent.FileInStreamConcurrencyIntegrationTest
Running alluxio.collections.IndexedSetConcurrencyTest
Java HotSpot(TM) 64-Bit Server VM warning: ignoring option MaxPermSize=512M; support was removed in 8.0
Running alluxio.hadoop.FileSystemAclIntegrationTest
Tests run: 9, Failures: 0, Errors: 0, Skipped: 0, Time elapsed: 8.256 sec - in alluxio.client.keyvalue.KeyValuePartitionIntegrationTest
Java HotSpot(TM) 64-Bit Server VM warning: ignoring option MaxPermSize=512M; support was removed in 8.0
Running alluxio.hadoop.FileSystemBlockLocationIntegrationTest
Tests run: 19, Failures: 0, Errors: 0, Skipped: 8, Time elapsed: 8.92 sec - in alluxio.hadoop.FileSystemAclIntegrationTest
Java HotSpot(TM) 64-Bit Server VM warning: ignoring option MaxPermSize=512M; support was removed in 8.0
Running alluxio.hadoop.FileSystemRenameIntegrationTest
Tests run: 1, Failures: 0, Errors: 0, Skipped: 0, Time elapsed: 8.525 sec - in alluxio.hadoop.FileSystemBlockLocationIntegrationTest
Java HotSpot(TM) 64-Bit Server VM warning: ignoring option MaxPermSize=512M; support was removed in 8.0
Running alluxio.hadoop.FileSystemStatisticsTest
Tests run: 11, Failures: 0, Errors: 0, Skipped: 1, Time elapsed: 8.174 sec - in alluxio.hadoop.FileSystemRenameIntegrationTest
Java HotSpot(TM) 64-Bit Server VM warning: ignoring option MaxPermSize=512M; support was removed in 8.0
Running alluxio.hadoop.HdfsFileInputStreamIntegrationTest
Tests run: 3, Failures: 0, Errors: 0, Skipped: 0, Time elapsed: 8.565 sec - in alluxio.hadoop.FileSystemStatisticsTest
Java HotSpot(TM) 64-Bit Server VM warning: ignoring option MaxPermSize=512M; support was removed in 8.0
Running alluxio.hadoop.contract.FileSystemContractCreateIntegrationTest
Tests run: 17, Failures: 0, Errors: 0, Skipped: 0, Time elapsed: 8.898 sec - in alluxio.hadoop.HdfsFileInputStreamIntegrationTest
Java HotSpot(TM) 64-Bit Server VM warning: ignoring option MaxPermSize=512M; support was removed in 8.0
Running alluxio.hadoop.contract.FileSystemContractDeleteIntegrationTest
Tests run: 34, Failures: 0, Errors: 0, Skipped: 0, Time elapsed: 49.283 sec - in alluxio.client.RemoteReadIntegrationTest
Java HotSpot(TM) 64-Bit Server VM warning: ignoring option MaxPermSize=512M; support was removed in 8.0
Running alluxio.hadoop.contract.FileSystemContractLoadedIntegrationTest
Tests run: 4, Failures: 0, Errors: 0, Skipped: 0, Time elapsed: 37.084 sec - in alluxio.collections.IndexedSetConcurrencyTest
Java HotSpot(TM) 64-Bit Server VM warning: ignoring option MaxPermSize=512M; support was removed in 8.0
Running alluxio.hadoop.contract.FileSystemContractMkdirIntegrationTest
Tests run: 2, Failures: 0, Errors: 0, Skipped: 0, Time elapsed: 9.2 sec - in alluxio.hadoop.contract.FileSystemContractLoadedIntegrationTest
Tests run: 6, Failures: 0, Errors: 0, Skipped: 0, Time elapsed: 14.66 sec - in alluxio.hadoop.contract.FileSystemContractCreateIntegrationTest
Java HotSpot(TM) 64-Bit Server VM warning: ignoring option MaxPermSize=512M; support was removed in 8.0
Java HotSpot(TM) 64-Bit Server VM warning: ignoring option MaxPermSize=512M; support was removed in 8.0
Running alluxio.hadoop.contract.FileSystemContractOpenIntegrationTest
Running alluxio.hadoop.contract.FileSystemContractRenameIntegrationTest
Tests run: 6, Failures: 0, Errors: 0, Skipped: 0, Time elapsed: 14.229 sec - in alluxio.hadoop.contract.FileSystemContractDeleteIntegrationTest
Java HotSpot(TM) 64-Bit Server VM warning: ignoring option MaxPermSize=512M; support was removed in 8.0
Running alluxio.hadoop.contract.FileSystemContractSeekIntegrationTest
Tests run: 4, Failures: 0, Errors: 0, Skipped: 0, Time elapsed: 12.051 sec - in alluxio.hadoop.contract.FileSystemContractMkdirIntegrationTest
Java HotSpot(TM) 64-Bit Server VM warning: ignoring option MaxPermSize=512M; support was removed in 8.0
Running alluxio.hadoop.fs.DFSIOIntegrationTest
Tests run: 5, Failures: 0, Errors: 0, Skipped: 0, Time elapsed: 13.318 sec - in alluxio.hadoop.contract.FileSystemContractRenameIntegrationTest
Tests run: 6, Failures: 0, Errors: 0, Skipped: 0, Time elapsed: 13.835 sec - in alluxio.hadoop.contract.FileSystemContractOpenIntegrationTest
Java HotSpot(TM) 64-Bit Server VM warning: ignoring option MaxPermSize=512M; support was removed in 8.0
Running alluxio.master.AlluxioMasterRestApiTest
Java HotSpot(TM) 64-Bit Server VM warning: ignoring option MaxPermSize=512M; support was removed in 8.0
Running alluxio.master.FileSystemMasterClientIntegrationTest
Tests run: 10, Failures: 0, Errors: 0, Skipped: 0, Time elapsed: 21.47 sec - in alluxio.hadoop.contract.FileSystemContractSeekIntegrationTest
Java HotSpot(TM) 64-Bit Server VM warning: ignoring option MaxPermSize=512M; support was removed in 8.0
Running alluxio.master.JournalShutdownIntegrationTest
Tests run: 5, Failures: 0, Errors: 0, Skipped: 0, Time elapsed: 16.163 sec - in alluxio.hadoop.fs.DFSIOIntegrationTest
Java HotSpot(TM) 64-Bit Server VM warning: ignoring option MaxPermSize=512M; support was removed in 8.0
Running alluxio.master.MasterFaultToleranceIntegrationTest
Tests run: 1, Failures: 0, Errors: 0, Skipped: 1, Time elapsed: 0.025 sec - in alluxio.master.MasterFaultToleranceIntegrationTest
Java HotSpot(TM) 64-Bit Server VM warning: ignoring option MaxPermSize=512M; support was removed in 8.0
Tests run: 3, Failures: 0, Errors: 0, Skipped: 0, Time elapsed: 13.852 sec - in alluxio.master.FileSystemMasterClientIntegrationTest
Running alluxio.master.PinIntegrationTest
Java HotSpot(TM) 64-Bit Server VM warning: ignoring option MaxPermSize=512M; support was removed in 8.0
Running alluxio.master.ServiceSocketBindIntegrationTest
Tests run: 13, Failures: 0, Errors: 0, Skipped: 0, Time elapsed: 19.968 sec - in alluxio.master.AlluxioMasterRestApiTest
Java HotSpot(TM) 64-Bit Server VM warning: ignoring option MaxPermSize=512M; support was removed in 8.0
Running alluxio.master.StartupConsistencyCheckIntegrationTest
Tests run: 2, Failures: 0, Errors: 0, Skipped: 0, Time elapsed: 8.176 sec - in alluxio.master.PinIntegrationTest
Java HotSpot(TM) 64-Bit Server VM warning: ignoring option MaxPermSize=512M; support was removed in 8.0
Running alluxio.master.block.BlockMasterClientRestApiTest
Tests run: 3, Failures: 0, Errors: 0, Skipped: 0, Time elapsed: 10.356 sec - in alluxio.master.ServiceSocketBindIntegrationTest
Java HotSpot(TM) 64-Bit Server VM warning: ignoring option MaxPermSize=512M; support was removed in 8.0
Running alluxio.master.block.BlockMasterJournalIntegrationTest
Tests run: 4, Failures: 0, Errors: 0, Skipped: 0, Time elapsed: 18.461 sec - in alluxio.master.JournalShutdownIntegrationTest
Tests run: 3, Failures: 0, Errors: 0, Skipped: 0, Time elapsed: 9.899 sec - in alluxio.master.StartupConsistencyCheckIntegrationTest
Java HotSpot(TM) 64-Bit Server VM warning: ignoring option MaxPermSize=512M; support was removed in 8.0
Java HotSpot(TM) 64-Bit Server VM warning: ignoring option MaxPermSize=512M; support was removed in 8.0
Running alluxio.master.block.MultiWorkerIntegrationTest
Running alluxio.master.file.CheckConsistencyIntegrationTest
Tests run: 3, Failures: 0, Errors: 0, Skipped: 0, Time elapsed: 9.494 sec - in alluxio.master.block.BlockMasterClientRestApiTest
Java HotSpot(TM) 64-Bit Server VM warning: ignoring option MaxPermSize=512M; support was removed in 8.0
Running alluxio.master.file.ConcurrentDeleteIntegrationTest
Tests run: 2, Failures: 0, Errors: 0, Skipped: 0, Time elapsed: 9.82 sec - in alluxio.master.block.BlockMasterJournalIntegrationTest
Java HotSpot(TM) 64-Bit Server VM warning: ignoring option MaxPermSize=512M; support was removed in 8.0
Running alluxio.master.file.ConcurrentFileSystemMasterCreateTest
Tests run: 1, Failures: 0, Errors: 0, Skipped: 0, Time elapsed: 8.123 sec - in alluxio.master.block.MultiWorkerIntegrationTest
Java HotSpot(TM) 64-Bit Server VM warning: ignoring option MaxPermSize=512M; support was removed in 8.0
Running alluxio.master.file.ConcurrentFileSystemMasterSetTtlTest
Tests run: 8, Failures: 0, Errors: 0, Skipped: 0, Time elapsed: 15.701 sec - in alluxio.master.file.CheckConsistencyIntegrationTest
Java HotSpot(TM) 64-Bit Server VM warning: ignoring option MaxPermSize=512M; support was removed in 8.0
Running alluxio.master.file.ConcurrentRenameIntegrationTest
Tests run: 1, Failures: 0, Errors: 0, Skipped: 0, Time elapsed: 7.881 sec - in alluxio.master.file.ConcurrentFileSystemMasterSetTtlTest
Java HotSpot(TM) 64-Bit Server VM warning: ignoring option MaxPermSize=512M; support was removed in 8.0
Running alluxio.master.file.FileSystemMasterClientRestApiTest
Tests run: 5, Failures: 0, Errors: 0, Skipped: 0, Time elapsed: 33.002 sec - in alluxio.master.file.ConcurrentDeleteIntegrationTest
Java HotSpot(TM) 64-Bit Server VM warning: ignoring option MaxPermSize=512M; support was removed in 8.0
Running alluxio.master.file.FileSystemMasterIntegrationTest
Tests run: 15, Failures: 0, Errors: 0, Skipped: 0, Time elapsed: 23.154 sec - in alluxio.master.file.FileSystemMasterClientRestApiTest
Java HotSpot(TM) 64-Bit Server VM warning: ignoring option MaxPermSize=512M; support was removed in 8.0
Running alluxio.master.file.LoadMetadataIntegrationTest
Tests run: 10, Failures: 0, Errors: 0, Skipped: 0, Time elapsed: 66.879 sec - in alluxio.master.file.ConcurrentRenameIntegrationTest
Java HotSpot(TM) 64-Bit Server VM warning: ignoring option MaxPermSize=512M; support was removed in 8.0
Running alluxio.master.journal.JournalIntegrationTest
Tests run: 39, Failures: 0, Errors: 0, Skipped: 2, Time elapsed: 54.553 sec - in alluxio.master.file.FileSystemMasterIntegrationTest
Java HotSpot(TM) 64-Bit Server VM warning: ignoring option MaxPermSize=512M; support was removed in 8.0
Tests run: 8, Failures: 0, Errors: 0, Skipped: 0, Time elapsed: 49.652 sec - in alluxio.master.file.LoadMetadataIntegrationTest
Running alluxio.master.journal.ufs.UfsJournalCheckpointThreadTest
Tests run: 3, Failures: 0, Errors: 0, Skipped: 0, Time elapsed: 7.097 sec - in alluxio.master.journal.JournalIntegrationTest
Java HotSpot(TM) 64-Bit Server VM warning: ignoring option MaxPermSize=512M; support was removed in 8.0
Java HotSpot(TM) 64-Bit Server VM warning: ignoring option MaxPermSize=512M; support was removed in 8.0
Running alluxio.master.journal.ufs.UfsJournalCheckpointWriterTest
Running alluxio.master.journal.ufs.UfsJournalFileTest
Tests run: 9, Failures: 0, Errors: 0, Skipped: 0, Time elapsed: 0.45 sec - in alluxio.master.journal.ufs.UfsJournalFileTest
Tests run: 6, Failures: 0, Errors: 0, Skipped: 0, Time elapsed: 0.751 sec - in alluxio.master.journal.ufs.UfsJournalCheckpointWriterTest
Java HotSpot(TM) 64-Bit Server VM warning: ignoring option MaxPermSize=512M; support was removed in 8.0
Java HotSpot(TM) 64-Bit Server VM warning: ignoring option MaxPermSize=512M; support was removed in 8.0
Tests run: 2, Failures: 0, Errors: 0, Skipped: 0, Time elapsed: 1.75 sec - in alluxio.master.journal.ufs.UfsJournalCheckpointThreadTest
Running alluxio.master.journal.ufs.UfsJournalIntegrationTest
Java HotSpot(TM) 64-Bit Server VM warning: ignoring option MaxPermSize=512M; support was removed in 8.0
Running alluxio.master.journal.ufs.UfsJournalLogWriterTest
Running alluxio.master.journal.ufs.UfsJournalReaderTest
Tests run: 5, Failures: 0, Errors: 0, Skipped: 0, Time elapsed: 0.777 sec - in alluxio.master.journal.ufs.UfsJournalLogWriterTest
Java HotSpot(TM) 64-Bit Server VM warning: ignoring option MaxPermSize=512M; support was removed in 8.0
Tests run: 9, Failures: 0, Errors: 0, Skipped: 0, Time elapsed: 0.975 sec - in alluxio.master.journal.ufs.UfsJournalReaderTest
Running alluxio.master.journal.ufs.UfsJournalSnapshotTest
Java HotSpot(TM) 64-Bit Server VM warning: ignoring option MaxPermSize=512M; support was removed in 8.0
Tests run: 1, Failures: 0, Errors: 0, Skipped: 0, Time elapsed: 0.45 sec - in alluxio.master.journal.ufs.UfsJournalSnapshotTest
Running alluxio.master.journal.ufs.UfsJournalTest
Java HotSpot(TM) 64-Bit Server VM warning: ignoring option MaxPermSize=512M; support was removed in 8.0
Tests run: 1, Failures: 0, Errors: 0, Skipped: 0, Time elapsed: 0.43 sec - in alluxio.master.journal.ufs.UfsJournalTest
Running alluxio.master.lineage.LineageMasterClientRestApiTest
Java HotSpot(TM) 64-Bit Server VM warning: ignoring option MaxPermSize=512M; support was removed in 8.0
Running alluxio.master.lineage.LineageMasterIntegrationTest
Tests run: 4, Failures: 0, Errors: 0, Skipped: 0, Time elapsed: 14.088 sec - in alluxio.master.lineage.LineageMasterIntegrationTest
Java HotSpot(TM) 64-Bit Server VM warning: ignoring option MaxPermSize=512M; support was removed in 8.0
Tests run: 7, Failures: 0, Errors: 0, Skipped: 0, Time elapsed: 15.303 sec - in alluxio.master.lineage.LineageMasterClientRestApiTest
Running alluxio.network.protocol.RPCMessageIntegrationTest
Java HotSpot(TM) 64-Bit Server VM warning: ignoring option MaxPermSize=512M; support was removed in 8.0
Running alluxio.proxy.FileSystemClientRestApiTest
Tests run: 7, Failures: 0, Errors: 0, Skipped: 0, Time elapsed: 4.547 sec - in alluxio.network.protocol.RPCMessageIntegrationTest
Java HotSpot(TM) 64-Bit Server VM warning: ignoring option MaxPermSize=512M; support was removed in 8.0
Running alluxio.proxy.s3.S3ClientRestApiTest
Tests run: 16, Failures: 0, Errors: 0, Skipped: 0, Time elapsed: 24.343 sec - in alluxio.master.journal.ufs.UfsJournalIntegrationTest
Java HotSpot(TM) 64-Bit Server VM warning: ignoring option MaxPermSize=512M; support was removed in 8.0
Running alluxio.rest.TestCaseOptionsTest
Tests run: 3, Failures: 0, Errors: 0, Skipped: 0, Time elapsed: 0.677 sec - in alluxio.rest.TestCaseOptionsTest
Java HotSpot(TM) 64-Bit Server VM warning: ignoring option MaxPermSize=512M; support was removed in 8.0
Running alluxio.security.ClusterInitializationIntegrationTest
Tests run: 3, Failures: 0, Errors: 0, Skipped: 0, Time elapsed: 10.039 sec - in alluxio.security.ClusterInitializationIntegrationTest
Java HotSpot(TM) 64-Bit Server VM warning: ignoring option MaxPermSize=512M; support was removed in 8.0
Running alluxio.security.MasterClientAuthenticationIntegrationTest
Tests run: 12, Failures: 0, Errors: 0, Skipped: 0, Time elapsed: 20.827 sec - in alluxio.proxy.FileSystemClientRestApiTest
Java HotSpot(TM) 64-Bit Server VM warning: ignoring option MaxPermSize=512M; support was removed in 8.0
Running alluxio.underfs.sleepfs.SleepingUnderFileSystemOptionsTest
Tests run: 2, Failures: 0, Errors: 0, Skipped: 0, Time elapsed: 0.055 sec - in alluxio.underfs.sleepfs.SleepingUnderFileSystemOptionsTest
Java HotSpot(TM) 64-Bit Server VM warning: ignoring option MaxPermSize=512M; support was removed in 8.0
Running alluxio.web.WebServerIntegrationTest
Tests run: 5, Failures: 0, Errors: 0, Skipped: 0, Time elapsed: 12.392 sec - in alluxio.security.MasterClientAuthenticationIntegrationTest
Java HotSpot(TM) 64-Bit Server VM warning: ignoring option MaxPermSize=512M; support was removed in 8.0
Running alluxio.worker.AlluxioWorkerRestApiTest
Tests run: 1, Failures: 0, Errors: 0, Skipped: 0, Time elapsed: 9.569 sec - in alluxio.web.WebServerIntegrationTest
Java HotSpot(TM) 64-Bit Server VM warning: ignoring option MaxPermSize=512M; support was removed in 8.0
Running alluxio.worker.block.meta.SpecificTierWriteIntegrationTest
Tests run: 9, Failures: 0, Errors: 0, Skipped: 0, Time elapsed: 16.07 sec - in alluxio.worker.AlluxioWorkerRestApiTest
Java HotSpot(TM) 64-Bit Server VM warning: ignoring option MaxPermSize=512M; support was removed in 8.0
Tests run: 8, Failures: 0, Errors: 0, Skipped: 0, Time elapsed: 15.67 sec - in alluxio.worker.block.meta.SpecificTierWriteIntegrationTest
Running alluxio.worker.block.meta.TierPromoteIntegrationTest
Java HotSpot(TM) 64-Bit Server VM warning: ignoring option MaxPermSize=512M; support was removed in 8.0
Running alluxio.worker.block.meta.TieredStoreIntegrationTest
Tests run: 2, Failures: 0, Errors: 0, Skipped: 0, Time elapsed: 9.203 sec - in alluxio.worker.block.meta.TierPromoteIntegrationTest
Tests run: 4, Failures: 0, Errors: 0, Skipped: 0, Time elapsed: 11.81 sec - in alluxio.worker.block.meta.TieredStoreIntegrationTest
Tests run: 37, Failures: 0, Errors: 0, Skipped: 0, Time elapsed: 60.313 sec - in alluxio.proxy.s3.S3ClientRestApiTest
Tests run: 21, Failures: 0, Errors: 0, Skipped: 0, Time elapsed: 225.469 sec - in alluxio.master.file.ConcurrentFileSystemMasterCreateTest

Results :

Tests run: 792, Failures: 0, Errors: 0, Skipped: 13

[INFO] 
[INFO] --- maven-jar-plugin:2.4:jar (default-jar) @ alluxio-tests ---
[WARNING] JAR will be empty - no content was marked for inclusion!
[INFO] Building jar: /home/jenkins/workspace/alluxio-ubuntu-testing/PROFILE_OPTS/-PcontractTest/label/spark-k8s-testing/tests/target/alluxio-tests-1.7.0-SNAPSHOT.jar
[INFO] 
[INFO] >>> maven-source-plugin:2.3:jar (attach-sources) > generate-sources @ alluxio-tests >>>
[INFO] 
[INFO] --- maven-enforcer-plugin:1.0:enforce (enforce-maven) @ alluxio-tests ---
[INFO] 
[INFO] --- maven-enforcer-plugin:1.0:enforce (enforce-versions) @ alluxio-tests ---
[INFO] 
[INFO] --- maven-checkstyle-plugin:2.17:check (checkstyle) @ alluxio-tests ---
[INFO] Starting audit...
Audit done.
[INFO] 
[INFO] --- license-maven-plugin:2.9:check (default) @ alluxio-tests ---
[INFO] Checking licenses...
[INFO] 
[INFO] <<< maven-source-plugin:2.3:jar (attach-sources) < generate-sources @ alluxio-tests <<<
[INFO] 
[INFO] --- maven-source-plugin:2.3:jar (attach-sources) @ alluxio-tests ---
[INFO] No sources in project. Archive not created.
[INFO] 
[INFO] --- maven-javadoc-plugin:2.9:jar (attach-javadoc) @ alluxio-tests ---
[INFO] 
[INFO] --- maven-install-plugin:2.4:install (default-install) @ alluxio-tests ---
[INFO] Installing /home/jenkins/workspace/alluxio-ubuntu-testing/PROFILE_OPTS/-PcontractTest/label/spark-k8s-testing/tests/target/alluxio-tests-1.7.0-SNAPSHOT.jar to /home/jenkins/.m2/repository/org/alluxio/alluxio-tests/1.7.0-SNAPSHOT/alluxio-tests-1.7.0-SNAPSHOT.jar
[INFO] Installing /home/jenkins/workspace/alluxio-ubuntu-testing/PROFILE_OPTS/-PcontractTest/label/spark-k8s-testing/tests/pom.xml to /home/jenkins/.m2/repository/org/alluxio/alluxio-tests/1.7.0-SNAPSHOT/alluxio-tests-1.7.0-SNAPSHOT.pom
[INFO]                                                                         
[INFO] ------------------------------------------------------------------------
[INFO] Building Alluxio Integration - FUSE 1.7.0-SNAPSHOT
[INFO] ------------------------------------------------------------------------
[INFO] 
[INFO] --- maven-clean-plugin:2.5:clean (default-clean) @ alluxio-integration-fuse ---
[INFO] 
[INFO] --- maven-enforcer-plugin:1.0:enforce (enforce-maven) @ alluxio-integration-fuse ---
[INFO] 
[INFO] --- maven-enforcer-plugin:1.0:enforce (enforce-versions) @ alluxio-integration-fuse ---
[INFO] 
[INFO] --- maven-checkstyle-plugin:2.17:check (checkstyle) @ alluxio-integration-fuse ---
[INFO] Starting audit...
/home/jenkins/workspace/alluxio-ubuntu-testing/PROFILE_OPTS/-PcontractTest/label/spark-k8s-testing/integration/fuse/src/test/java/alluxio/fuse/AlluxioFuseFileSystemTest.java:39:8: error: Unused import - org.junit.Assert.
Audit done.
[INFO] ------------------------------------------------------------------------
[INFO] Reactor Summary:
[INFO] 
[INFO] Alluxio Parent ..................................... SUCCESS [  4.841 s]
[INFO] Alluxio Core ....................................... SUCCESS [  1.181 s]
[INFO] Alluxio Core - Protobuf ............................ SUCCESS [ 21.417 s]
[INFO] Alluxio Core - Common Utilities .................... SUCCESS [01:16 min]
[INFO] Alluxio Core - Client .............................. SUCCESS [  0.814 s]
[INFO] Alluxio Core - Client - File System ................ SUCCESS [ 28.403 s]
[INFO] Alluxio Key Value .................................. SUCCESS [  0.683 s]
[INFO] Alluxio Key Value - Common Utilities ............... SUCCESS [ 15.378 s]
[INFO] Alluxio Key Value - Client ......................... SUCCESS [  8.480 s]
[INFO] Alluxio Key Value - Hadoop Utilities ............... SUCCESS [  8.566 s]
[INFO] Alluxio Examples ................................... SUCCESS [  9.054 s]
[INFO] Alluxio Shell ...................................... SUCCESS [  9.850 s]
[INFO] Alluxio Assembly JARs .............................. SUCCESS [  0.662 s]
[INFO] Alluxio Assembly - Client .......................... SUCCESS [  5.884 s]
[INFO] Alluxio Core - Server .............................. SUCCESS [  0.791 s]
[INFO] Alluxio Core - Server - Common Utilities ........... SUCCESS [ 15.745 s]
[INFO] Alluxio Under File System .......................... SUCCESS [  0.780 s]
[INFO] Alluxio Under File System - Local FS ............... SUCCESS [  6.943 s]
[INFO] Alluxio Core - Server - Master ..................... SUCCESS [ 31.898 s]
[INFO] Alluxio Core - Server - Proxy ...................... SUCCESS [ 10.490 s]
[INFO] Alluxio Core - Server - Worker ..................... SUCCESS [ 47.803 s]
[INFO] Alluxio Key Value - Server ......................... SUCCESS [  7.212 s]
[INFO] Alluxio Log Server ................................. SUCCESS [  5.380 s]
[INFO] Alluxio Under File System - GCS .................... SUCCESS [  7.542 s]
[INFO] Alluxio Under File System - HDFS ................... SUCCESS [ 21.795 s]
[INFO] Alluxio Under File System - Aliyun OSS ............. SUCCESS [ 10.808 s]
[INFO] Alluxio Under File System - S3A .................... SUCCESS [ 10.288 s]
[INFO] Alluxio Under File System - Swift .................. SUCCESS [ 10.071 s]
[INFO] Alluxio Assembly - Server .......................... SUCCESS [  9.229 s]
[INFO] Alluxio Core - Client - HDFS ....................... SUCCESS [ 11.556 s]
[INFO] Alluxio Core - Client - Runtime .................... SUCCESS [  5.147 s]
[INFO] Alluxio Integration ................................ SUCCESS [  0.757 s]
[INFO] Alluxio MiniCluster ................................ SUCCESS [  6.226 s]
[INFO] Alluxio Tests ...................................... SUCCESS [08:31 min]
[INFO] Alluxio Integration - FUSE ......................... FAILURE [  0.360 s]
[INFO] ------------------------------------------------------------------------
[INFO] BUILD FAILURE
[INFO] ------------------------------------------------------------------------
[INFO] Total time: 15:25 min
[INFO] Finished at: 2017-10-17T13:27:06-07:00
[INFO] Final Memory: 198M/6689M
[INFO] ------------------------------------------------------------------------
[ERROR] Failed to execute goal org.apache.maven.plugins:maven-checkstyle-plugin:2.17:check (checkstyle) on project alluxio-integration-fuse: Failed during checkstyle execution: There is 1 error reported by Checkstyle 6.11.2 with /home/jenkins/workspace/alluxio-ubuntu-testing/PROFILE_OPTS/-PcontractTest/label/spark-k8s-testing/build/checkstyle/alluxio_checks.xml ruleset. -> [Help 1]
org.apache.maven.lifecycle.LifecycleExecutionException: Failed to execute goal org.apache.maven.plugins:maven-checkstyle-plugin:2.17:check (checkstyle) on project alluxio-integration-fuse: Failed during checkstyle execution
	at org.apache.maven.lifecycle.internal.MojoExecutor.execute(MojoExecutor.java:212)
	at org.apache.maven.lifecycle.internal.MojoExecutor.execute(MojoExecutor.java:153)
	at org.apache.maven.lifecycle.internal.MojoExecutor.execute(MojoExecutor.java:145)
	at org.apache.maven.lifecycle.internal.LifecycleModuleBuilder.buildProject(LifecycleModuleBuilder.java:116)
	at org.apache.maven.lifecycle.internal.LifecycleModuleBuilder.buildProject(LifecycleModuleBuilder.java:80)
	at org.apache.maven.lifecycle.internal.builder.singlethreaded.SingleThreadedBuilder.build(SingleThreadedBuilder.java:51)
	at org.apache.maven.lifecycle.internal.LifecycleStarter.execute(LifecycleStarter.java:128)
	at org.apache.maven.DefaultMaven.doExecute(DefaultMaven.java:307)
	at org.apache.maven.DefaultMaven.doExecute(DefaultMaven.java:193)
	at org.apache.maven.DefaultMaven.execute(DefaultMaven.java:106)
	at org.apache.maven.cli.MavenCli.execute(MavenCli.java:863)
	at org.apache.maven.cli.MavenCli.doMain(MavenCli.java:288)
	at org.apache.maven.cli.MavenCli.main(MavenCli.java:199)
	at sun.reflect.NativeMethodAccessorImpl.invoke0(Native Method)
	at sun.reflect.NativeMethodAccessorImpl.invoke(NativeMethodAccessorImpl.java:62)
	at sun.reflect.DelegatingMethodAccessorImpl.invoke(DelegatingMethodAccessorImpl.java:43)
	at java.lang.reflect.Method.invoke(Method.java:498)
	at org.codehaus.plexus.classworlds.launcher.Launcher.launchEnhanced(Launcher.java:289)
	at org.codehaus.plexus.classworlds.launcher.Launcher.launch(Launcher.java:229)
	at org.codehaus.plexus.classworlds.launcher.Launcher.mainWithExitCode(Launcher.java:415)
	at org.codehaus.plexus.classworlds.launcher.Launcher.main(Launcher.java:356)
Caused by: org.apache.maven.plugin.MojoExecutionException: Failed during checkstyle execution
	at org.apache.maven.plugin.checkstyle.CheckstyleViolationCheckMojo.execute(CheckstyleViolationCheckMojo.java:547)
	at org.apache.maven.plugin.DefaultBuildPluginManager.executeMojo(DefaultBuildPluginManager.java:134)
	at org.apache.maven.lifecycle.internal.MojoExecutor.execute(MojoExecutor.java:207)
	... 20 more
Caused by: org.apache.maven.plugin.checkstyle.exec.CheckstyleExecutorException: There is 1 error reported by Checkstyle 6.11.2 with /home/jenkins/workspace/alluxio-ubuntu-testing/PROFILE_OPTS/-PcontractTest/label/spark-k8s-testing/build/checkstyle/alluxio_checks.xml ruleset.
	at org.apache.maven.plugin.checkstyle.exec.DefaultCheckstyleExecutor.executeCheckstyle(DefaultCheckstyleExecutor.java:313)
	at org.apache.maven.plugin.checkstyle.CheckstyleViolationCheckMojo.execute(CheckstyleViolationCheckMojo.java:538)
	... 22 more
[ERROR] 
[ERROR] Re-run Maven using the -X switch to enable full debug logging.
[ERROR] 
[ERROR] For more information about the errors and possible solutions, please read the following articles:
[ERROR] [Help 1] http://cwiki.apache.org/confluence/display/MAVEN/MojoExecutionException
[ERROR] 
[ERROR] After correcting the problems, you can resume the build with the command
[ERROR]   mvn <goals> -rf :alluxio-integration-fuse
Build step 'Invoke top-level Maven targets' marked build as failure
Finished: FAILURE