FailedConsole Output

Started by upstream project "avocado" build number 3697
originally caused by:
 Started by upstream project "ADAM" build number 3248
 originally caused by:
  Started by timer
[EnvInject] - Loading node environment variables.
Building remotely on amp-jenkins-worker-06 (centos spark-test) in workspace /home/jenkins/workspace/avocado/HADOOP_VERSION/2.6.0/SCALAVER/2.11/SPARK_VERSION/2.0.0/label/centos
 > git rev-parse --is-inside-work-tree # timeout=10
Fetching changes from the remote Git repository
 > git config remote.origin.url https://github.com/bigdatagenomics/avocado.git # timeout=10
Fetching upstream changes from https://github.com/bigdatagenomics/avocado.git
 > git --version # timeout=10
 > git fetch --tags --progress https://github.com/bigdatagenomics/avocado.git +refs/heads/*:refs/remotes/origin/*
Checking out Revision fa192c0716197b7ecda653c908e827a9ad2fc4b6 (refs/remotes/origin/master)
 > git config core.sparsecheckout # timeout=10
 > git checkout -f fa192c0716197b7ecda653c908e827a9ad2fc4b6
 > git rev-list fa192c0716197b7ecda653c908e827a9ad2fc4b6 # timeout=10
[centos] $ /bin/bash /tmp/hudson7990079164511472560.sh
+ set -e
+ export JAVA_HOME=/usr/java/jdk1.8.0_60
+ JAVA_HOME=/usr/java/jdk1.8.0_60
+ export MAVEN=/home/jenkins/tools/hudson.tasks.Maven_MavenInstallation/Maven_3.1.1/bin/
+ MAVEN=/home/jenkins/tools/hudson.tasks.Maven_MavenInstallation/Maven_3.1.1/bin/
+ export PATH=/usr/java/jdk1.8.0_60/bin/:/home/jenkins/tools/hudson.tasks.Maven_MavenInstallation/Maven_3.1.1/bin/:/home/jenkins/.cargo/bin:/home/anaconda/bin:/home/jenkins/tools/hudson.tasks.Maven_MavenInstallation/Maven_3.1.1/bin/:/home/android-sdk/:/usr/local/bin:/bin:/usr/bin
+ PATH=/usr/java/jdk1.8.0_60/bin/:/home/jenkins/tools/hudson.tasks.Maven_MavenInstallation/Maven_3.1.1/bin/:/home/jenkins/.cargo/bin:/home/anaconda/bin:/home/jenkins/tools/hudson.tasks.Maven_MavenInstallation/Maven_3.1.1/bin/:/home/android-sdk/:/usr/local/bin:/bin:/usr/bin
+ set +x
+ /home/jenkins/workspace/avocado/HADOOP_VERSION/2.6.0/SCALAVER/2.11/SPARK_VERSION/2.0.0/label/centos/scripts/jenkins-test

# make a tempdir for writing maven cruft to
AVOCADO_MVN_TMP_DIR=$(mktemp -d -t avocadoTestMvnXXXXXXX)
++ mktemp -d -t avocadoTestMvnXXXXXXX
+ AVOCADO_MVN_TMP_DIR=/tmp/avocadoTestMvnZP6l4Nj

# add this tempdir to the poms...
find . -name pom.xml \
    -exec sed -i.bak \
    -e "s:sun.io.serialization.extendedDebugInfo=true:sun.io.serialization.extendedDebugInfo=true -Djava.io.tmpdir=${AVOCADO_MVN_TMP_DIR}:g" \
    {} \;
+ find . -name pom.xml -exec sed -i.bak -e 's:sun.io.serialization.extendedDebugInfo=true:sun.io.serialization.extendedDebugInfo=true -Djava.io.tmpdir=/tmp/avocadoTestMvnZP6l4Nj:g' '{}' ';'
find . -name "*.bak" -exec rm -f {} \;
+ find . -name '*.bak' -exec rm -f '{}' ';'

# variable declarations
export PATH=${JAVA_HOME}/bin/:${PATH}
+ export PATH=/usr/java/jdk1.8.0_60/bin/:/usr/java/jdk1.8.0_60/bin/:/home/jenkins/tools/hudson.tasks.Maven_MavenInstallation/Maven_3.1.1/bin/:/home/jenkins/.cargo/bin:/home/anaconda/bin:/home/jenkins/tools/hudson.tasks.Maven_MavenInstallation/Maven_3.1.1/bin/:/home/android-sdk/:/usr/local/bin:/bin:/usr/bin
+ PATH=/usr/java/jdk1.8.0_60/bin/:/usr/java/jdk1.8.0_60/bin/:/home/jenkins/tools/hudson.tasks.Maven_MavenInstallation/Maven_3.1.1/bin/:/home/jenkins/.cargo/bin:/home/anaconda/bin:/home/jenkins/tools/hudson.tasks.Maven_MavenInstallation/Maven_3.1.1/bin/:/home/android-sdk/:/usr/local/bin:/bin:/usr/bin
export MAVEN_OPTS="-Xmx1536m -XX:MaxPermSize=1g -Dfile.encoding=utf-8"
+ export 'MAVEN_OPTS=-Xmx1536m -XX:MaxPermSize=1g -Dfile.encoding=utf-8'
+ MAVEN_OPTS='-Xmx1536m -XX:MaxPermSize=1g -Dfile.encoding=utf-8'
DIR=$( cd $( dirname ${BASH_SOURCE[0]} ) && pwd )
+++ dirname /home/jenkins/workspace/avocado/HADOOP_VERSION/2.6.0/SCALAVER/2.11/SPARK_VERSION/2.0.0/label/centos/scripts/jenkins-test
++ cd /home/jenkins/workspace/avocado/HADOOP_VERSION/2.6.0/SCALAVER/2.11/SPARK_VERSION/2.0.0/label/centos/scripts
++ pwd
+ DIR=/home/jenkins/workspace/avocado/HADOOP_VERSION/2.6.0/SCALAVER/2.11/SPARK_VERSION/2.0.0/label/centos/scripts
PROJECT_ROOT=${DIR}/..
+ PROJECT_ROOT=/home/jenkins/workspace/avocado/HADOOP_VERSION/2.6.0/SCALAVER/2.11/SPARK_VERSION/2.0.0/label/centos/scripts/..
VERSION=$(grep "<version>" ${PROJECT_ROOT}/pom.xml  | head -2 | tail -1 | sed 's/ *<version>//g' | sed 's/<\/version>//g')
++ grep '<version>' /home/jenkins/workspace/avocado/HADOOP_VERSION/2.6.0/SCALAVER/2.11/SPARK_VERSION/2.0.0/label/centos/scripts/../pom.xml
++ head -2
++ tail -1
++ sed 's/ *<version>//g'
++ sed 's/<\/version>//g'
+ VERSION=0.0.3-SNAPSHOT

# is the hadoop version set?
if ! [[ ${HADOOP_VERSION} ]];
then
    echo "HADOOP_VERSION environment variable is not set."
    echo "Please set this variable before running."
    
    exit 1
fi
+ [[ -n 2.6.0 ]]

# is the spark version set?
if ! [[ ${SPARK_VERSION} ]];
then
    echo "SPARK_VERSION environment variable is not set."
    echo "Please set this variable before running."
    
    exit 1
fi
+ [[ -n 2.0.0 ]]

# this next line is supposed to fail
set +e
+ set +e

echo "Rewriting POM.xml files to Scala 2.10 and Spark 1 should error..."
+ echo 'Rewriting POM.xml files to Scala 2.10 and Spark 1 should error...'
Rewriting POM.xml files to Scala 2.10 and Spark 1 should error...
./scripts/move_to_spark_1.sh
+ ./scripts/move_to_spark_1.sh
POM is already set up for Spark 1 (Spark 1/2 artifacts are missing -spark2 suffix in artifact names).
Cowardly refusing to move to Spark 1 a second time...
if [[ $? == 0 ]];
then
    echo "Running move_to_spark_1.sh when POMs are set up for Spark 1 should fail, but error code was 0 (success)."
    exit 1
fi
+ [[ 1 == 0 ]]

./scripts/move_to_scala_2.10.sh
+ ./scripts/move_to_scala_2.10.sh
Scala version is already set to 2.10 (Scala artifacts have _2.10 version suffix in artifact name).
Cowardly refusing to move to Scala 2.10 a second time...
if [[ $? == 0 ]];
then
    echo "Running move_to_scala_2.10.sh when POMs are set up for Scala 2.10 should fail, but error code was 0 (success)."
    exit 1
fi
+ [[ 1 == 0 ]]

set -e
+ set -e

# are we testing for spark 2.0.0? if so, we need to rewrite our poms first
if [ ${SPARK_VERSION} == 2.0.0 ];
then
    
    echo "Rewriting POM.xml files for Spark 2."
    ./scripts/move_to_spark_2.sh

    # shouldn't be able to move to spark 2 twice
    set +e
    ./scripts/move_to_spark_2.sh
    if [[ $? == 0 ]];
    then
        echo "We have already moved to Spark 2, so running move_to_spark_2.sh a second time should fail, but error code was 0 (success)."
        exit 1
    fi
    set -e
fi
+ '[' 2.0.0 == 2.0.0 ']'
+ echo 'Rewriting POM.xml files for Spark 2.'
Rewriting POM.xml files for Spark 2.
+ ./scripts/move_to_spark_2.sh
+ set +e
+ ./scripts/move_to_spark_2.sh
POM is already set up for Spark 2 (Spark 1/2 artifacts have -spark2 suffix in artifact names).
Cowardly refusing to move to Spark 2 a second time...
+ [[ 1 == 0 ]]
+ set -e

# are we testing for scala 2.11? if so, we need to rewrite our poms to 2.11 first
if [ ${SCALAVER} == 2.11 ];
then
    echo "Rewriting POM.xml files for Scala 2.11."
    ./scripts/move_to_scala_2.11.sh

    # shouldn't be able to move to scala 2.11 twice
    set +e
    ./scripts/move_to_scala_2.11.sh
    if [[ $? == 0 ]];
    then
        echo "We have already moved to Scala 2.11, so running move_to_scala_2.11.sh a second time should fail, but error code was 0 (success)."
        exit 1
    fi
    set -e
fi
+ '[' 2.11 == 2.11 ']'
+ echo 'Rewriting POM.xml files for Scala 2.11.'
Rewriting POM.xml files for Scala 2.11.
+ ./scripts/move_to_scala_2.11.sh
+ set +e
+ ./scripts/move_to_scala_2.11.sh
Scala version is already set to 2.11 (Scala artifacts have _2.11 version suffix in artifact name).
Cowardly refusing to move to Scala 2.11 a second time...
+ [[ 1 == 0 ]]
+ set -e

# print versions
echo "Testing AVOCADO version ${VERSION} on Spark ${SPARK_VERSION} and Hadoop ${HADOOP_VERSION}"
+ echo 'Testing AVOCADO version 0.0.3-SNAPSHOT on Spark 2.0.0 and Hadoop 2.6.0'
Testing AVOCADO version 0.0.3-SNAPSHOT on Spark 2.0.0 and Hadoop 2.6.0

# first, build the sources, run the unit tests, and generate a coverage report
mvn clean \
    -Dhadoop.version=${HADOOP_VERSION} \
    -Dspark.version=${SPARK_VERSION} 
+ mvn clean -Dhadoop.version=2.6.0 -Dspark.version=2.0.0
Java HotSpot(TM) 64-Bit Server VM warning: ignoring option MaxPermSize=1g; support was removed in 8.0
[INFO] Scanning for projects...
[WARNING] 
[WARNING] Some problems were encountered while building the effective model for org.bdgenomics.avocado:avocado-core-spark2_2.11:jar:0.0.3-SNAPSHOT
[WARNING] 'build.plugins.plugin.version' for org.apache.maven.plugins:maven-jar-plugin is missing. @ line 66, column 15
[WARNING] 'dependencies.dependency.exclusions.exclusion.artifactId' for org.apache.hadoop:hadoop-client:jar with value '*' does not match a valid id pattern. @ line 134, column 23
[WARNING] 'dependencyManagement.dependencies.dependency.exclusions.exclusion.artifactId' for org.apache.hadoop:hadoop-client:jar with value '*' does not match a valid id pattern. @ org.bdgenomics.avocado:avocado-parent-spark2_2.11:0.0.3-SNAPSHOT, /home/jenkins/workspace/avocado/HADOOP_VERSION/2.6.0/SCALAVER/2.11/SPARK_VERSION/2.0.0/label/centos/pom.xml, line 336, column 25
[WARNING] 'dependencyManagement.dependencies.dependency.exclusions.exclusion.artifactId' for org.apache.hadoop:hadoop-client:jar with value '*' does not match a valid id pattern. @ org.bdgenomics.avocado:avocado-parent-spark2_2.11:0.0.3-SNAPSHOT, /home/jenkins/workspace/avocado/HADOOP_VERSION/2.6.0/SCALAVER/2.11/SPARK_VERSION/2.0.0/label/centos/pom.xml, line 340, column 25
[WARNING] 'dependencyManagement.dependencies.dependency.exclusions.exclusion.artifactId' for org.apache.hadoop:hadoop-client:jar with value '*' does not match a valid id pattern. @ org.bdgenomics.avocado:avocado-parent-spark2_2.11:0.0.3-SNAPSHOT, /home/jenkins/workspace/avocado/HADOOP_VERSION/2.6.0/SCALAVER/2.11/SPARK_VERSION/2.0.0/label/centos/pom.xml, line 344, column 25
[WARNING] 
[WARNING] Some problems were encountered while building the effective model for org.bdgenomics.avocado:avocado-cli-spark2_2.11:jar:0.0.3-SNAPSHOT
[WARNING] 'dependencies.dependency.exclusions.exclusion.artifactId' for org.apache.hadoop:hadoop-client:jar with value '*' does not match a valid id pattern. @ line 176, column 23
[WARNING] 'dependencyManagement.dependencies.dependency.exclusions.exclusion.artifactId' for org.apache.hadoop:hadoop-client:jar with value '*' does not match a valid id pattern. @ org.bdgenomics.avocado:avocado-parent-spark2_2.11:0.0.3-SNAPSHOT, /home/jenkins/workspace/avocado/HADOOP_VERSION/2.6.0/SCALAVER/2.11/SPARK_VERSION/2.0.0/label/centos/pom.xml, line 336, column 25
[WARNING] 'dependencyManagement.dependencies.dependency.exclusions.exclusion.artifactId' for org.apache.hadoop:hadoop-client:jar with value '*' does not match a valid id pattern. @ org.bdgenomics.avocado:avocado-parent-spark2_2.11:0.0.3-SNAPSHOT, /home/jenkins/workspace/avocado/HADOOP_VERSION/2.6.0/SCALAVER/2.11/SPARK_VERSION/2.0.0/label/centos/pom.xml, line 340, column 25
[WARNING] 'dependencyManagement.dependencies.dependency.exclusions.exclusion.artifactId' for org.apache.hadoop:hadoop-client:jar with value '*' does not match a valid id pattern. @ org.bdgenomics.avocado:avocado-parent-spark2_2.11:0.0.3-SNAPSHOT, /home/jenkins/workspace/avocado/HADOOP_VERSION/2.6.0/SCALAVER/2.11/SPARK_VERSION/2.0.0/label/centos/pom.xml, line 344, column 25
[WARNING] 
[WARNING] Some problems were encountered while building the effective model for org.bdgenomics.avocado:avocado-parent-spark2_2.11:pom:0.0.3-SNAPSHOT
[WARNING] 'dependencyManagement.dependencies.dependency.exclusions.exclusion.artifactId' for org.apache.hadoop:hadoop-client:jar with value '*' does not match a valid id pattern. @ line 336, column 25
[WARNING] 'dependencyManagement.dependencies.dependency.exclusions.exclusion.artifactId' for org.apache.hadoop:hadoop-client:jar with value '*' does not match a valid id pattern. @ line 340, column 25
[WARNING] 'dependencyManagement.dependencies.dependency.exclusions.exclusion.artifactId' for org.apache.hadoop:hadoop-client:jar with value '*' does not match a valid id pattern. @ line 344, column 25
[WARNING] 
[WARNING] It is highly recommended to fix these problems because they threaten the stability of your build.
[WARNING] 
[WARNING] For this reason, future Maven versions might no longer support building such malformed projects.
[WARNING] 
[INFO] ------------------------------------------------------------------------
[INFO] Reactor Build Order:
[INFO] 
[INFO] avocado: A Variant Caller, Distributed
[INFO] avocado-core: Core variant calling algorithms
[INFO] avocado-cli: Command line interface for a distributed variant caller
[INFO]                                                                         
[INFO] ------------------------------------------------------------------------
[INFO] Building avocado: A Variant Caller, Distributed 0.0.3-SNAPSHOT
[INFO] ------------------------------------------------------------------------
[INFO] 
[INFO] --- maven-clean-plugin:2.5:clean (default-clean) @ avocado-parent-spark2_2.11 ---
[INFO] Deleting /home/jenkins/workspace/avocado/HADOOP_VERSION/2.6.0/SCALAVER/2.11/SPARK_VERSION/2.0.0/label/centos/target
[INFO]                                                                         
[INFO] ------------------------------------------------------------------------
[INFO] Building avocado-core: Core variant calling algorithms 0.0.3-SNAPSHOT
[INFO] ------------------------------------------------------------------------
[INFO] 
[INFO] --- maven-clean-plugin:2.5:clean (default-clean) @ avocado-core-spark2_2.11 ---
[INFO] Deleting /home/jenkins/workspace/avocado/HADOOP_VERSION/2.6.0/SCALAVER/2.11/SPARK_VERSION/2.0.0/label/centos/avocado-core/target
[INFO]                                                                         
[INFO] ------------------------------------------------------------------------
[INFO] Building avocado-cli: Command line interface for a distributed variant caller 0.0.3-SNAPSHOT
[INFO] ------------------------------------------------------------------------
[INFO] 
[INFO] --- maven-clean-plugin:2.5:clean (default-clean) @ avocado-cli-spark2_2.11 ---
[INFO] Deleting /home/jenkins/workspace/avocado/HADOOP_VERSION/2.6.0/SCALAVER/2.11/SPARK_VERSION/2.0.0/label/centos/avocado-cli/target
[INFO] ------------------------------------------------------------------------
[INFO] Reactor Summary:
[INFO] 
[INFO] avocado: A Variant Caller, Distributed ............ SUCCESS [0.132s]
[INFO] avocado-core: Core variant calling algorithms ..... SUCCESS [0.122s]
[INFO] avocado-cli: Command line interface for a distributed variant caller  SUCCESS [0.047s]
[INFO] ------------------------------------------------------------------------
[INFO] BUILD SUCCESS
[INFO] ------------------------------------------------------------------------
[INFO] Total time: 0.426s
[INFO] Finished at: Sun Dec 31 04:41:42 PST 2017
[INFO] Final Memory: 19M/1472M
[INFO] ------------------------------------------------------------------------

# if this is a pull request, we need to set the coveralls pr id
if [[ ! -z $ghprbPullId ]];
then
    COVERALLS_PRB_OPTION="-DpullRequest=${ghprbPullId}"
fi
+ [[ ! -z '' ]]

# coveralls token should not be visible
set +x +v
+ set +x +v
Java HotSpot(TM) 64-Bit Server VM warning: ignoring option MaxPermSize=1g; support was removed in 8.0
[INFO] Scanning for projects...
[WARNING] 
[WARNING] Some problems were encountered while building the effective model for org.bdgenomics.avocado:avocado-core-spark2_2.11:jar:0.0.3-SNAPSHOT
[WARNING] 'build.plugins.plugin.version' for org.apache.maven.plugins:maven-jar-plugin is missing. @ line 66, column 15
[WARNING] 'dependencies.dependency.exclusions.exclusion.artifactId' for org.apache.hadoop:hadoop-client:jar with value '*' does not match a valid id pattern. @ line 134, column 23
[WARNING] 'dependencyManagement.dependencies.dependency.exclusions.exclusion.artifactId' for org.apache.hadoop:hadoop-client:jar with value '*' does not match a valid id pattern. @ org.bdgenomics.avocado:avocado-parent-spark2_2.11:0.0.3-SNAPSHOT, /home/jenkins/workspace/avocado/HADOOP_VERSION/2.6.0/SCALAVER/2.11/SPARK_VERSION/2.0.0/label/centos/pom.xml, line 336, column 25
[WARNING] 'dependencyManagement.dependencies.dependency.exclusions.exclusion.artifactId' for org.apache.hadoop:hadoop-client:jar with value '*' does not match a valid id pattern. @ org.bdgenomics.avocado:avocado-parent-spark2_2.11:0.0.3-SNAPSHOT, /home/jenkins/workspace/avocado/HADOOP_VERSION/2.6.0/SCALAVER/2.11/SPARK_VERSION/2.0.0/label/centos/pom.xml, line 340, column 25
[WARNING] 'dependencyManagement.dependencies.dependency.exclusions.exclusion.artifactId' for org.apache.hadoop:hadoop-client:jar with value '*' does not match a valid id pattern. @ org.bdgenomics.avocado:avocado-parent-spark2_2.11:0.0.3-SNAPSHOT, /home/jenkins/workspace/avocado/HADOOP_VERSION/2.6.0/SCALAVER/2.11/SPARK_VERSION/2.0.0/label/centos/pom.xml, line 344, column 25
[WARNING] 
[WARNING] Some problems were encountered while building the effective model for org.bdgenomics.avocado:avocado-cli-spark2_2.11:jar:0.0.3-SNAPSHOT
[WARNING] 'dependencies.dependency.exclusions.exclusion.artifactId' for org.apache.hadoop:hadoop-client:jar with value '*' does not match a valid id pattern. @ line 176, column 23
[WARNING] 'dependencyManagement.dependencies.dependency.exclusions.exclusion.artifactId' for org.apache.hadoop:hadoop-client:jar with value '*' does not match a valid id pattern. @ org.bdgenomics.avocado:avocado-parent-spark2_2.11:0.0.3-SNAPSHOT, /home/jenkins/workspace/avocado/HADOOP_VERSION/2.6.0/SCALAVER/2.11/SPARK_VERSION/2.0.0/label/centos/pom.xml, line 336, column 25
[WARNING] 'dependencyManagement.dependencies.dependency.exclusions.exclusion.artifactId' for org.apache.hadoop:hadoop-client:jar with value '*' does not match a valid id pattern. @ org.bdgenomics.avocado:avocado-parent-spark2_2.11:0.0.3-SNAPSHOT, /home/jenkins/workspace/avocado/HADOOP_VERSION/2.6.0/SCALAVER/2.11/SPARK_VERSION/2.0.0/label/centos/pom.xml, line 340, column 25
[WARNING] 'dependencyManagement.dependencies.dependency.exclusions.exclusion.artifactId' for org.apache.hadoop:hadoop-client:jar with value '*' does not match a valid id pattern. @ org.bdgenomics.avocado:avocado-parent-spark2_2.11:0.0.3-SNAPSHOT, /home/jenkins/workspace/avocado/HADOOP_VERSION/2.6.0/SCALAVER/2.11/SPARK_VERSION/2.0.0/label/centos/pom.xml, line 344, column 25
[WARNING] 
[WARNING] Some problems were encountered while building the effective model for org.bdgenomics.avocado:avocado-parent-spark2_2.11:pom:0.0.3-SNAPSHOT
[WARNING] 'dependencyManagement.dependencies.dependency.exclusions.exclusion.artifactId' for org.apache.hadoop:hadoop-client:jar with value '*' does not match a valid id pattern. @ line 336, column 25
[WARNING] 'dependencyManagement.dependencies.dependency.exclusions.exclusion.artifactId' for org.apache.hadoop:hadoop-client:jar with value '*' does not match a valid id pattern. @ line 340, column 25
[WARNING] 'dependencyManagement.dependencies.dependency.exclusions.exclusion.artifactId' for org.apache.hadoop:hadoop-client:jar with value '*' does not match a valid id pattern. @ line 344, column 25
[WARNING] 
[WARNING] It is highly recommended to fix these problems because they threaten the stability of your build.
[WARNING] 
[WARNING] For this reason, future Maven versions might no longer support building such malformed projects.
[WARNING] 
[INFO] ------------------------------------------------------------------------
[INFO] Reactor Build Order:
[INFO] 
[INFO] avocado: A Variant Caller, Distributed
[INFO] avocado-core: Core variant calling algorithms
[INFO] avocado-cli: Command line interface for a distributed variant caller
[INFO]                                                                         
[INFO] ------------------------------------------------------------------------
[INFO] Building avocado: A Variant Caller, Distributed 0.0.3-SNAPSHOT
[INFO] ------------------------------------------------------------------------
[INFO] 
[INFO] --- maven-enforcer-plugin:1.0:enforce (enforce-maven) @ avocado-parent-spark2_2.11 ---
[INFO] 
[INFO] --- build-helper-maven-plugin:1.10:add-source (add-source) @ avocado-parent-spark2_2.11 ---
[INFO] Source directory: /home/jenkins/workspace/avocado/HADOOP_VERSION/2.6.0/SCALAVER/2.11/SPARK_VERSION/2.0.0/label/centos/src/main/scala added.
[INFO] 
[INFO] --- scalariform-maven-plugin:0.1.4:format (default-cli) @ avocado-parent-spark2_2.11 ---
[INFO] Modified 0 of 56 .scala files
[INFO] 
[INFO] --- scala-maven-plugin:3.2.2:compile (scala-compile-first) @ avocado-parent-spark2_2.11 ---
[INFO] No sources to compile
[INFO] 
[INFO] --- build-helper-maven-plugin:1.10:add-test-source (add-test-source) @ avocado-parent-spark2_2.11 ---
[INFO] Test Source directory: /home/jenkins/workspace/avocado/HADOOP_VERSION/2.6.0/SCALAVER/2.11/SPARK_VERSION/2.0.0/label/centos/src/test/scala added.
[INFO] 
[INFO] --- scala-maven-plugin:3.2.2:testCompile (scala-test-compile-first) @ avocado-parent-spark2_2.11 ---
[INFO] No sources to compile
[INFO] 
[INFO] >>> scoverage-maven-plugin:1.1.1:report (default-cli) @ avocado-parent-spark2_2.11 >>>
[INFO] 
[INFO] --- maven-enforcer-plugin:1.0:enforce (enforce-maven) @ avocado-parent-spark2_2.11 ---
[INFO] 
[INFO] --- build-helper-maven-plugin:1.10:add-source (add-source) @ avocado-parent-spark2_2.11 ---
[INFO] Source directory: /home/jenkins/workspace/avocado/HADOOP_VERSION/2.6.0/SCALAVER/2.11/SPARK_VERSION/2.0.0/label/centos/src/main/scala added.
[INFO] 
[INFO] --- scalariform-maven-plugin:0.1.4:format (default-cli) @ avocado-parent-spark2_2.11 ---
[INFO] Modified 0 of 56 .scala files
[INFO] 
[INFO] --- scoverage-maven-plugin:1.1.1:pre-compile (default-cli) @ avocado-parent-spark2_2.11 ---
[INFO] Skipping SCoverage execution for project with packaging type 'pom'
[INFO] 
[INFO] --- scala-maven-plugin:3.2.2:compile (scala-compile-first) @ avocado-parent-spark2_2.11 ---
[INFO] No sources to compile
[INFO] 
[INFO] --- scoverage-maven-plugin:1.1.1:post-compile (default-cli) @ avocado-parent-spark2_2.11 ---
[INFO] 
[INFO] --- build-helper-maven-plugin:1.10:add-test-source (add-test-source) @ avocado-parent-spark2_2.11 ---
[INFO] Test Source directory: /home/jenkins/workspace/avocado/HADOOP_VERSION/2.6.0/SCALAVER/2.11/SPARK_VERSION/2.0.0/label/centos/src/test/scala added.
[INFO] 
[INFO] --- scala-maven-plugin:3.2.2:testCompile (scala-test-compile-first) @ avocado-parent-spark2_2.11 ---
[INFO] No sources to compile
[INFO] 
[INFO] <<< scoverage-maven-plugin:1.1.1:report (default-cli) @ avocado-parent-spark2_2.11 <<<
[INFO] 
[INFO] --- scoverage-maven-plugin:1.1.1:report (default-cli) @ avocado-parent-spark2_2.11 ---
[INFO]                                                                         
[INFO] ------------------------------------------------------------------------
[INFO] Building avocado-core: Core variant calling algorithms 0.0.3-SNAPSHOT
[INFO] ------------------------------------------------------------------------
Downloading: http://oss.sonatype.org/content/repositories/snapshots/org/bdgenomics/adam/adam-core-spark2_2.11/0.23.0-SNAPSHOT/maven-metadata.xml
Downloading: https://oss.sonatype.org/content/repositories/snapshots/org/bdgenomics/adam/adam-core-spark2_2.11/0.23.0-SNAPSHOT/maven-metadata.xml
Downloading: http://people.apache.org/repo/m2-snapshot-repository/org/bdgenomics/adam/adam-core-spark2_2.11/0.23.0-SNAPSHOT/maven-metadata.xml

2/2 KB   2/2 KB   
2/2 KB   2/2 KB   
                  
Downloaded: https://oss.sonatype.org/content/repositories/snapshots/org/bdgenomics/adam/adam-core-spark2_2.11/0.23.0-SNAPSHOT/maven-metadata.xml (2 KB at 1.9 KB/sec)
                  
Downloaded: http://oss.sonatype.org/content/repositories/snapshots/org/bdgenomics/adam/adam-core-spark2_2.11/0.23.0-SNAPSHOT/maven-metadata.xml (2 KB at 1.7 KB/sec)
Downloading: http://oss.sonatype.org/content/repositories/snapshots/org/bdgenomics/adam/adam-core-spark2_2.11/0.23.0-SNAPSHOT/adam-core-spark2_2.11-0.23.0-20171231.123946-617.pom
4/12 KB           
8/12 KB   
12/12 KB   
           
Downloaded: http://oss.sonatype.org/content/repositories/snapshots/org/bdgenomics/adam/adam-core-spark2_2.11/0.23.0-SNAPSHOT/adam-core-spark2_2.11-0.23.0-20171231.123946-617.pom (12 KB at 38.0 KB/sec)
Downloading: http://people.apache.org/repo/m2-snapshot-repository/org/bdgenomics/adam/adam-core-spark2_2.11/0.23.0-SNAPSHOT/adam-core-spark2_2.11-0.23.0-20171231.123946-617.pom
           
Downloading: https://oss.sonatype.org/content/repositories/snapshots/org/bdgenomics/adam/adam-core-spark2_2.11/0.23.0-SNAPSHOT/adam-core-spark2_2.11-0.23.0-20171231.123946-617.pom
4/12 KB    
8/12 KB   
12/12 KB   
           
Downloaded: https://oss.sonatype.org/content/repositories/snapshots/org/bdgenomics/adam/adam-core-spark2_2.11/0.23.0-SNAPSHOT/adam-core-spark2_2.11-0.23.0-20171231.123946-617.pom (12 KB at 67.9 KB/sec)
Downloading: http://people.apache.org/repo/m2-snapshot-repository/org/bdgenomics/adam/adam-parent-spark2_2.11/0.23.0-SNAPSHOT/maven-metadata.xml
Downloading: http://oss.sonatype.org/content/repositories/snapshots/org/bdgenomics/adam/adam-parent-spark2_2.11/0.23.0-SNAPSHOT/maven-metadata.xml
Downloading: https://oss.sonatype.org/content/repositories/snapshots/org/bdgenomics/adam/adam-parent-spark2_2.11/0.23.0-SNAPSHOT/maven-metadata.xml
625/625 B   
625/625 B   625/625 B   
                        
Downloaded: https://oss.sonatype.org/content/repositories/snapshots/org/bdgenomics/adam/adam-parent-spark2_2.11/0.23.0-SNAPSHOT/maven-metadata.xml (625 B at 3.6 KB/sec)
                        
Downloaded: http://oss.sonatype.org/content/repositories/snapshots/org/bdgenomics/adam/adam-parent-spark2_2.11/0.23.0-SNAPSHOT/maven-metadata.xml (625 B at 2.0 KB/sec)
                        
Downloading: http://oss.sonatype.org/content/repositories/snapshots/org/bdgenomics/adam/adam-parent-spark2_2.11/0.23.0-SNAPSHOT/adam-parent-spark2_2.11-0.23.0-20171231.123837-617.pom
4/27 KB                 
8/27 KB   
12/27 KB   
16/27 KB   
20/27 KB   
24/27 KB   
27/27 KB   
           
Downloaded: http://oss.sonatype.org/content/repositories/snapshots/org/bdgenomics/adam/adam-parent-spark2_2.11/0.23.0-SNAPSHOT/adam-parent-spark2_2.11-0.23.0-20171231.123837-617.pom (27 KB at 87.6 KB/sec)
Downloading: https://oss.sonatype.org/content/repositories/snapshots/org/bdgenomics/adam/adam-codegen-spark2_2.11/0.23.0-SNAPSHOT/maven-metadata.xml
Downloading: http://people.apache.org/repo/m2-snapshot-repository/org/bdgenomics/adam/adam-codegen-spark2_2.11/0.23.0-SNAPSHOT/maven-metadata.xml
Downloading: http://oss.sonatype.org/content/repositories/snapshots/org/bdgenomics/adam/adam-codegen-spark2_2.11/0.23.0-SNAPSHOT/maven-metadata.xml
2/2 KB     
2/2 KB   2/2 KB   
                  
Downloaded: https://oss.sonatype.org/content/repositories/snapshots/org/bdgenomics/adam/adam-codegen-spark2_2.11/0.23.0-SNAPSHOT/maven-metadata.xml (2 KB at 7.3 KB/sec)
                  
Downloaded: http://oss.sonatype.org/content/repositories/snapshots/org/bdgenomics/adam/adam-codegen-spark2_2.11/0.23.0-SNAPSHOT/maven-metadata.xml (2 KB at 4.1 KB/sec)
                  
Downloading: http://oss.sonatype.org/content/repositories/snapshots/org/bdgenomics/adam/adam-codegen-spark2_2.11/0.23.0-SNAPSHOT/adam-codegen-spark2_2.11-0.23.0-20171231.123843-377.pom
4/4 KB            
         
Downloaded: http://oss.sonatype.org/content/repositories/snapshots/org/bdgenomics/adam/adam-codegen-spark2_2.11/0.23.0-SNAPSHOT/adam-codegen-spark2_2.11-0.23.0-20171231.123843-377.pom (4 KB at 12.8 KB/sec)
Downloading: http://people.apache.org/repo/m2-snapshot-repository/org/bdgenomics/adam/adam-codegen-spark2_2.11/0.23.0-SNAPSHOT/adam-codegen-spark2_2.11-0.23.0-20171231.123843-377.pom
         
Downloading: https://oss.sonatype.org/content/repositories/snapshots/org/bdgenomics/adam/adam-codegen-spark2_2.11/0.23.0-SNAPSHOT/adam-codegen-spark2_2.11-0.23.0-20171231.123843-377.pom
4/4 KB   
         
Downloaded: https://oss.sonatype.org/content/repositories/snapshots/org/bdgenomics/adam/adam-codegen-spark2_2.11/0.23.0-SNAPSHOT/adam-codegen-spark2_2.11-0.23.0-20171231.123843-377.pom (4 KB at 22.6 KB/sec)
Downloading: http://oss.sonatype.org/content/repositories/snapshots/org/bdgenomics/adam/adam-core-spark2_2.11/0.23.0-SNAPSHOT/adam-core-spark2_2.11-0.23.0-20171231.123946-617.jar
Downloading: http://oss.sonatype.org/content/repositories/snapshots/org/bdgenomics/adam/adam-codegen-spark2_2.11/0.23.0-SNAPSHOT/adam-codegen-spark2_2.11-0.23.0-20171231.123843-377.jar
4/3368 KB   
8/3368 KB   
12/3368 KB   
4/33 KB   12/3368 KB   
4/33 KB   16/3368 KB   
4/33 KB   20/3368 KB   
8/33 KB   20/3368 KB   
12/33 KB   20/3368 KB   
12/33 KB   20/3368 KB   
12/33 KB   24/3368 KB   
12/33 KB   28/3368 KB   
12/33 KB   32/3368 KB   
12/33 KB   36/3368 KB   
16/33 KB   36/3368 KB   
16/33 KB   40/3368 KB   
20/33 KB   40/3368 KB   
20/33 KB   44/3368 KB   
24/33 KB   44/3368 KB   
24/33 KB   44/3368 KB   
28/33 KB   44/3368 KB   
32/33 KB   44/3368 KB   
32/33 KB   48/3368 KB   
33/33 KB   48/3368 KB   
33/33 KB   52/3368 KB   
33/33 KB   56/3368 KB   
33/33 KB   60/3368 KB   
33/33 KB   64/3368 KB   
33/33 KB   68/3368 KB   
33/33 KB   72/3368 KB   
33/33 KB   76/3368 KB   
33/33 KB   80/3368 KB   
33/33 KB   84/3368 KB   
33/33 KB   88/3368 KB   
33/33 KB   92/3368 KB   
33/33 KB   96/3368 KB   
33/33 KB   100/3368 KB   
33/33 KB   104/3368 KB   
33/33 KB   108/3368 KB   
33/33 KB   112/3368 KB   
33/33 KB   116/3368 KB   
33/33 KB   120/3368 KB   
33/33 KB   124/3368 KB   
33/33 KB   128/3368 KB   
33/33 KB   132/3368 KB   
33/33 KB   136/3368 KB   
33/33 KB   140/3368 KB   
33/33 KB   144/3368 KB   
33/33 KB   148/3368 KB   
33/33 KB   152/3368 KB   
33/33 KB   156/3368 KB   
33/33 KB   160/3368 KB   
33/33 KB   164/3368 KB   
33/33 KB   168/3368 KB   
33/33 KB   172/3368 KB   
33/33 KB   176/3368 KB   
33/33 KB   180/3368 KB   
33/33 KB   184/3368 KB   
33/33 KB   188/3368 KB   
33/33 KB   192/3368 KB   
33/33 KB   196/3368 KB   
                         
Downloaded: http://oss.sonatype.org/content/repositories/snapshots/org/bdgenomics/adam/adam-codegen-spark2_2.11/0.23.0-SNAPSHOT/adam-codegen-spark2_2.11-0.23.0-20171231.123843-377.jar (33 KB at 78.2 KB/sec)
200/3368 KB              
204/3368 KB   
208/3368 KB   
212/3368 KB   
216/3368 KB   
220/3368 KB   
224/3368 KB   
228/3368 KB   
232/3368 KB   
236/3368 KB   
240/3368 KB   
244/3368 KB   
248/3368 KB   
252/3368 KB   
256/3368 KB   
260/3368 KB   
264/3368 KB   
268/3368 KB   
272/3368 KB   
276/3368 KB   
280/3368 KB   
284/3368 KB   
288/3368 KB   
292/3368 KB   
296/3368 KB   
300/3368 KB   
304/3368 KB   
308/3368 KB   
312/3368 KB   
316/3368 KB   
320/3368 KB   
324/3368 KB   
328/3368 KB   
332/3368 KB   
336/3368 KB   
340/3368 KB   
344/3368 KB   
348/3368 KB   
352/3368 KB   
356/3368 KB   
360/3368 KB   
364/3368 KB   
368/3368 KB   
372/3368 KB   
376/3368 KB   
380/3368 KB   
384/3368 KB   
388/3368 KB   
392/3368 KB   
396/3368 KB   
400/3368 KB   
404/3368 KB   
408/3368 KB   
412/3368 KB   
416/3368 KB   
420/3368 KB   
424/3368 KB   
428/3368 KB   
432/3368 KB   
436/3368 KB   
440/3368 KB   
444/3368 KB   
448/3368 KB   
452/3368 KB   
456/3368 KB   
460/3368 KB   
464/3368 KB   
468/3368 KB   
472/3368 KB   
476/3368 KB   
480/3368 KB   
484/3368 KB   
488/3368 KB   
492/3368 KB   
496/3368 KB   
500/3368 KB   
504/3368 KB   
508/3368 KB   
512/3368 KB   
516/3368 KB   
520/3368 KB   
524/3368 KB   
528/3368 KB   
532/3368 KB   
536/3368 KB   
540/3368 KB   
544/3368 KB   
548/3368 KB   
552/3368 KB   
556/3368 KB   
560/3368 KB   
564/3368 KB   
568/3368 KB   
572/3368 KB   
576/3368 KB   
580/3368 KB   
584/3368 KB   
588/3368 KB   
592/3368 KB   
596/3368 KB   
600/3368 KB   
604/3368 KB   
608/3368 KB   
612/3368 KB   
616/3368 KB   
620/3368 KB   
624/3368 KB   
628/3368 KB   
632/3368 KB   
636/3368 KB   
640/3368 KB   
644/3368 KB   
648/3368 KB   
652/3368 KB   
656/3368 KB   
660/3368 KB   
664/3368 KB   
668/3368 KB   
672/3368 KB   
676/3368 KB   
680/3368 KB   
684/3368 KB   
688/3368 KB   
692/3368 KB   
696/3368 KB   
700/3368 KB   
704/3368 KB   
708/3368 KB   
712/3368 KB   
716/3368 KB   
720/3368 KB   
724/3368 KB   
728/3368 KB   
732/3368 KB   
736/3368 KB   
740/3368 KB   
744/3368 KB   
748/3368 KB   
752/3368 KB   
756/3368 KB   
760/3368 KB   
764/3368 KB   
768/3368 KB   
772/3368 KB   
776/3368 KB   
780/3368 KB   
784/3368 KB   
788/3368 KB   
792/3368 KB   
796/3368 KB   
800/3368 KB   
804/3368 KB   
808/3368 KB   
812/3368 KB   
816/3368 KB   
820/3368 KB   
824/3368 KB   
828/3368 KB   
832/3368 KB   
836/3368 KB   
840/3368 KB   
844/3368 KB   
848/3368 KB   
852/3368 KB   
856/3368 KB   
860/3368 KB   
864/3368 KB   
868/3368 KB   
872/3368 KB   
876/3368 KB   
880/3368 KB   
884/3368 KB   
888/3368 KB   
892/3368 KB   
896/3368 KB   
900/3368 KB   
904/3368 KB   
908/3368 KB   
912/3368 KB   
916/3368 KB   
920/3368 KB   
924/3368 KB   
928/3368 KB   
932/3368 KB   
936/3368 KB   
940/3368 KB   
944/3368 KB   
948/3368 KB   
952/3368 KB   
956/3368 KB   
960/3368 KB   
964/3368 KB   
968/3368 KB   
972/3368 KB   
976/3368 KB   
980/3368 KB   
984/3368 KB   
988/3368 KB   
992/3368 KB   
996/3368 KB   
1000/3368 KB   
1004/3368 KB   
1008/3368 KB   
1012/3368 KB   
1016/3368 KB   
1020/3368 KB   
1024/3368 KB   
1028/3368 KB   
1032/3368 KB   
1036/3368 KB   
1040/3368 KB   
1044/3368 KB   
1048/3368 KB   
1052/3368 KB   
1056/3368 KB   
1060/3368 KB   
1064/3368 KB   
1068/3368 KB   
1072/3368 KB   
1076/3368 KB   
1080/3368 KB   
1084/3368 KB   
1088/3368 KB   
1092/3368 KB   
1096/3368 KB   
1100/3368 KB   
1104/3368 KB   
1108/3368 KB   
1112/3368 KB   
1116/3368 KB   
1120/3368 KB   
1124/3368 KB   
1128/3368 KB   
1132/3368 KB   
1136/3368 KB   
1140/3368 KB   
1144/3368 KB   
1148/3368 KB   
1152/3368 KB   
1156/3368 KB   
1160/3368 KB   
1164/3368 KB   
1168/3368 KB   
1172/3368 KB   
1176/3368 KB   
1180/3368 KB   
1184/3368 KB   
1188/3368 KB   
1192/3368 KB   
1196/3368 KB   
1200/3368 KB   
1204/3368 KB   
1208/3368 KB   
1212/3368 KB   
1216/3368 KB   
1220/3368 KB   
1224/3368 KB   
1228/3368 KB   
1232/3368 KB   
1236/3368 KB   
1240/3368 KB   
1244/3368 KB   
1248/3368 KB   
1252/3368 KB   
1256/3368 KB   
1260/3368 KB   
1264/3368 KB   
1268/3368 KB   
1272/3368 KB   
1276/3368 KB   
1280/3368 KB   
1284/3368 KB   
1288/3368 KB   
1292/3368 KB   
1296/3368 KB   
1300/3368 KB   
1304/3368 KB   
1308/3368 KB   
1312/3368 KB   
1316/3368 KB   
1320/3368 KB   
1324/3368 KB   
1328/3368 KB   
1332/3368 KB   
1336/3368 KB   
1340/3368 KB   
1344/3368 KB   
1348/3368 KB   
1352/3368 KB   
1356/3368 KB   
1360/3368 KB   
1364/3368 KB   
1368/3368 KB   
1372/3368 KB   
1376/3368 KB   
1380/3368 KB   
1384/3368 KB   
1388/3368 KB   
1392/3368 KB   
1396/3368 KB   
1400/3368 KB   
1404/3368 KB   
1408/3368 KB   
1412/3368 KB   
1416/3368 KB   
1420/3368 KB   
1424/3368 KB   
1428/3368 KB   
1432/3368 KB   
1436/3368 KB   
1440/3368 KB   
1444/3368 KB   
1448/3368 KB   
1452/3368 KB   
1456/3368 KB   
1460/3368 KB   
1464/3368 KB   
1468/3368 KB   
1472/3368 KB   
1476/3368 KB   
1480/3368 KB   
1484/3368 KB   
1488/3368 KB   
1492/3368 KB   
1496/3368 KB   
1500/3368 KB   
1504/3368 KB   
1508/3368 KB   
1512/3368 KB   
1516/3368 KB   
1520/3368 KB   
1524/3368 KB   
1528/3368 KB   
1532/3368 KB   
1536/3368 KB   
1540/3368 KB   
1544/3368 KB   
1548/3368 KB   
1552/3368 KB   
1556/3368 KB   
1560/3368 KB   
1564/3368 KB   
1568/3368 KB   
1572/3368 KB   
1576/3368 KB   
1580/3368 KB   
1584/3368 KB   
1588/3368 KB   
1592/3368 KB   
1596/3368 KB   
1600/3368 KB   
1604/3368 KB   
1608/3368 KB   
1612/3368 KB   
1616/3368 KB   
1620/3368 KB   
1624/3368 KB   
1628/3368 KB   
1632/3368 KB   
1636/3368 KB   
1640/3368 KB   
1644/3368 KB   
1648/3368 KB   
1652/3368 KB   
1656/3368 KB   
1660/3368 KB   
1664/3368 KB   
1668/3368 KB   
1672/3368 KB   
1676/3368 KB   
1680/3368 KB   
1684/3368 KB   
1688/3368 KB   
1692/3368 KB   
1696/3368 KB   
1700/3368 KB   
1704/3368 KB   
1708/3368 KB   
1712/3368 KB   
1716/3368 KB   
1720/3368 KB   
1724/3368 KB   
1728/3368 KB   
1732/3368 KB   
1736/3368 KB   
1740/3368 KB   
1744/3368 KB   
1748/3368 KB   
1752/3368 KB   
1756/3368 KB   
1760/3368 KB   
1764/3368 KB   
1768/3368 KB   
1772/3368 KB   
1776/3368 KB   
1780/3368 KB   
1784/3368 KB   
1788/3368 KB   
1792/3368 KB   
1796/3368 KB   
1800/3368 KB   
1804/3368 KB   
1808/3368 KB   
1812/3368 KB   
1816/3368 KB   
1820/3368 KB   
1824/3368 KB   
1828/3368 KB   
1832/3368 KB   
1836/3368 KB   
1840/3368 KB   
1844/3368 KB   
1848/3368 KB   
1852/3368 KB   
1856/3368 KB   
1860/3368 KB   
1864/3368 KB   
1868/3368 KB   
1872/3368 KB   
1876/3368 KB   
1880/3368 KB   
1884/3368 KB   
1888/3368 KB   
1892/3368 KB   
1896/3368 KB   
1900/3368 KB   
1904/3368 KB   
1908/3368 KB   
1912/3368 KB   
1916/3368 KB   
1920/3368 KB   
1924/3368 KB   
1928/3368 KB   
1932/3368 KB   
1936/3368 KB   
1940/3368 KB   
1944/3368 KB   
1948/3368 KB   
1952/3368 KB   
1956/3368 KB   
1960/3368 KB   
1964/3368 KB   
1968/3368 KB   
1972/3368 KB   
1976/3368 KB   
1980/3368 KB   
1984/3368 KB   
1988/3368 KB   
1992/3368 KB   
1996/3368 KB   
2000/3368 KB   
2004/3368 KB   
2008/3368 KB   
2012/3368 KB   
2016/3368 KB   
2020/3368 KB   
2024/3368 KB   
2028/3368 KB   
2032/3368 KB   
2036/3368 KB   
2040/3368 KB   
2044/3368 KB   
2048/3368 KB   
2052/3368 KB   
2056/3368 KB   
2060/3368 KB   
2064/3368 KB   
2068/3368 KB   
2072/3368 KB   
2076/3368 KB   
2080/3368 KB   
2084/3368 KB   
2088/3368 KB   
2092/3368 KB   
2096/3368 KB   
2100/3368 KB   
2104/3368 KB   
2108/3368 KB   
2112/3368 KB   
2116/3368 KB   
2120/3368 KB   
2124/3368 KB   
2128/3368 KB   
2132/3368 KB   
2136/3368 KB   
2140/3368 KB   
2144/3368 KB   
2148/3368 KB   
2152/3368 KB   
2156/3368 KB   
2160/3368 KB   
2164/3368 KB   
2168/3368 KB   
2172/3368 KB   
2176/3368 KB   
2180/3368 KB   
2184/3368 KB   
2188/3368 KB   
2192/3368 KB   
2196/3368 KB   
2200/3368 KB   
2204/3368 KB   
2208/3368 KB   
2212/3368 KB   
2216/3368 KB   
2220/3368 KB   
2224/3368 KB   
2228/3368 KB   
2232/3368 KB   
2236/3368 KB   
2240/3368 KB   
2244/3368 KB   
2248/3368 KB   
2252/3368 KB   
2256/3368 KB   
2260/3368 KB   
2264/3368 KB   
2268/3368 KB   
2272/3368 KB   
2276/3368 KB   
2280/3368 KB   
2284/3368 KB   
2288/3368 KB   
2292/3368 KB   
2296/3368 KB   
2300/3368 KB   
2304/3368 KB   
2308/3368 KB   
2312/3368 KB   
2316/3368 KB   
2320/3368 KB   
2324/3368 KB   
2328/3368 KB   
2332/3368 KB   
2336/3368 KB   
2340/3368 KB   
2344/3368 KB   
2348/3368 KB   
2352/3368 KB   
2356/3368 KB   
2360/3368 KB   
2364/3368 KB   
2368/3368 KB   
2372/3368 KB   
2376/3368 KB   
2380/3368 KB   
2384/3368 KB   
2388/3368 KB   
2392/3368 KB   
2396/3368 KB   
2400/3368 KB   
2404/3368 KB   
2408/3368 KB   
2412/3368 KB   
2416/3368 KB   
2420/3368 KB   
2424/3368 KB   
2428/3368 KB   
2432/3368 KB   
2436/3368 KB   
2440/3368 KB   
2444/3368 KB   
2448/3368 KB   
2452/3368 KB   
2456/3368 KB   
2460/3368 KB   
2464/3368 KB   
2468/3368 KB   
2472/3368 KB   
2476/3368 KB   
2480/3368 KB   
2484/3368 KB   
2488/3368 KB   
2492/3368 KB   
2496/3368 KB   
2500/3368 KB   
2504/3368 KB   
2508/3368 KB   
2512/3368 KB   
2516/3368 KB   
2520/3368 KB   
2524/3368 KB   
2528/3368 KB   
2532/3368 KB   
2536/3368 KB   
2540/3368 KB   
2544/3368 KB   
2548/3368 KB   
2552/3368 KB   
2556/3368 KB   
2560/3368 KB   
2564/3368 KB   
2568/3368 KB   
2572/3368 KB   
2576/3368 KB   
2580/3368 KB   
2584/3368 KB   
2588/3368 KB   
2592/3368 KB   
2596/3368 KB   
2600/3368 KB   
2604/3368 KB   
2608/3368 KB   
2612/3368 KB   
2616/3368 KB   
2620/3368 KB   
2624/3368 KB   
2628/3368 KB   
2632/3368 KB   
2636/3368 KB   
2640/3368 KB   
2644/3368 KB   
2648/3368 KB   
2652/3368 KB   
2656/3368 KB   
2660/3368 KB   
2664/3368 KB   
2668/3368 KB   
2672/3368 KB   
2676/3368 KB   
2680/3368 KB   
2684/3368 KB   
2688/3368 KB   
2692/3368 KB   
2696/3368 KB   
2700/3368 KB   
2704/3368 KB   
2708/3368 KB   
2712/3368 KB   
2716/3368 KB   
2720/3368 KB   
2724/3368 KB   
2728/3368 KB   
2732/3368 KB   
2736/3368 KB   
2740/3368 KB   
2744/3368 KB   
2748/3368 KB   
2752/3368 KB   
2756/3368 KB   
2760/3368 KB   
2764/3368 KB   
2768/3368 KB   
2772/3368 KB   
2776/3368 KB   
2780/3368 KB   
2784/3368 KB   
2788/3368 KB   
2792/3368 KB   
2796/3368 KB   
2800/3368 KB   
2804/3368 KB   
2808/3368 KB   
2812/3368 KB   
2816/3368 KB   
2820/3368 KB   
2824/3368 KB   
2828/3368 KB   
2832/3368 KB   
2836/3368 KB   
2840/3368 KB   
2844/3368 KB   
2848/3368 KB   
2852/3368 KB   
2856/3368 KB   
2860/3368 KB   
2864/3368 KB   
2868/3368 KB   
2872/3368 KB   
2876/3368 KB   
2880/3368 KB   
2884/3368 KB   
2888/3368 KB   
2892/3368 KB   
2896/3368 KB   
2900/3368 KB   
2904/3368 KB   
2908/3368 KB   
2912/3368 KB   
2916/3368 KB   
2920/3368 KB   
2924/3368 KB   
2928/3368 KB   
2932/3368 KB   
2936/3368 KB   
2940/3368 KB   
2944/3368 KB   
2948/3368 KB   
2952/3368 KB   
2956/3368 KB   
2960/3368 KB   
2964/3368 KB   
2968/3368 KB   
2972/3368 KB   
2976/3368 KB   
2980/3368 KB   
2984/3368 KB   
2988/3368 KB   
2992/3368 KB   
2996/3368 KB   
3000/3368 KB   
3004/3368 KB   
3008/3368 KB   
3012/3368 KB   
3016/3368 KB   
3020/3368 KB   
3024/3368 KB   
3028/3368 KB   
3032/3368 KB   
3036/3368 KB   
3040/3368 KB   
3044/3368 KB   
3048/3368 KB   
3052/3368 KB   
3056/3368 KB   
3060/3368 KB   
3064/3368 KB   
3068/3368 KB   
3072/3368 KB   
3076/3368 KB   
3080/3368 KB   
3084/3368 KB   
3088/3368 KB   
3092/3368 KB   
3096/3368 KB   
3100/3368 KB   
3104/3368 KB   
3108/3368 KB   
3112/3368 KB   
3116/3368 KB   
3120/3368 KB   
3124/3368 KB   
3128/3368 KB   
3132/3368 KB   
3136/3368 KB   
3140/3368 KB   
3144/3368 KB   
3148/3368 KB   
3152/3368 KB   
3156/3368 KB   
3160/3368 KB   
3164/3368 KB   
3168/3368 KB   
3172/3368 KB   
3176/3368 KB   
3180/3368 KB   
3184/3368 KB   
3188/3368 KB   
3192/3368 KB   
3196/3368 KB   
3200/3368 KB   
3204/3368 KB   
3208/3368 KB   
3212/3368 KB   
3216/3368 KB   
3220/3368 KB   
3224/3368 KB   
3228/3368 KB   
3232/3368 KB   
3236/3368 KB   
3240/3368 KB   
3244/3368 KB   
3248/3368 KB   
3252/3368 KB   
3256/3368 KB   
3260/3368 KB   
3264/3368 KB   
3268/3368 KB   
3272/3368 KB   
3276/3368 KB   
3280/3368 KB   
3284/3368 KB   
3288/3368 KB   
3292/3368 KB   
3296/3368 KB   
3300/3368 KB   
3304/3368 KB   
3308/3368 KB   
3312/3368 KB   
3316/3368 KB   
3320/3368 KB   
3324/3368 KB   
3328/3368 KB   
3332/3368 KB   
3336/3368 KB   
3340/3368 KB   
3344/3368 KB   
3348/3368 KB   
3352/3368 KB   
3356/3368 KB   
3360/3368 KB   
3364/3368 KB   
3368/3368 KB   
3368/3368 KB   
               
Downloaded: http://oss.sonatype.org/content/repositories/snapshots/org/bdgenomics/adam/adam-core-spark2_2.11/0.23.0-SNAPSHOT/adam-core-spark2_2.11-0.23.0-20171231.123946-617.jar (3368 KB at 2980.5 KB/sec)
[INFO] 
[INFO] --- maven-enforcer-plugin:1.0:enforce (enforce-maven) @ avocado-core-spark2_2.11 ---
[INFO] 
[INFO] --- build-helper-maven-plugin:1.10:add-source (add-source) @ avocado-core-spark2_2.11 ---
[INFO] Source directory: /home/jenkins/workspace/avocado/HADOOP_VERSION/2.6.0/SCALAVER/2.11/SPARK_VERSION/2.0.0/label/centos/avocado-core/src/main/scala added.
[INFO] 
[INFO] --- scalariform-maven-plugin:0.1.4:format (default-cli) @ avocado-core-spark2_2.11 ---
[INFO] Modified 0 of 47 .scala files
[INFO] 
[INFO] --- maven-resources-plugin:2.6:resources (default-resources) @ avocado-core-spark2_2.11 ---
[INFO] Using 'UTF-8' encoding to copy filtered resources.
[INFO] skip non existing resourceDirectory /home/jenkins/workspace/avocado/HADOOP_VERSION/2.6.0/SCALAVER/2.11/SPARK_VERSION/2.0.0/label/centos/avocado-core/src/main/resources
[INFO] 
[INFO] --- scala-maven-plugin:3.2.2:compile (scala-compile-first) @ avocado-core-spark2_2.11 ---
[WARNING]  Expected all dependencies to require Scala version: 2.11.4
[WARNING]  org.bdgenomics.utils:utils-misc-spark2_2.11:0.2.11 requires scala version: 2.11.4
[WARNING]  org.bdgenomics.utils:utils-metrics-spark2_2.11:0.2.11 requires scala version: 2.11.4
[WARNING]  org.bdgenomics.utils:utils-serialization-spark2_2.11:0.2.11 requires scala version: 2.11.4
[WARNING]  org.bdgenomics.utils:utils-misc-spark2_2.11:0.2.11 requires scala version: 2.11.4
[WARNING]  org.bdgenomics.utils:utils-io-spark2_2.11:0.2.13 requires scala version: 2.11.8
[WARNING] Multiple versions of scala libraries detected!
[INFO] /home/jenkins/workspace/avocado/HADOOP_VERSION/2.6.0/SCALAVER/2.11/SPARK_VERSION/2.0.0/label/centos/avocado-core/src/main/scala:-1: info: compiling
[INFO] Compiling 25 source files to /home/jenkins/workspace/avocado/HADOOP_VERSION/2.6.0/SCALAVER/2.11/SPARK_VERSION/2.0.0/label/centos/avocado-core/target/scala-2.11.4/classes at 1514724114676
[WARNING] warning: there were three deprecation warnings; re-run with -deprecation for details
[WARNING] one warning found
[INFO] prepare-compile in 0 s
[INFO] compile in 12 s
[INFO] 
[INFO] --- maven-compiler-plugin:3.5.1:compile (default-compile) @ avocado-core-spark2_2.11 ---
[INFO] Nothing to compile - all classes are up to date
[INFO] 
[INFO] --- build-helper-maven-plugin:1.10:add-test-source (add-test-source) @ avocado-core-spark2_2.11 ---
[INFO] Test Source directory: /home/jenkins/workspace/avocado/HADOOP_VERSION/2.6.0/SCALAVER/2.11/SPARK_VERSION/2.0.0/label/centos/avocado-core/src/test/scala added.
[INFO] 
[INFO] --- maven-resources-plugin:2.6:testResources (default-testResources) @ avocado-core-spark2_2.11 ---
[INFO] Using 'UTF-8' encoding to copy filtered resources.
[INFO] Copying 26 resources
[INFO] 
[INFO] --- scala-maven-plugin:3.2.2:testCompile (scala-test-compile-first) @ avocado-core-spark2_2.11 ---
[WARNING]  Expected all dependencies to require Scala version: 2.11.4
[WARNING]  org.bdgenomics.utils:utils-misc-spark2_2.11:0.2.11 requires scala version: 2.11.4
[WARNING]  org.bdgenomics.utils:utils-metrics-spark2_2.11:0.2.11 requires scala version: 2.11.4
[WARNING]  org.bdgenomics.utils:utils-serialization-spark2_2.11:0.2.11 requires scala version: 2.11.4
[WARNING]  org.bdgenomics.utils:utils-misc-spark2_2.11:0.2.11 requires scala version: 2.11.4
[WARNING]  org.bdgenomics.utils:utils-io-spark2_2.11:0.2.13 requires scala version: 2.11.8
[WARNING] Multiple versions of scala libraries detected!
[INFO] /home/jenkins/workspace/avocado/HADOOP_VERSION/2.6.0/SCALAVER/2.11/SPARK_VERSION/2.0.0/label/centos/avocado-core/src/test/scala:-1: info: compiling
[INFO] Compiling 22 source files to /home/jenkins/workspace/avocado/HADOOP_VERSION/2.6.0/SCALAVER/2.11/SPARK_VERSION/2.0.0/label/centos/avocado-core/target/scala-2.11.4/test-classes at 1514724127365
[ERROR] error: java.lang.NullPointerException
[ERROR] 	at scala.tools.nsc.symtab.classfile.ClassfileParser.scala$tools$nsc$symtab$classfile$ClassfileParser$$handleError(ClassfileParser.scala:104)
[ERROR] 	at scala.tools.nsc.symtab.classfile.ClassfileParser$$anonfun$scala$tools$nsc$symtab$classfile$ClassfileParser$$parseErrorHandler$1.applyOrElse(ClassfileParser.scala:112)
[ERROR] 	at scala.tools.nsc.symtab.classfile.ClassfileParser$$anonfun$scala$tools$nsc$symtab$classfile$ClassfileParser$$parseErrorHandler$1.applyOrElse(ClassfileParser.scala:110)
[ERROR] 	at scala.runtime.AbstractPartialFunction.apply(AbstractPartialFunction.scala:36)
[ERROR] 	at scala.tools.nsc.symtab.classfile.ClassfileParser.parse(ClassfileParser.scala:134)
[ERROR] 	at scala.tools.nsc.symtab.SymbolLoaders$ClassfileLoader$$anonfun$doComplete$2.apply$mcV$sp(SymbolLoaders.scala:309)
[ERROR] 	at scala.tools.nsc.symtab.SymbolLoaders$ClassfileLoader$$anonfun$doComplete$2.apply(SymbolLoaders.scala:309)
[ERROR] 	at scala.tools.nsc.symtab.SymbolLoaders$ClassfileLoader$$anonfun$doComplete$2.apply(SymbolLoaders.scala:309)
[ERROR] 	at scala.reflect.internal.SymbolTable.enteringPhase(SymbolTable.scala:235)
[ERROR] 	at scala.tools.nsc.symtab.SymbolLoaders$ClassfileLoader.doComplete(SymbolLoaders.scala:309)
[ERROR] 	at scala.tools.nsc.symtab.SymbolLoaders$SymbolLoader.complete(SymbolLoaders.scala:211)
[ERROR] 	at scala.tools.nsc.symtab.SymbolLoaders$SymbolLoader.load(SymbolLoaders.scala:227)
[ERROR] 	at scala.reflect.internal.Symbols$Symbol.typeParams(Symbols.scala:1702)
[ERROR] 	at scala.tools.nsc.transform.SpecializeTypes.specializedTypeVars(SpecializeTypes.scala:440)
[ERROR] 	at scala.tools.nsc.transform.SpecializeTypes.loop$2(SpecializeTypes.scala:414)
[ERROR] 	at scala.tools.nsc.transform.SpecializeTypes.specializedTypeVars(SpecializeTypes.scala:416)
[ERROR] 	at scala.tools.nsc.transform.SpecializeTypes.specializedTypeVars(SpecializeTypes.scala:445)
[ERROR] 	at scala.tools.nsc.transform.SpecializeTypes.loop$2(SpecializeTypes.scala:414)
[ERROR] 	at scala.tools.nsc.transform.SpecializeTypes.specializedTypeVars(SpecializeTypes.scala:416)
[ERROR] 	at scala.tools.nsc.transform.SpecializeTypes.specializedTypeVars(SpecializeTypes.scala:442)
[ERROR] 	at scala.tools.nsc.transform.SpecializeTypes.scala$tools$nsc$transform$SpecializeTypes$$normalizeMember(SpecializeTypes.scala:823)
[ERROR] 	at scala.tools.nsc.transform.SpecializeTypes$$anonfun$23.apply(SpecializeTypes.scala:768)
[ERROR] 	at scala.tools.nsc.transform.SpecializeTypes$$anonfun$23.apply(SpecializeTypes.scala:766)
[ERROR] 	at scala.collection.immutable.List.flatMap(List.scala:327)
[ERROR] 	at scala.tools.nsc.transform.SpecializeTypes.specializeClass(SpecializeTypes.scala:766)
[ERROR] 	at scala.tools.nsc.transform.SpecializeTypes.transformInfo(SpecializeTypes.scala:1187)
[ERROR] 	at scala.tools.nsc.transform.InfoTransform$Phase$$anon$1.transform(InfoTransform.scala:38)
[ERROR] 	at scala.reflect.internal.Symbols$Symbol.rawInfo(Symbols.scala:1571)
[ERROR] 	at scala.reflect.internal.Symbols$Symbol.info(Symbols.scala:1491)
[ERROR] 	at scala.reflect.internal.Types$TypeRef.thisInfo(Types.scala:2194)
[ERROR] 	at scala.reflect.internal.Types$TypeRef.baseClasses(Types.scala:2199)
[ERROR] 	at scala.reflect.internal.Types$class.computeBaseClasses(Types.scala:1439)
[ERROR] 	at scala.reflect.internal.SymbolTable.computeBaseClasses(SymbolTable.scala:16)
[ERROR] 	at scala.reflect.internal.Types$$anonfun$defineBaseClassesOfCompoundType$1.apply(Types.scala:1560)
[ERROR] 	at scala.reflect.internal.Types$$anonfun$defineBaseClassesOfCompoundType$1.apply(Types.scala:1560)
[ERROR] 	at scala.reflect.internal.Types$CompoundType.memo(Types.scala:1393)
[ERROR] 	at scala.reflect.internal.Types$class.defineBaseClassesOfCompoundType(Types.scala:1560)
[ERROR] 	at scala.reflect.internal.Types$class.define$1(Types.scala:1527)
[ERROR] 	at scala.reflect.internal.Types$class.defineBaseClassesOfCompoundType(Types.scala:1528)
[ERROR] 	at scala.reflect.internal.SymbolTable.defineBaseClassesOfCompoundType(SymbolTable.scala:16)
[ERROR] 	at scala.reflect.internal.Types$CompoundType.baseClasses(Types.scala:1370)
[ERROR] 	at scala.reflect.internal.Types$$anonfun$defineBaseClassesOfCompoundType$2.apply(Types.scala:1560)
[ERROR] 	at scala.reflect.internal.Types$$anonfun$defineBaseClassesOfCompoundType$2.apply(Types.scala:1560)
[ERROR] 	at scala.reflect.internal.Types$CompoundType.memo(Types.scala:1393)
[ERROR] 	at scala.reflect.internal.Types$class.defineBaseClassesOfCompoundType(Types.scala:1560)
[ERROR] 	at scala.reflect.internal.Types$class.define$1(Types.scala:1527)
[ERROR] 	at scala.reflect.internal.Types$class.defineBaseClassesOfCompoundType(Types.scala:1528)
[ERROR] 	at scala.reflect.internal.SymbolTable.defineBaseClassesOfCompoundType(SymbolTable.scala:16)
[ERROR] 	at scala.reflect.internal.Types$CompoundType.baseClasses(Types.scala:1370)
[ERROR] 	at scala.reflect.internal.Types$PolyType.baseClasses(Types.scala:2509)
[ERROR] 	at scala.reflect.internal.Types$TypeRef.baseClasses(Types.scala:2199)
[ERROR] 	at scala.reflect.internal.Types$class.computeBaseClasses(Types.scala:1425)
[ERROR] 	at scala.reflect.internal.SymbolTable.computeBaseClasses(SymbolTable.scala:16)
[ERROR] 	at scala.reflect.internal.Types$$anonfun$defineBaseClassesOfCompoundType$1.apply(Types.scala:1560)
[ERROR] 	at scala.reflect.internal.Types$$anonfun$defineBaseClassesOfCompoundType$1.apply(Types.scala:1560)
[ERROR] 	at scala.reflect.internal.Types$CompoundType.memo(Types.scala:1393)
[ERROR] 	at scala.reflect.internal.Types$class.defineBaseClassesOfCompoundType(Types.scala:1560)
[ERROR] 	at scala.reflect.internal.Types$class.define$1(Types.scala:1527)
[ERROR] 	at scala.reflect.internal.Types$class.defineBaseClassesOfCompoundType(Types.scala:1528)
[ERROR] 	at scala.reflect.internal.SymbolTable.defineBaseClassesOfCompoundType(SymbolTable.scala:16)
[ERROR] 	at scala.reflect.internal.Types$CompoundType.baseClasses(Types.scala:1370)
[ERROR] 	at scala.reflect.internal.Types$$anonfun$defineBaseClassesOfCompoundType$2.apply(Types.scala:1560)
[ERROR] 	at scala.reflect.internal.Types$$anonfun$defineBaseClassesOfCompoundType$2.apply(Types.scala:1560)
[ERROR] 	at scala.reflect.internal.Types$CompoundType.memo(Types.scala:1393)
[ERROR] 	at scala.reflect.internal.Types$class.defineBaseClassesOfCompoundType(Types.scala:1560)
[ERROR] 	at scala.reflect.internal.Types$class.define$1(Types.scala:1527)
[ERROR] 	at scala.reflect.internal.Types$class.defineBaseClassesOfCompoundType(Types.scala:1528)
[ERROR] 	at scala.reflect.internal.SymbolTable.defineBaseClassesOfCompoundType(SymbolTable.scala:16)
[ERROR] 	at scala.reflect.internal.Types$CompoundType.baseClasses(Types.scala:1370)
[ERROR] 	at scala.reflect.internal.Symbols$Symbol.ancestors(Symbols.scala:2094)
[ERROR] 	at scala.reflect.internal.Symbols$Symbol.mixinClasses(Symbols.scala:2090)
[ERROR] 	at scala.tools.nsc.transform.ExplicitOuter.transformInfo(ExplicitOuter.scala:184)
[ERROR] 	at scala.tools.nsc.transform.InfoTransform$Phase$$anon$1.transform(InfoTransform.scala:38)
[ERROR] 	at scala.reflect.internal.Symbols$Symbol.rawInfo(Symbols.scala:1571)
[ERROR] 	at scala.reflect.internal.Symbols$Symbol.info(Symbols.scala:1491)
[ERROR] 	at scala.reflect.internal.Types$ClassTypeRef$class.baseType(Types.scala:1968)
[ERROR] 	at scala.reflect.internal.Types$ClassNoArgsTypeRef.baseType(Types.scala:2331)
[ERROR] 	at scala.reflect.internal.Types$SimpleTypeProxy$class.baseType(Types.scala:162)
[ERROR] 	at scala.reflect.internal.Types$SingletonType.baseType(Types.scala:1076)
[ERROR] 	at scala.reflect.internal.tpe.TypeMaps$AsSeenFromMap.loop$4(TypeMaps.scala:647)
[ERROR] 	at scala.reflect.internal.tpe.TypeMaps$AsSeenFromMap.thisTypeAsSeen(TypeMaps.scala:653)
[ERROR] 	at scala.reflect.internal.tpe.TypeMaps$AsSeenFromMap.apply(TypeMaps.scala:464)
[ERROR] 	at scala.reflect.internal.tpe.TypeMaps$TypeMap.mapOver(TypeMaps.scala:110)
[ERROR] 	at scala.reflect.internal.tpe.TypeMaps$AsSeenFromMap.apply(TypeMaps.scala:468)
[ERROR] 	at scala.reflect.internal.tpe.TypeMaps$TypeMap.mapOver(TypeMaps.scala:129)
[ERROR] 	at scala.reflect.internal.tpe.TypeMaps$AsSeenFromMap.apply(TypeMaps.scala:468)
[ERROR] 	at scala.reflect.internal.Types$Type.asSeenFrom(Types.scala:663)
[ERROR] 	at scala.reflect.internal.Types$Type.computeMemberType(Types.scala:698)
[ERROR] 	at scala.reflect.internal.Symbols$MethodSymbol.typeAsMemberOf(Symbols.scala:2907)
[ERROR] 	at scala.reflect.internal.Types$Type.memberType(Types.scala:689)
[ERROR] 	at scala.reflect.internal.Types$class.defineUnderlyingOfSingleType(Types.scala:1260)
[ERROR] 	at scala.reflect.internal.SymbolTable.defineUnderlyingOfSingleType(SymbolTable.scala:16)
[ERROR] 	at scala.reflect.internal.Types$SingleType.underlying(Types.scala:1214)
[ERROR] 	at scala.reflect.internal.Types$SingletonType.widen(Types.scala:1079)
[ERROR] 	at scala.tools.nsc.transform.ExplicitOuter$ExplicitOuterTransformer.transform(ExplicitOuter.scala:453)
[ERROR] 	at scala.tools.nsc.transform.ExplicitOuter$ExplicitOuterTransformer.transform(ExplicitOuter.scala:352)
[ERROR] 	at scala.reflect.internal.Trees$class.itransform(Trees.scala:1340)
[ERROR] 	at scala.reflect.internal.SymbolTable.itransform(SymbolTable.scala:16)
[ERROR] 	at scala.reflect.internal.SymbolTable.itransform(SymbolTable.scala:16)
[ERROR] 	at scala.reflect.api.Trees$Transformer.transform(Trees.scala:2555)
[ERROR] 	at scala.tools.nsc.transform.TypingTransformers$TypingTransformer.transform(TypingTransformers.scala:44)
[ERROR] 	at scala.tools.nsc.transform.ExplicitOuter$OuterPathTransformer.scala$reflect$internal$Trees$UnderConstructionTransformer$$super$transform(ExplicitOuter.scala:219)
[ERROR] 	at scala.reflect.internal.Trees$UnderConstructionTransformer$class.transform(Trees.scala:1680)
[ERROR] 	at scala.tools.nsc.transform.ExplicitOuter$OuterPathTransformer.transform(ExplicitOuter.scala:291)
[ERROR] 	at scala.tools.nsc.transform.ExplicitOuter$ExplicitOuterTransformer.transform(ExplicitOuter.scala:496)
[ERROR] 	at scala.tools.nsc.transform.ExplicitOuter$ExplicitOuterTransformer.transform(ExplicitOuter.scala:352)
[ERROR] 	at scala.reflect.api.Trees$Transformer$$anonfun$transformTrees$1.apply(Trees.scala:2559)
[ERROR] 	at scala.reflect.api.Trees$Transformer$$anonfun$transformTrees$1.apply(Trees.scala:2559)
[ERROR] 	at scala.collection.immutable.List.loop$1(List.scala:172)
[ERROR] 	at scala.collection.immutable.List.mapConserve(List.scala:188)
[ERROR] 	at scala.reflect.api.Trees$Transformer.transformTrees(Trees.scala:2559)
[ERROR] 	at scala.reflect.internal.Trees$class.itransform(Trees.scala:1340)
[ERROR] 	at scala.reflect.internal.SymbolTable.itransform(SymbolTable.scala:16)
[ERROR] 	at scala.reflect.internal.SymbolTable.itransform(SymbolTable.scala:16)
[ERROR] 	at scala.reflect.api.Trees$Transformer.transform(Trees.scala:2555)
[ERROR] 	at scala.tools.nsc.transform.TypingTransformers$TypingTransformer.transform(TypingTransformers.scala:44)
[ERROR] 	at scala.tools.nsc.transform.ExplicitOuter$OuterPathTransformer.scala$reflect$internal$Trees$UnderConstructionTransformer$$super$transform(ExplicitOuter.scala:219)
[ERROR] 	at scala.reflect.internal.Trees$UnderConstructionTransformer$class.transform(Trees.scala:1680)
[ERROR] 	at scala.tools.nsc.transform.ExplicitOuter$OuterPathTransformer.transform(ExplicitOuter.scala:291)
[ERROR] 	at scala.tools.nsc.transform.ExplicitOuter$ExplicitOuterTransformer.transform(ExplicitOuter.scala:496)
[ERROR] 	at scala.tools.nsc.transform.ExplicitOuter$ExplicitOuterTransformer.transform(ExplicitOuter.scala:352)
[ERROR] 	at scala.reflect.internal.Trees$$anonfun$itransform$1.apply(Trees.scala:1350)
[ERROR] 	at scala.reflect.internal.Trees$$anonfun$itransform$1.apply(Trees.scala:1349)
[ERROR] 	at scala.reflect.api.Trees$Transformer.atOwner(Trees.scala:2600)
[ERROR] 	at scala.tools.nsc.transform.TypingTransformers$TypingTransformer.atOwner(TypingTransformers.scala:30)
[ERROR] 	at scala.tools.nsc.transform.TypingTransformers$TypingTransformer.atOwner(TypingTransformers.scala:25)
[ERROR] 	at scala.tools.nsc.transform.TypingTransformers$TypingTransformer.atOwner(TypingTransformers.scala:17)
[ERROR] 	at scala.reflect.internal.Trees$class.itransform(Trees.scala:1348)
[ERROR] 	at scala.reflect.internal.SymbolTable.itransform(SymbolTable.scala:16)
[ERROR] 	at scala.reflect.internal.SymbolTable.itransform(SymbolTable.scala:16)
[ERROR] 	at scala.reflect.api.Trees$Transformer.transform(Trees.scala:2555)
[ERROR] 	at scala.tools.nsc.transform.TypingTransformers$TypingTransformer.transform(TypingTransformers.scala:44)
[ERROR] 	at scala.tools.nsc.transform.ExplicitOuter$OuterPathTransformer.scala$reflect$internal$Trees$UnderConstructionTransformer$$super$transform(ExplicitOuter.scala:219)
[ERROR] 	at scala.reflect.internal.Trees$UnderConstructionTransformer$class.transform(Trees.scala:1680)
[ERROR] 	at scala.tools.nsc.transform.ExplicitOuter$OuterPathTransformer.transform(ExplicitOuter.scala:291)
[ERROR] 	at scala.tools.nsc.transform.ExplicitOuter$ExplicitOuterTransformer.transform(ExplicitOuter.scala:496)
[ERROR] 	at scala.tools.nsc.transform.ExplicitOuter$ExplicitOuterTransformer.transform(ExplicitOuter.scala:352)
[ERROR] 	at scala.reflect.api.Trees$Transformer$$anonfun$transformStats$1.apply(Trees.scala:2589)
[ERROR] 	at scala.reflect.api.Trees$Transformer$$anonfun$transformStats$1.apply(Trees.scala:2587)
[ERROR] 	at scala.collection.immutable.List.loop$1(List.scala:172)
[ERROR] 	at scala.collection.immutable.List.mapConserve(List.scala:188)
[ERROR] 	at scala.reflect.api.Trees$Transformer.transformStats(Trees.scala:2587)
[ERROR] 	at scala.reflect.internal.Trees$class.itransform(Trees.scala:1359)
[ERROR] 	at scala.reflect.internal.SymbolTable.itransform(SymbolTable.scala:16)
[ERROR] 	at scala.reflect.internal.SymbolTable.itransform(SymbolTable.scala:16)
[ERROR] 	at scala.reflect.api.Trees$Transformer.transform(Trees.scala:2555)
[ERROR] 	at scala.tools.nsc.transform.TypingTransformers$TypingTransformer.transform(TypingTransformers.scala:44)
[ERROR] 	at scala.tools.nsc.transform.ExplicitOuter$OuterPathTransformer.scala$reflect$internal$Trees$UnderConstructionTransformer$$super$transform(ExplicitOuter.scala:219)
[ERROR] 	at scala.reflect.internal.Trees$UnderConstructionTransformer$class.transform(Trees.scala:1680)
[ERROR] 	at scala.tools.nsc.transform.ExplicitOuter$OuterPathTransformer.transform(ExplicitOuter.scala:291)
[ERROR] 	at scala.tools.nsc.transform.ExplicitOuter$ExplicitOuterTransformer.transform(ExplicitOuter.scala:496)
[ERROR] 	at scala.tools.nsc.transform.ExplicitOuter$ExplicitOuterTransformer.transform(ExplicitOuter.scala:352)
[ERROR] 	at scala.reflect.internal.Trees$$anonfun$itransform$1.apply(Trees.scala:1350)
[ERROR] 	at scala.reflect.internal.Trees$$anonfun$itransform$1.apply(Trees.scala:1349)
[ERROR] 	at scala.reflect.api.Trees$Transformer.atOwner(Trees.scala:2600)
[ERROR] 	at scala.tools.nsc.transform.TypingTransformers$TypingTransformer.atOwner(TypingTransformers.scala:30)
[ERROR] 	at scala.tools.nsc.transform.TypingTransformers$TypingTransformer.atOwner(TypingTransformers.scala:25)
[ERROR] 	at scala.tools.nsc.transform.TypingTransformers$TypingTransformer.atOwner(TypingTransformers.scala:17)
[ERROR] 	at scala.reflect.internal.Trees$class.itransform(Trees.scala:1348)
[ERROR] 	at scala.reflect.internal.SymbolTable.itransform(SymbolTable.scala:16)
[ERROR] 	at scala.reflect.internal.SymbolTable.itransform(SymbolTable.scala:16)
[ERROR] 	at scala.reflect.api.Trees$Transformer.transform(Trees.scala:2555)
[ERROR] 	at scala.tools.nsc.transform.TypingTransformers$TypingTransformer.transform(TypingTransformers.scala:44)
[ERROR] 	at scala.tools.nsc.transform.ExplicitOuter$OuterPathTransformer.scala$reflect$internal$Trees$UnderConstructionTransformer$$super$transform(ExplicitOuter.scala:219)
[ERROR] 	at scala.reflect.internal.Trees$UnderConstructionTransformer$class.transform(Trees.scala:1680)
[ERROR] 	at scala.tools.nsc.transform.ExplicitOuter$OuterPathTransformer.transform(ExplicitOuter.scala:291)
[ERROR] 	at scala.tools.nsc.transform.ExplicitOuter$ExplicitOuterTransformer.transform(ExplicitOuter.scala:496)
[ERROR] 	at scala.tools.nsc.transform.ExplicitOuter$ExplicitOuterTransformer.transform(ExplicitOuter.scala:352)
[ERROR] 	at scala.reflect.api.Trees$Transformer$$anonfun$transformStats$1.apply(Trees.scala:2589)
[ERROR] 	at scala.reflect.api.Trees$Transformer$$anonfun$transformStats$1.apply(Trees.scala:2587)
[ERROR] 	at scala.collection.immutable.List.loop$1(List.scala:172)
[ERROR] 	at scala.collection.immutable.List.mapConserve(List.scala:188)
[ERROR] 	at scala.reflect.api.Trees$Transformer.transformStats(Trees.scala:2587)
[ERROR] 	at scala.reflect.internal.Trees$class.itransform(Trees.scala:1359)
[ERROR] 	at scala.reflect.internal.SymbolTable.itransform(SymbolTable.scala:16)
[ERROR] 	at scala.reflect.internal.SymbolTable.itransform(SymbolTable.scala:16)
[ERROR] 	at scala.reflect.api.Trees$Transformer.transform(Trees.scala:2555)
[ERROR] 	at scala.tools.nsc.transform.TypingTransformers$TypingTransformer.transform(TypingTransformers.scala:44)
[ERROR] 	at scala.tools.nsc.transform.ExplicitOuter$OuterPathTransformer.scala$reflect$internal$Trees$UnderConstructionTransformer$$super$transform(ExplicitOuter.scala:219)
[ERROR] 	at scala.reflect.internal.Trees$UnderConstructionTransformer$class.transform(Trees.scala:1680)
[ERROR] 	at scala.tools.nsc.transform.ExplicitOuter$OuterPathTransformer.transform(ExplicitOuter.scala:291)
[ERROR] 	at scala.tools.nsc.transform.ExplicitOuter$ExplicitOuterTransformer.transform(ExplicitOuter.scala:496)
[ERROR] 	at scala.tools.nsc.transform.ExplicitOuter$ExplicitOuterTransformer.transform(ExplicitOuter.scala:352)
[ERROR] 	at scala.reflect.api.Trees$Transformer$$anonfun$transformStats$1.apply(Trees.scala:2589)
[ERROR] 	at scala.reflect.api.Trees$Transformer$$anonfun$transformStats$1.apply(Trees.scala:2587)
[ERROR] 	at scala.collection.immutable.List.loop$1(List.scala:172)
[ERROR] 	at scala.collection.immutable.List.mapConserve(List.scala:188)
[ERROR] 	at scala.reflect.api.Trees$Transformer.transformStats(Trees.scala:2587)
[ERROR] 	at scala.reflect.internal.Trees$class.itransform(Trees.scala:1359)
[ERROR] 	at scala.reflect.internal.SymbolTable.itransform(SymbolTable.scala:16)
[ERROR] 	at scala.reflect.internal.SymbolTable.itransform(SymbolTable.scala:16)
[ERROR] 	at scala.reflect.api.Trees$Transformer.transform(Trees.scala:2555)
[ERROR] 	at scala.tools.nsc.transform.TypingTransformers$TypingTransformer.transform(TypingTransformers.scala:44)
[ERROR] 	at scala.tools.nsc.transform.ExplicitOuter$OuterPathTransformer.scala$reflect$internal$Trees$UnderConstructionTransformer$$super$transform(ExplicitOuter.scala:219)
[ERROR] 	at scala.reflect.internal.Trees$UnderConstructionTransformer$class.transform(Trees.scala:1680)
[ERROR] 	at scala.tools.nsc.transform.ExplicitOuter$OuterPathTransformer.transform(ExplicitOuter.scala:291)
[ERROR] 	at scala.tools.nsc.transform.ExplicitOuter$ExplicitOuterTransformer.transform(ExplicitOuter.scala:496)
[ERROR] 	at scala.tools.nsc.transform.ExplicitOuter$ExplicitOuterTransformer.transform(ExplicitOuter.scala:352)
[ERROR] 	at scala.reflect.internal.Trees$$anonfun$itransform$2.apply(Trees.scala:1356)
[ERROR] 	at scala.reflect.internal.Trees$$anonfun$itransform$2.apply(Trees.scala:1354)
[ERROR] 	at scala.reflect.api.Trees$Transformer.atOwner(Trees.scala:2600)
[ERROR] 	at scala.tools.nsc.transform.TypingTransformers$TypingTransformer.atOwner(TypingTransformers.scala:30)
[ERROR] 	at scala.tools.nsc.transform.TypingTransformers$TypingTransformer.atOwner(TypingTransformers.scala:25)
[ERROR] 	at scala.tools.nsc.transform.TypingTransformers$TypingTransformer.atOwner(TypingTransformers.scala:17)
[ERROR] 	at scala.reflect.internal.Trees$class.itransform(Trees.scala:1353)
[ERROR] 	at scala.reflect.internal.SymbolTable.itransform(SymbolTable.scala:16)
[ERROR] 	at scala.reflect.internal.SymbolTable.itransform(SymbolTable.scala:16)
[ERROR] 	at scala.reflect.api.Trees$Transformer.transform(Trees.scala:2555)
[ERROR] 	at scala.tools.nsc.transform.TypingTransformers$TypingTransformer.transform(TypingTransformers.scala:44)
[ERROR] 	at scala.tools.nsc.transform.ExplicitOuter$OuterPathTransformer.scala$reflect$internal$Trees$UnderConstructionTransformer$$super$transform(ExplicitOuter.scala:219)
[ERROR] 	at scala.reflect.internal.Trees$UnderConstructionTransformer$class.transform(Trees.scala:1680)
[ERROR] 	at scala.tools.nsc.transform.ExplicitOuter$OuterPathTransformer.transform(ExplicitOuter.scala:291)
[ERROR] 	at scala.tools.nsc.transform.ExplicitOuter$ExplicitOuterTransformer.transform(ExplicitOuter.scala:437)
[ERROR] 	at scala.tools.nsc.transform.ExplicitOuter$ExplicitOuterTransformer.transform(ExplicitOuter.scala:352)
[ERROR] 	at scala.reflect.api.Trees$Transformer$$anonfun$transformStats$1.apply(Trees.scala:2589)
[ERROR] 	at scala.reflect.api.Trees$Transformer$$anonfun$transformStats$1.apply(Trees.scala:2587)
[ERROR] 	at scala.collection.immutable.List.loop$1(List.scala:172)
[ERROR] 	at scala.collection.immutable.List.mapConserve(List.scala:188)
[ERROR] 	at scala.reflect.api.Trees$Transformer.transformStats(Trees.scala:2587)
[ERROR] 	at scala.reflect.internal.Trees$class.itransform(Trees.scala:1397)
[ERROR] 	at scala.reflect.internal.SymbolTable.itransform(SymbolTable.scala:16)
[ERROR] 	at scala.reflect.internal.SymbolTable.itransform(SymbolTable.scala:16)
[ERROR] 	at scala.reflect.api.Trees$Transformer.transform(Trees.scala:2555)
[ERROR] 	at scala.tools.nsc.transform.TypingTransformers$TypingTransformer.scala$tools$nsc$transform$TypingTransformers$TypingTransformer$$super$transform(TypingTransformers.scala:40)
[ERROR] 	at scala.tools.nsc.transform.TypingTransformers$TypingTransformer$$anonfun$transform$1.apply(TypingTransformers.scala:40)
[ERROR] 	at scala.tools.nsc.transform.TypingTransformers$TypingTransformer$$anonfun$transform$1.apply(TypingTransformers.scala:40)
[ERROR] 	at scala.reflect.api.Trees$Transformer.atOwner(Trees.scala:2600)
[ERROR] 	at scala.tools.nsc.transform.TypingTransformers$TypingTransformer.atOwner(TypingTransformers.scala:30)
[ERROR] 	at scala.tools.nsc.transform.TypingTransformers$TypingTransformer.transform(TypingTransformers.scala:40)
[ERROR] 	at scala.tools.nsc.transform.ExplicitOuter$OuterPathTransformer.scala$reflect$internal$Trees$UnderConstructionTransformer$$super$transform(ExplicitOuter.scala:219)
[ERROR] 	at scala.reflect.internal.Trees$UnderConstructionTransformer$class.transform(Trees.scala:1680)
[ERROR] 	at scala.tools.nsc.transform.ExplicitOuter$OuterPathTransformer.transform(ExplicitOuter.scala:291)
[ERROR] 	at scala.tools.nsc.transform.ExplicitOuter$ExplicitOuterTransformer.transform(ExplicitOuter.scala:412)
[ERROR] 	at scala.tools.nsc.transform.ExplicitOuter$ExplicitOuterTransformer.transform(ExplicitOuter.scala:352)
[ERROR] 	at scala.reflect.api.Trees$Transformer.transformTemplate(Trees.scala:2563)
[ERROR] 	at scala.reflect.internal.Trees$$anonfun$itransform$4.apply(Trees.scala:1401)
[ERROR] 	at scala.reflect.internal.Trees$$anonfun$itransform$4.apply(Trees.scala:1400)
[ERROR] 	at scala.reflect.api.Trees$Transformer.atOwner(Trees.scala:2600)
[ERROR] 	at scala.tools.nsc.transform.TypingTransformers$TypingTransformer.atOwner(TypingTransformers.scala:30)
[ERROR] 	at scala.tools.nsc.transform.TypingTransformers$TypingTransformer.atOwner(TypingTransformers.scala:25)
[ERROR] 	at scala.tools.nsc.transform.TypingTransformers$TypingTransformer.atOwner(TypingTransformers.scala:17)
[ERROR] 	at scala.reflect.internal.Trees$class.itransform(Trees.scala:1399)
[ERROR] 	at scala.reflect.internal.SymbolTable.itransform(SymbolTable.scala:16)
[ERROR] 	at scala.reflect.internal.SymbolTable.itransform(SymbolTable.scala:16)
[ERROR] 	at scala.reflect.api.Trees$Transformer.transform(Trees.scala:2555)
[ERROR] 	at scala.tools.nsc.transform.TypingTransformers$TypingTransformer.transform(TypingTransformers.scala:44)
[ERROR] 	at scala.tools.nsc.transform.ExplicitOuter$OuterPathTransformer.scala$reflect$internal$Trees$UnderConstructionTransformer$$super$transform(ExplicitOuter.scala:219)
[ERROR] 	at scala.reflect.internal.Trees$UnderConstructionTransformer$class.transform(Trees.scala:1680)
[ERROR] 	at scala.tools.nsc.transform.ExplicitOuter$OuterPathTransformer.transform(ExplicitOuter.scala:291)
[ERROR] 	at scala.tools.nsc.transform.ExplicitOuter$ExplicitOuterTransformer.transform(ExplicitOuter.scala:496)
[ERROR] 	at scala.tools.nsc.transform.ExplicitOuter$ExplicitOuterTransformer.transform(ExplicitOuter.scala:352)
[ERROR] 	at scala.reflect.api.Trees$Transformer$$anonfun$transformStats$1.apply(Trees.scala:2589)
[ERROR] 	at scala.reflect.api.Trees$Transformer$$anonfun$transformStats$1.apply(Trees.scala:2587)
[ERROR] 	at scala.collection.immutable.List.loop$1(List.scala:172)
[ERROR] 	at scala.collection.immutable.List.mapConserve(List.scala:188)
[ERROR] 	at scala.reflect.api.Trees$Transformer.transformStats(Trees.scala:2587)
[ERROR] 	at scala.reflect.internal.Trees$class.itransform(Trees.scala:1359)
[ERROR] 	at scala.reflect.internal.SymbolTable.itransform(SymbolTable.scala:16)
[ERROR] 	at scala.reflect.internal.SymbolTable.itransform(SymbolTable.scala:16)
[ERROR] 	at scala.reflect.api.Trees$Transformer.transform(Trees.scala:2555)
[ERROR] 	at scala.tools.nsc.transform.TypingTransformers$TypingTransformer.transform(TypingTransformers.scala:44)
[ERROR] 	at scala.tools.nsc.transform.ExplicitOuter$OuterPathTransformer.scala$reflect$internal$Trees$UnderConstructionTransformer$$super$transform(ExplicitOuter.scala:219)
[ERROR] 	at scala.reflect.internal.Trees$UnderConstructionTransformer$class.transform(Trees.scala:1680)
[ERROR] 	at scala.tools.nsc.transform.ExplicitOuter$OuterPathTransformer.transform(ExplicitOuter.scala:291)
[ERROR] 	at scala.tools.nsc.transform.ExplicitOuter$ExplicitOuterTransformer.transform(ExplicitOuter.scala:496)
[ERROR] 	at scala.tools.nsc.transform.ExplicitOuter$ExplicitOuterTransformer.transform(ExplicitOuter.scala:352)
[ERROR] 	at scala.reflect.api.Trees$Transformer$$anonfun$transformTrees$1.apply(Trees.scala:2559)
[ERROR] 	at scala.reflect.api.Trees$Transformer$$anonfun$transformTrees$1.apply(Trees.scala:2559)
[ERROR] 	at scala.collection.immutable.List.loop$1(List.scala:172)
[ERROR] 	at scala.collection.immutable.List.mapConserve(List.scala:188)
[ERROR] 	at scala.reflect.api.Trees$Transformer.transformTrees(Trees.scala:2559)
[ERROR] 	at scala.reflect.internal.Trees$class.itransform(Trees.scala:1340)
[ERROR] 	at scala.reflect.internal.SymbolTable.itransform(SymbolTable.scala:16)
[ERROR] 	at scala.reflect.internal.SymbolTable.itransform(SymbolTable.scala:16)
[ERROR] 	at scala.reflect.api.Trees$Transformer.transform(Trees.scala:2555)
[ERROR] 	at scala.tools.nsc.transform.TypingTransformers$TypingTransformer.transform(TypingTransformers.scala:44)
[ERROR] 	at scala.tools.nsc.transform.ExplicitOuter$OuterPathTransformer.scala$reflect$internal$Trees$UnderConstructionTransformer$$super$transform(ExplicitOuter.scala:219)
[ERROR] 	at scala.reflect.internal.Trees$UnderConstructionTransformer$class.transform(Trees.scala:1680)
[ERROR] 	at scala.tools.nsc.transform.ExplicitOuter$OuterPathTransformer.transform(ExplicitOuter.scala:291)
[ERROR] 	at scala.tools.nsc.transform.ExplicitOuter$ExplicitOuterTransformer.transform(ExplicitOuter.scala:496)
[ERROR] 	at scala.tools.nsc.transform.ExplicitOuter$ExplicitOuterTransformer.transform(ExplicitOuter.scala:352)
[ERROR] 	at scala.reflect.api.Trees$Transformer$$anonfun$transformStats$1$$anonfun$apply$2.apply(Trees.scala:2588)
[ERROR] 	at scala.reflect.api.Trees$Transformer$$anonfun$transformStats$1$$anonfun$apply$2.apply(Trees.scala:2588)
[ERROR] 	at scala.reflect.api.Trees$Transformer.atOwner(Trees.scala:2600)
[ERROR] 	at scala.tools.nsc.transform.TypingTransformers$TypingTransformer.atOwner(TypingTransformers.scala:30)
[ERROR] 	at scala.tools.nsc.transform.TypingTransformers$TypingTransformer.atOwner(TypingTransformers.scala:25)
[ERROR] 	at scala.tools.nsc.transform.TypingTransformers$TypingTransformer.atOwner(TypingTransformers.scala:17)
[ERROR] 	at scala.reflect.api.Trees$Transformer$$anonfun$transformStats$1.apply(Trees.scala:2588)
[ERROR] 	at scala.reflect.api.Trees$Transformer$$anonfun$transformStats$1.apply(Trees.scala:2587)
[ERROR] 	at scala.collection.immutable.List.loop$1(List.scala:172)
[ERROR] 	at scala.collection.immutable.List.mapConserve(List.scala:188)
[ERROR] 	at scala.reflect.api.Trees$Transformer.transformStats(Trees.scala:2587)
[ERROR] 	at scala.reflect.internal.Trees$class.itransform(Trees.scala:1397)
[ERROR] 	at scala.reflect.internal.SymbolTable.itransform(SymbolTable.scala:16)
[ERROR] 	at scala.reflect.internal.SymbolTable.itransform(SymbolTable.scala:16)
[ERROR] 	at scala.reflect.api.Trees$Transformer.transform(Trees.scala:2555)
[ERROR] 	at scala.tools.nsc.transform.TypingTransformers$TypingTransformer.scala$tools$nsc$transform$TypingTransformers$TypingTransformer$$super$transform(TypingTransformers.scala:40)
[ERROR] 	at scala.tools.nsc.transform.TypingTransformers$TypingTransformer$$anonfun$transform$1.apply(TypingTransformers.scala:40)
[ERROR] 	at scala.tools.nsc.transform.TypingTransformers$TypingTransformer$$anonfun$transform$1.apply(TypingTransformers.scala:40)
[ERROR] 	at scala.reflect.api.Trees$Transformer.atOwner(Trees.scala:2600)
[ERROR] 	at scala.tools.nsc.transform.TypingTransformers$TypingTransformer.atOwner(TypingTransformers.scala:30)
[ERROR] 	at scala.tools.nsc.transform.TypingTransformers$TypingTransformer.transform(TypingTransformers.scala:40)
[ERROR] 	at scala.tools.nsc.transform.ExplicitOuter$OuterPathTransformer.scala$reflect$internal$Trees$UnderConstructionTransformer$$super$transform(ExplicitOuter.scala:219)
[ERROR] 	at scala.reflect.internal.Trees$UnderConstructionTransformer$class.transform(Trees.scala:1680)
[ERROR] 	at scala.tools.nsc.transform.ExplicitOuter$OuterPathTransformer.transform(ExplicitOuter.scala:291)
[ERROR] 	at scala.tools.nsc.transform.ExplicitOuter$ExplicitOuterTransformer.transform(ExplicitOuter.scala:412)
[ERROR] 	at scala.tools.nsc.transform.ExplicitOuter$ExplicitOuterTransformer.transform(ExplicitOuter.scala:352)
[ERROR] 	at scala.reflect.api.Trees$Transformer.transformTemplate(Trees.scala:2563)
[ERROR] 	at scala.reflect.internal.Trees$$anonfun$itransform$4.apply(Trees.scala:1401)
[ERROR] 	at scala.reflect.internal.Trees$$anonfun$itransform$4.apply(Trees.scala:1400)
[ERROR] 	at scala.reflect.api.Trees$Transformer.atOwner(Trees.scala:2600)
[ERROR] 	at scala.tools.nsc.transform.TypingTransformers$TypingTransformer.atOwner(TypingTransformers.scala:30)
[ERROR] 	at scala.tools.nsc.transform.TypingTransformers$TypingTransformer.atOwner(TypingTransformers.scala:25)
[ERROR] 	at scala.tools.nsc.transform.TypingTransformers$TypingTransformer.atOwner(TypingTransformers.scala:17)
[ERROR] 	at scala.reflect.internal.Trees$class.itransform(Trees.scala:1399)
[ERROR] 	at scala.reflect.internal.SymbolTable.itransform(SymbolTable.scala:16)
[ERROR] 	at scala.reflect.internal.SymbolTable.itransform(SymbolTable.scala:16)
[ERROR] 	at scala.reflect.api.Trees$Transformer.transform(Trees.scala:2555)
[ERROR] 	at scala.tools.nsc.transform.TypingTransformers$TypingTransformer.transform(TypingTransformers.scala:44)
[ERROR] 	at scala.tools.nsc.transform.ExplicitOuter$OuterPathTransformer.scala$reflect$internal$Trees$UnderConstructionTransformer$$super$transform(ExplicitOuter.scala:219)
[ERROR] 	at scala.reflect.internal.Trees$UnderConstructionTransformer$class.transform(Trees.scala:1680)
[ERROR] 	at scala.tools.nsc.transform.ExplicitOuter$OuterPathTransformer.transform(ExplicitOuter.scala:291)
[ERROR] 	at scala.tools.nsc.transform.ExplicitOuter$ExplicitOuterTransformer.transform(ExplicitOuter.scala:496)
[ERROR] 	at scala.tools.nsc.transform.ExplicitOuter$ExplicitOuterTransformer.transform(ExplicitOuter.scala:352)
[ERROR] 	at scala.reflect.api.Trees$Transformer$$anonfun$transformStats$1.apply(Trees.scala:2589)
[ERROR] 	at scala.reflect.api.Trees$Transformer$$anonfun$transformStats$1.apply(Trees.scala:2587)
[ERROR] 	at scala.collection.immutable.List.loop$1(List.scala:172)
[ERROR] 	at scala.collection.immutable.List.mapConserve(List.scala:188)
[ERROR] 	at scala.reflect.api.Trees$Transformer.transformStats(Trees.scala:2587)
[ERROR] 	at scala.reflect.internal.Trees$$anonfun$itransform$7.apply(Trees.scala:1419)
[ERROR] 	at scala.reflect.internal.Trees$$anonfun$itransform$7.apply(Trees.scala:1419)
[ERROR] 	at scala.reflect.api.Trees$Transformer.atOwner(Trees.scala:2600)
[ERROR] 	at scala.tools.nsc.transform.TypingTransformers$TypingTransformer.atOwner(TypingTransformers.scala:30)
[ERROR] 	at scala.tools.nsc.transform.TypingTransformers$TypingTransformer.atOwner(TypingTransformers.scala:25)
[ERROR] 	at scala.tools.nsc.transform.TypingTransformers$TypingTransformer.atOwner(TypingTransformers.scala:17)
[ERROR] 	at scala.reflect.internal.Trees$class.itransform(Trees.scala:1418)
[ERROR] 	at scala.reflect.internal.SymbolTable.itransform(SymbolTable.scala:16)
[ERROR] 	at scala.reflect.internal.SymbolTable.itransform(SymbolTable.scala:16)
[ERROR] 	at scala.reflect.api.Trees$Transformer.transform(Trees.scala:2555)
[ERROR] 	at scala.tools.nsc.transform.TypingTransformers$TypingTransformer.scala$tools$nsc$transform$TypingTransformers$TypingTransformer$$super$transform(TypingTransformers.scala:40)
[ERROR] 	at scala.tools.nsc.transform.TypingTransformers$TypingTransformer$$anonfun$transform$2.apply(TypingTransformers.scala:42)
[ERROR] 	at scala.tools.nsc.transform.TypingTransformers$TypingTransformer$$anonfun$transform$2.apply(TypingTransformers.scala:42)
[ERROR] 	at scala.reflect.api.Trees$Transformer.atOwner(Trees.scala:2600)
[ERROR] 	at scala.tools.nsc.transform.TypingTransformers$TypingTransformer.atOwner(TypingTransformers.scala:30)
[ERROR] 	at scala.tools.nsc.transform.TypingTransformers$TypingTransformer.transform(TypingTransformers.scala:42)
[ERROR] 	at scala.tools.nsc.transform.ExplicitOuter$OuterPathTransformer.scala$reflect$internal$Trees$UnderConstructionTransformer$$super$transform(ExplicitOuter.scala:219)
[ERROR] 	at scala.reflect.internal.Trees$UnderConstructionTransformer$class.transform(Trees.scala:1680)
[ERROR] 	at scala.tools.nsc.transform.ExplicitOuter$OuterPathTransformer.transform(ExplicitOuter.scala:291)
[ERROR] 	at scala.tools.nsc.transform.ExplicitOuter$ExplicitOuterTransformer.transform(ExplicitOuter.scala:496)
[ERROR] 	at scala.tools.nsc.transform.ExplicitOuter$ExplicitOuterTransformer.transform(ExplicitOuter.scala:352)
[ERROR] 	at scala.tools.nsc.ast.Trees$Transformer.transformUnit(Trees.scala:147)
[ERROR] 	at scala.tools.nsc.transform.ExplicitOuter$ExplicitOuterTransformer.scala$tools$nsc$transform$ExplicitOuter$ExplicitOuterTransformer$$super$transformUnit(ExplicitOuter.scala:504)
[ERROR] 	at scala.tools.nsc.transform.ExplicitOuter$ExplicitOuterTransformer$$anonfun$transformUnit$1.apply(ExplicitOuter.scala:504)
[ERROR] 	at scala.tools.nsc.transform.ExplicitOuter$ExplicitOuterTransformer$$anonfun$transformUnit$1.apply(ExplicitOuter.scala:504)
[ERROR] 	at scala.reflect.internal.SymbolTable.enteringPhase(SymbolTable.scala:235)
[ERROR] 	at scala.reflect.internal.SymbolTable.exitingPhase(SymbolTable.scala:256)
[ERROR] 	at scala.tools.nsc.transform.ExplicitOuter$ExplicitOuterTransformer.transformUnit(ExplicitOuter.scala:504)
[ERROR] 	at scala.tools.nsc.transform.Transform$Phase.apply(Transform.scala:30)
[ERROR] 	at scala.tools.nsc.Global$GlobalPhase$$anonfun$applyPhase$1.apply$mcV$sp(Global.scala:428)
[ERROR] 	at scala.tools.nsc.Global$GlobalPhase.withCurrentUnit(Global.scala:419)
[ERROR] 	at scala.tools.nsc.Global$GlobalPhase.applyPhase(Global.scala:428)
[ERROR] 	at scala.tools.nsc.Global$GlobalPhase$$anonfun$run$1.apply(Global.scala:386)
[ERROR] 	at scala.tools.nsc.Global$GlobalPhase$$anonfun$run$1.apply(Global.scala:386)
[ERROR] 	at scala.collection.Iterator$class.foreach(Iterator.scala:743)
[ERROR] 	at scala.collection.AbstractIterator.foreach(Iterator.scala:1195)
[ERROR] 	at scala.tools.nsc.Global$GlobalPhase.run(Global.scala:386)
[ERROR] 	at scala.tools.nsc.Global$Run.compileUnitsInternal(Global.scala:1338)
[ERROR] 	at scala.tools.nsc.Global$Run.compileUnits(Global.scala:1325)
[ERROR] 	at scala.tools.nsc.Global$Run.compileSources(Global.scala:1320)
[ERROR] 	at scala.tools.nsc.Global$Run.compile(Global.scala:1418)
[ERROR] 	at scala.tools.nsc.Driver.doCompile(Driver.scala:32)
[ERROR] 	at scala.tools.nsc.MainClass.doCompile(Main.scala:23)
[ERROR] 	at scala.tools.nsc.Driver.process(Driver.scala:51)
[ERROR] 	at scala.tools.nsc.Driver.main(Driver.scala:64)
[ERROR] 	at scala.tools.nsc.Main.main(Main.scala)
[ERROR] 	at sun.reflect.NativeMethodAccessorImpl.invoke0(Native Method)
[ERROR] 	at sun.reflect.NativeMethodAccessorImpl.invoke(NativeMethodAccessorImpl.java:62)
[ERROR] 	at sun.reflect.DelegatingMethodAccessorImpl.invoke(DelegatingMethodAccessorImpl.java:43)
[ERROR] 	at java.lang.reflect.Method.invoke(Method.java:497)
[ERROR] 	at scala_maven_executions.MainHelper.runMain(MainHelper.java:164)
[ERROR] 	at scala_maven_executions.MainWithArgsInFile.main(MainWithArgsInFile.java:26)
[ERROR] java.lang.reflect.InvocationTargetException
[ERROR] 	at sun.reflect.NativeMethodAccessorImpl.invoke0(Native Method)
[ERROR] 	at sun.reflect.NativeMethodAccessorImpl.invoke(NativeMethodAccessorImpl.java:62)
[ERROR] 	at sun.reflect.DelegatingMethodAccessorImpl.invoke(DelegatingMethodAccessorImpl.java:43)
[ERROR] 	at java.lang.reflect.Method.invoke(Method.java:497)
[ERROR] 	at scala_maven_executions.MainHelper.runMain(MainHelper.java:164)
[ERROR] 	at scala_maven_executions.MainWithArgsInFile.main(MainWithArgsInFile.java:26)
[ERROR] Caused by: java.lang.NullPointerException
[ERROR] 	at scala.tools.nsc.symtab.classfile.ClassfileParser.scala$tools$nsc$symtab$classfile$ClassfileParser$$handleError(ClassfileParser.scala:104)
[ERROR] 	at scala.tools.nsc.symtab.classfile.ClassfileParser$$anonfun$scala$tools$nsc$symtab$classfile$ClassfileParser$$parseErrorHandler$1.applyOrElse(ClassfileParser.scala:112)
[ERROR] 	at scala.tools.nsc.symtab.classfile.ClassfileParser$$anonfun$scala$tools$nsc$symtab$classfile$ClassfileParser$$parseErrorHandler$1.applyOrElse(ClassfileParser.scala:110)
[ERROR] 	at scala.runtime.AbstractPartialFunction.apply(AbstractPartialFunction.scala:36)
[ERROR] 	at scala.tools.nsc.symtab.classfile.ClassfileParser.parse(ClassfileParser.scala:134)
[ERROR] 	at scala.tools.nsc.symtab.SymbolLoaders$ClassfileLoader$$anonfun$doComplete$2.apply$mcV$sp(SymbolLoaders.scala:309)
[ERROR] 	at scala.tools.nsc.symtab.SymbolLoaders$ClassfileLoader$$anonfun$doComplete$2.apply(SymbolLoaders.scala:309)
[ERROR] 	at scala.tools.nsc.symtab.SymbolLoaders$ClassfileLoader$$anonfun$doComplete$2.apply(SymbolLoaders.scala:309)
[ERROR] 	at scala.reflect.internal.SymbolTable.enteringPhase(SymbolTable.scala:235)
[ERROR] 	at scala.tools.nsc.symtab.SymbolLoaders$ClassfileLoader.doComplete(SymbolLoaders.scala:309)
[ERROR] 	at scala.tools.nsc.symtab.SymbolLoaders$SymbolLoader.complete(SymbolLoaders.scala:211)
[ERROR] 	at scala.tools.nsc.symtab.SymbolLoaders$SymbolLoader.load(SymbolLoaders.scala:227)
[ERROR] 	at scala.reflect.internal.Symbols$Symbol.typeParams(Symbols.scala:1702)
[ERROR] 	at scala.tools.nsc.transform.SpecializeTypes.specializedTypeVars(SpecializeTypes.scala:440)
[ERROR] 	at scala.tools.nsc.transform.SpecializeTypes.loop$2(SpecializeTypes.scala:414)
[ERROR] 	at scala.tools.nsc.transform.SpecializeTypes.specializedTypeVars(SpecializeTypes.scala:416)
[ERROR] 	at scala.tools.nsc.transform.SpecializeTypes.specializedTypeVars(SpecializeTypes.scala:445)
[ERROR] 	at scala.tools.nsc.transform.SpecializeTypes.loop$2(SpecializeTypes.scala:414)
[ERROR] 	at scala.tools.nsc.transform.SpecializeTypes.specializedTypeVars(SpecializeTypes.scala:416)
[ERROR] 	at scala.tools.nsc.transform.SpecializeTypes.specializedTypeVars(SpecializeTypes.scala:442)
[ERROR] 	at scala.tools.nsc.transform.SpecializeTypes.scala$tools$nsc$transform$SpecializeTypes$$normalizeMember(SpecializeTypes.scala:823)
[ERROR] 	at scala.tools.nsc.transform.SpecializeTypes$$anonfun$23.apply(SpecializeTypes.scala:768)
[ERROR] 	at scala.tools.nsc.transform.SpecializeTypes$$anonfun$23.apply(SpecializeTypes.scala:766)
[ERROR] 	at scala.collection.immutable.List.flatMap(List.scala:327)
[ERROR] 	at scala.tools.nsc.transform.SpecializeTypes.specializeClass(SpecializeTypes.scala:766)
[ERROR] 	at scala.tools.nsc.transform.SpecializeTypes.transformInfo(SpecializeTypes.scala:1187)
[ERROR] 	at scala.tools.nsc.transform.InfoTransform$Phase$$anon$1.transform(InfoTransform.scala:38)
[ERROR] 	at scala.reflect.internal.Symbols$Symbol.rawInfo(Symbols.scala:1571)
[ERROR] 	at scala.reflect.internal.Symbols$Symbol.info(Symbols.scala:1491)
[ERROR] 	at scala.reflect.internal.Types$TypeRef.thisInfo(Types.scala:2194)
[ERROR] 	at scala.reflect.internal.Types$TypeRef.baseClasses(Types.scala:2199)
[ERROR] 	at scala.reflect.internal.Types$class.computeBaseClasses(Types.scala:1439)
[ERROR] 	at scala.reflect.internal.SymbolTable.computeBaseClasses(SymbolTable.scala:16)
[ERROR] 	at scala.reflect.internal.Types$$anonfun$defineBaseClassesOfCompoundType$1.apply(Types.scala:1560)
[ERROR] 	at scala.reflect.internal.Types$$anonfun$defineBaseClassesOfCompoundType$1.apply(Types.scala:1560)
[ERROR] 	at scala.reflect.internal.Types$CompoundType.memo(Types.scala:1393)
[ERROR] 	at scala.reflect.internal.Types$class.defineBaseClassesOfCompoundType(Types.scala:1560)
[ERROR] 	at scala.reflect.internal.Types$class.define$1(Types.scala:1527)
[ERROR] 	at scala.reflect.internal.Types$class.defineBaseClassesOfCompoundType(Types.scala:1528)
[ERROR] 	at scala.reflect.internal.SymbolTable.defineBaseClassesOfCompoundType(SymbolTable.scala:16)
[ERROR] 	at scala.reflect.internal.Types$CompoundType.baseClasses(Types.scala:1370)
[ERROR] 	at scala.reflect.internal.Types$$anonfun$defineBaseClassesOfCompoundType$2.apply(Types.scala:1560)
[ERROR] 	at scala.reflect.internal.Types$$anonfun$defineBaseClassesOfCompoundType$2.apply(Types.scala:1560)
[ERROR] 	at scala.reflect.internal.Types$CompoundType.memo(Types.scala:1393)
[ERROR] 	at scala.reflect.internal.Types$class.defineBaseClassesOfCompoundType(Types.scala:1560)
[ERROR] 	at scala.reflect.internal.Types$class.define$1(Types.scala:1527)
[ERROR] 	at scala.reflect.internal.Types$class.defineBaseClassesOfCompoundType(Types.scala:1528)
[ERROR] 	at scala.reflect.internal.SymbolTable.defineBaseClassesOfCompoundType(SymbolTable.scala:16)
[ERROR] 	at scala.reflect.internal.Types$CompoundType.baseClasses(Types.scala:1370)
[ERROR] 	at scala.reflect.internal.Types$PolyType.baseClasses(Types.scala:2509)
[ERROR] 	at scala.reflect.internal.Types$TypeRef.baseClasses(Types.scala:2199)
[ERROR] 	at scala.reflect.internal.Types$class.computeBaseClasses(Types.scala:1425)
[ERROR] 	at scala.reflect.internal.SymbolTable.computeBaseClasses(SymbolTable.scala:16)
[ERROR] 	at scala.reflect.internal.Types$$anonfun$defineBaseClassesOfCompoundType$1.apply(Types.scala:1560)
[ERROR] 	at scala.reflect.internal.Types$$anonfun$defineBaseClassesOfCompoundType$1.apply(Types.scala:1560)
[ERROR] 	at scala.reflect.internal.Types$CompoundType.memo(Types.scala:1393)
[ERROR] 	at scala.reflect.internal.Types$class.defineBaseClassesOfCompoundType(Types.scala:1560)
[ERROR] 	at scala.reflect.internal.Types$class.define$1(Types.scala:1527)
[ERROR] 	at scala.reflect.internal.Types$class.defineBaseClassesOfCompoundType(Types.scala:1528)
[ERROR] 	at scala.reflect.internal.SymbolTable.defineBaseClassesOfCompoundType(SymbolTable.scala:16)
[ERROR] 	at scala.reflect.internal.Types$CompoundType.baseClasses(Types.scala:1370)
[ERROR] 	at scala.reflect.internal.Types$$anonfun$defineBaseClassesOfCompoundType$2.apply(Types.scala:1560)
[ERROR] 	at scala.reflect.internal.Types$$anonfun$defineBaseClassesOfCompoundType$2.apply(Types.scala:1560)
[ERROR] 	at scala.reflect.internal.Types$CompoundType.memo(Types.scala:1393)
[ERROR] 	at scala.reflect.internal.Types$class.defineBaseClassesOfCompoundType(Types.scala:1560)
[ERROR] 	at scala.reflect.internal.Types$class.define$1(Types.scala:1527)
[ERROR] 	at scala.reflect.internal.Types$class.defineBaseClassesOfCompoundType(Types.scala:1528)
[ERROR] 	at scala.reflect.internal.SymbolTable.defineBaseClassesOfCompoundType(SymbolTable.scala:16)
[ERROR] 	at scala.reflect.internal.Types$CompoundType.baseClasses(Types.scala:1370)
[ERROR] 	at scala.reflect.internal.Symbols$Symbol.ancestors(Symbols.scala:2094)
[ERROR] 	at scala.reflect.internal.Symbols$Symbol.mixinClasses(Symbols.scala:2090)
[ERROR] 	at scala.tools.nsc.transform.ExplicitOuter.transformInfo(ExplicitOuter.scala:184)
[ERROR] 	at scala.tools.nsc.transform.InfoTransform$Phase$$anon$1.transform(InfoTransform.scala:38)
[ERROR] 	at scala.reflect.internal.Symbols$Symbol.rawInfo(Symbols.scala:1571)
[ERROR] 	at scala.reflect.internal.Symbols$Symbol.info(Symbols.scala:1491)
[ERROR] 	at scala.reflect.internal.Types$ClassTypeRef$class.baseType(Types.scala:1968)
[ERROR] 	at scala.reflect.internal.Types$ClassNoArgsTypeRef.baseType(Types.scala:2331)
[ERROR] 	at scala.reflect.internal.Types$SimpleTypeProxy$class.baseType(Types.scala:162)
[ERROR] 	at scala.reflect.internal.Types$SingletonType.baseType(Types.scala:1076)
[ERROR] 	at scala.reflect.internal.tpe.TypeMaps$AsSeenFromMap.loop$4(TypeMaps.scala:647)
[ERROR] 	at scala.reflect.internal.tpe.TypeMaps$AsSeenFromMap.thisTypeAsSeen(TypeMaps.scala:653)
[ERROR] 	at scala.reflect.internal.tpe.TypeMaps$AsSeenFromMap.apply(TypeMaps.scala:464)
[ERROR] 	at scala.reflect.internal.tpe.TypeMaps$TypeMap.mapOver(TypeMaps.scala:110)
[ERROR] 	at scala.reflect.internal.tpe.TypeMaps$AsSeenFromMap.apply(TypeMaps.scala:468)
[ERROR] 	at scala.reflect.internal.tpe.TypeMaps$TypeMap.mapOver(TypeMaps.scala:129)
[ERROR] 	at scala.reflect.internal.tpe.TypeMaps$AsSeenFromMap.apply(TypeMaps.scala:468)
[ERROR] 	at scala.reflect.internal.Types$Type.asSeenFrom(Types.scala:663)
[ERROR] 	at scala.reflect.internal.Types$Type.computeMemberType(Types.scala:698)
[ERROR] 	at scala.reflect.internal.Symbols$MethodSymbol.typeAsMemberOf(Symbols.scala:2907)
[ERROR] 	at scala.reflect.internal.Types$Type.memberType(Types.scala:689)
[ERROR] 	at scala.reflect.internal.Types$class.defineUnderlyingOfSingleType(Types.scala:1260)
[ERROR] 	at scala.reflect.internal.SymbolTable.defineUnderlyingOfSingleType(SymbolTable.scala:16)
[ERROR] 	at scala.reflect.internal.Types$SingleType.underlying(Types.scala:1214)
[ERROR] 	at scala.reflect.internal.Types$SingletonType.widen(Types.scala:1079)
[ERROR] 	at scala.tools.nsc.transform.ExplicitOuter$ExplicitOuterTransformer.transform(ExplicitOuter.scala:453)
[ERROR] 	at scala.tools.nsc.transform.ExplicitOuter$ExplicitOuterTransformer.transform(ExplicitOuter.scala:352)
[ERROR] 	at scala.reflect.internal.Trees$class.itransform(Trees.scala:1340)
[ERROR] 	at scala.reflect.internal.SymbolTable.itransform(SymbolTable.scala:16)
[ERROR] 	at scala.reflect.internal.SymbolTable.itransform(SymbolTable.scala:16)
[ERROR] 	at scala.reflect.api.Trees$Transformer.transform(Trees.scala:2555)
[ERROR] 	at scala.tools.nsc.transform.TypingTransformers$TypingTransformer.transform(TypingTransformers.scala:44)
[ERROR] 	at scala.tools.nsc.transform.ExplicitOuter$OuterPathTransformer.scala$reflect$internal$Trees$UnderConstructionTransformer$$super$transform(ExplicitOuter.scala:219)
[ERROR] 	at scala.reflect.internal.Trees$UnderConstructionTransformer$class.transform(Trees.scala:1680)
[ERROR] 	at scala.tools.nsc.transform.ExplicitOuter$OuterPathTransformer.transform(ExplicitOuter.scala:291)
[ERROR] 	at scala.tools.nsc.transform.ExplicitOuter$ExplicitOuterTransformer.transform(ExplicitOuter.scala:496)
[ERROR] 	at scala.tools.nsc.transform.ExplicitOuter$ExplicitOuterTransformer.transform(ExplicitOuter.scala:352)
[ERROR] 	at scala.reflect.api.Trees$Transformer$$anonfun$transformTrees$1.apply(Trees.scala:2559)
[ERROR] 	at scala.reflect.api.Trees$Transformer$$anonfun$transformTrees$1.apply(Trees.scala:2559)
[ERROR] 	at scala.collection.immutable.List.loop$1(List.scala:172)
[ERROR] 	at scala.collection.immutable.List.mapConserve(List.scala:188)
[ERROR] 	at scala.reflect.api.Trees$Transformer.transformTrees(Trees.scala:2559)
[ERROR] 	at scala.reflect.internal.Trees$class.itransform(Trees.scala:1340)
[ERROR] 	at scala.reflect.internal.SymbolTable.itransform(SymbolTable.scala:16)
[ERROR] 	at scala.reflect.internal.SymbolTable.itransform(SymbolTable.scala:16)
[ERROR] 	at scala.reflect.api.Trees$Transformer.transform(Trees.scala:2555)
[ERROR] 	at scala.tools.nsc.transform.TypingTransformers$TypingTransformer.transform(TypingTransformers.scala:44)
[ERROR] 	at scala.tools.nsc.transform.ExplicitOuter$OuterPathTransformer.scala$reflect$internal$Trees$UnderConstructionTransformer$$super$transform(ExplicitOuter.scala:219)
[ERROR] 	at scala.reflect.internal.Trees$UnderConstructionTransformer$class.transform(Trees.scala:1680)
[ERROR] 	at scala.tools.nsc.transform.ExplicitOuter$OuterPathTransformer.transform(ExplicitOuter.scala:291)
[ERROR] 	at scala.tools.nsc.transform.ExplicitOuter$ExplicitOuterTransformer.transform(ExplicitOuter.scala:496)
[ERROR] 	at scala.tools.nsc.transform.ExplicitOuter$ExplicitOuterTransformer.transform(ExplicitOuter.scala:352)
[ERROR] 	at scala.reflect.internal.Trees$$anonfun$itransform$1.apply(Trees.scala:1350)
[ERROR] 	at scala.reflect.internal.Trees$$anonfun$itransform$1.apply(Trees.scala:1349)
[ERROR] 	at scala.reflect.api.Trees$Transformer.atOwner(Trees.scala:2600)
[ERROR] 	at scala.tools.nsc.transform.TypingTransformers$TypingTransformer.atOwner(TypingTransformers.scala:30)
[ERROR] 	at scala.tools.nsc.transform.TypingTransformers$TypingTransformer.atOwner(TypingTransformers.scala:25)
[ERROR] 	at scala.tools.nsc.transform.TypingTransformers$TypingTransformer.atOwner(TypingTransformers.scala:17)
[ERROR] 	at scala.reflect.internal.Trees$class.itransform(Trees.scala:1348)
[ERROR] 	at scala.reflect.internal.SymbolTable.itransform(SymbolTable.scala:16)
[ERROR] 	at scala.reflect.internal.SymbolTable.itransform(SymbolTable.scala:16)
[ERROR] 	at scala.reflect.api.Trees$Transformer.transform(Trees.scala:2555)
[ERROR] 	at scala.tools.nsc.transform.TypingTransformers$TypingTransformer.transform(TypingTransformers.scala:44)
[ERROR] 	at scala.tools.nsc.transform.ExplicitOuter$OuterPathTransformer.scala$reflect$internal$Trees$UnderConstructionTransformer$$super$transform(ExplicitOuter.scala:219)
[ERROR] 	at scala.reflect.internal.Trees$UnderConstructionTransformer$class.transform(Trees.scala:1680)
[ERROR] 	at scala.tools.nsc.transform.ExplicitOuter$OuterPathTransformer.transform(ExplicitOuter.scala:291)
[ERROR] 	at scala.tools.nsc.transform.ExplicitOuter$ExplicitOuterTransformer.transform(ExplicitOuter.scala:496)
[ERROR] 	at scala.tools.nsc.transform.ExplicitOuter$ExplicitOuterTransformer.transform(ExplicitOuter.scala:352)
[ERROR] 	at scala.reflect.api.Trees$Transformer$$anonfun$transformStats$1.apply(Trees.scala:2589)
[ERROR] 	at scala.reflect.api.Trees$Transformer$$anonfun$transformStats$1.apply(Trees.scala:2587)
[ERROR] 	at scala.collection.immutable.List.loop$1(List.scala:172)
[ERROR] 	at scala.collection.immutable.List.mapConserve(List.scala:188)
[ERROR] 	at scala.reflect.api.Trees$Transformer.transformStats(Trees.scala:2587)
[ERROR] 	at scala.reflect.internal.Trees$class.itransform(Trees.scala:1359)
[ERROR] 	at scala.reflect.internal.SymbolTable.itransform(SymbolTable.scala:16)
[ERROR] 	at scala.reflect.internal.SymbolTable.itransform(SymbolTable.scala:16)
[ERROR] 	at scala.reflect.api.Trees$Transformer.transform(Trees.scala:2555)
[ERROR] 	at scala.tools.nsc.transform.TypingTransformers$TypingTransformer.transform(TypingTransformers.scala:44)
[ERROR] 	at scala.tools.nsc.transform.ExplicitOuter$OuterPathTransformer.scala$reflect$internal$Trees$UnderConstructionTransformer$$super$transform(ExplicitOuter.scala:219)
[ERROR] 	at scala.reflect.internal.Trees$UnderConstructionTransformer$class.transform(Trees.scala:1680)
[ERROR] 	at scala.tools.nsc.transform.ExplicitOuter$OuterPathTransformer.transform(ExplicitOuter.scala:291)
[ERROR] 	at scala.tools.nsc.transform.ExplicitOuter$ExplicitOuterTransformer.transform(ExplicitOuter.scala:496)
[ERROR] 	at scala.tools.nsc.transform.ExplicitOuter$ExplicitOuterTransformer.transform(ExplicitOuter.scala:352)
[ERROR] 	at scala.reflect.internal.Trees$$anonfun$itransform$1.apply(Trees.scala:1350)
[ERROR] 	at scala.reflect.internal.Trees$$anonfun$itransform$1.apply(Trees.scala:1349)
[ERROR] 	at scala.reflect.api.Trees$Transformer.atOwner(Trees.scala:2600)
[ERROR] 	at scala.tools.nsc.transform.TypingTransformers$TypingTransformer.atOwner(TypingTransformers.scala:30)
[ERROR] 	at scala.tools.nsc.transform.TypingTransformers$TypingTransformer.atOwner(TypingTransformers.scala:25)
[ERROR] 	at scala.tools.nsc.transform.TypingTransformers$TypingTransformer.atOwner(TypingTransformers.scala:17)
[ERROR] 	at scala.reflect.internal.Trees$class.itransform(Trees.scala:1348)
[ERROR] 	at scala.reflect.internal.SymbolTable.itransform(SymbolTable.scala:16)
[ERROR] 	at scala.reflect.internal.SymbolTable.itransform(SymbolTable.scala:16)
[ERROR] 	at scala.reflect.api.Trees$Transformer.transform(Trees.scala:2555)
[ERROR] 	at scala.tools.nsc.transform.TypingTransformers$TypingTransformer.transform(TypingTransformers.scala:44)
[ERROR] 	at scala.tools.nsc.transform.ExplicitOuter$OuterPathTransformer.scala$reflect$internal$Trees$UnderConstructionTransformer$$super$transform(ExplicitOuter.scala:219)
[ERROR] 	at scala.reflect.internal.Trees$UnderConstructionTransformer$class.transform(Trees.scala:1680)
[ERROR] 	at scala.tools.nsc.transform.ExplicitOuter$OuterPathTransformer.transform(ExplicitOuter.scala:291)
[ERROR] 	at scala.tools.nsc.transform.ExplicitOuter$ExplicitOuterTransformer.transform(ExplicitOuter.scala:496)
[ERROR] 	at scala.tools.nsc.transform.ExplicitOuter$ExplicitOuterTransformer.transform(ExplicitOuter.scala:352)
[ERROR] 	at scala.reflect.api.Trees$Transformer$$anonfun$transformStats$1.apply(Trees.scala:2589)
[ERROR] 	at scala.reflect.api.Trees$Transformer$$anonfun$transformStats$1.apply(Trees.scala:2587)
[ERROR] 	at scala.collection.immutable.List.loop$1(List.scala:172)
[ERROR] 	at scala.collection.immutable.List.mapConserve(List.scala:188)
[ERROR] 	at scala.reflect.api.Trees$Transformer.transformStats(Trees.scala:2587)
[ERROR] 	at scala.reflect.internal.Trees$class.itransform(Trees.scala:1359)
[ERROR] 	at scala.reflect.internal.SymbolTable.itransform(SymbolTable.scala:16)
[ERROR] 	at scala.reflect.internal.SymbolTable.itransform(SymbolTable.scala:16)
[ERROR] 	at scala.reflect.api.Trees$Transformer.transform(Trees.scala:2555)
[ERROR] 	at scala.tools.nsc.transform.TypingTransformers$TypingTransformer.transform(TypingTransformers.scala:44)
[ERROR] 	at scala.tools.nsc.transform.ExplicitOuter$OuterPathTransformer.scala$reflect$internal$Trees$UnderConstructionTransformer$$super$transform(ExplicitOuter.scala:219)
[ERROR] 	at scala.reflect.internal.Trees$UnderConstructionTransformer$class.transform(Trees.scala:1680)
[ERROR] 	at scala.tools.nsc.transform.ExplicitOuter$OuterPathTransformer.transform(ExplicitOuter.scala:291)
[ERROR] 	at scala.tools.nsc.transform.ExplicitOuter$ExplicitOuterTransformer.transform(ExplicitOuter.scala:496)
[ERROR] 	at scala.tools.nsc.transform.ExplicitOuter$ExplicitOuterTransformer.transform(ExplicitOuter.scala:352)
[ERROR] 	at scala.reflect.api.Trees$Transformer$$anonfun$transformStats$1.apply(Trees.scala:2589)
[ERROR] 	at scala.reflect.api.Trees$Transformer$$anonfun$transformStats$1.apply(Trees.scala:2587)
[ERROR] 	at scala.collection.immutable.List.loop$1(List.scala:172)
[ERROR] 	at scala.collection.immutable.List.mapConserve(List.scala:188)
[ERROR] 	at scala.reflect.api.Trees$Transformer.transformStats(Trees.scala:2587)
[ERROR] 	at scala.reflect.internal.Trees$class.itransform(Trees.scala:1359)
[ERROR] 	at scala.reflect.internal.SymbolTable.itransform(SymbolTable.scala:16)
[ERROR] 	at scala.reflect.internal.SymbolTable.itransform(SymbolTable.scala:16)
[ERROR] 	at scala.reflect.api.Trees$Transformer.transform(Trees.scala:2555)
[ERROR] 	at scala.tools.nsc.transform.TypingTransformers$TypingTransformer.transform(TypingTransformers.scala:44)
[ERROR] 	at scala.tools.nsc.transform.ExplicitOuter$OuterPathTransformer.scala$reflect$internal$Trees$UnderConstructionTransformer$$super$transform(ExplicitOuter.scala:219)
[ERROR] 	at scala.reflect.internal.Trees$UnderConstructionTransformer$class.transform(Trees.scala:1680)
[ERROR] 	at scala.tools.nsc.transform.ExplicitOuter$OuterPathTransformer.transform(ExplicitOuter.scala:291)
[ERROR] 	at scala.tools.nsc.transform.ExplicitOuter$ExplicitOuterTransformer.transform(ExplicitOuter.scala:496)
[ERROR] 	at scala.tools.nsc.transform.ExplicitOuter$ExplicitOuterTransformer.transform(ExplicitOuter.scala:352)
[ERROR] 	at scala.reflect.internal.Trees$$anonfun$itransform$2.apply(Trees.scala:1356)
[ERROR] 	at scala.reflect.internal.Trees$$anonfun$itransform$2.apply(Trees.scala:1354)
[ERROR] 	at scala.reflect.api.Trees$Transformer.atOwner(Trees.scala:2600)
[ERROR] 	at scala.tools.nsc.transform.TypingTransformers$TypingTransformer.atOwner(TypingTransformers.scala:30)
[ERROR] 	at scala.tools.nsc.transform.TypingTransformers$TypingTransformer.atOwner(TypingTransformers.scala:25)
[ERROR] 	at scala.tools.nsc.transform.TypingTransformers$TypingTransformer.atOwner(TypingTransformers.scala:17)
[ERROR] 	at scala.reflect.internal.Trees$class.itransform(Trees.scala:1353)
[ERROR] 	at scala.reflect.internal.SymbolTable.itransform(SymbolTable.scala:16)
[ERROR] 	at scala.reflect.internal.SymbolTable.itransform(SymbolTable.scala:16)
[ERROR] 	at scala.reflect.api.Trees$Transformer.transform(Trees.scala:2555)
[ERROR] 	at scala.tools.nsc.transform.TypingTransformers$TypingTransformer.transform(TypingTransformers.scala:44)
[ERROR] 	at scala.tools.nsc.transform.ExplicitOuter$OuterPathTransformer.scala$reflect$internal$Trees$UnderConstructionTransformer$$super$transform(ExplicitOuter.scala:219)
[ERROR] 	at scala.reflect.internal.Trees$UnderConstructionTransformer$class.transform(Trees.scala:1680)
[ERROR] 	at scala.tools.nsc.transform.ExplicitOuter$OuterPathTransformer.transform(ExplicitOuter.scala:291)
[ERROR] 	at scala.tools.nsc.transform.ExplicitOuter$ExplicitOuterTransformer.transform(ExplicitOuter.scala:437)
[ERROR] 	at scala.tools.nsc.transform.ExplicitOuter$ExplicitOuterTransformer.transform(ExplicitOuter.scala:352)
[ERROR] 	at scala.reflect.api.Trees$Transformer$$anonfun$transformStats$1.apply(Trees.scala:2589)
[ERROR] 	at scala.reflect.api.Trees$Transformer$$anonfun$transformStats$1.apply(Trees.scala:2587)
[ERROR] 	at scala.collection.immutable.List.loop$1(List.scala:172)
[ERROR] 	at scala.collection.immutable.List.mapConserve(List.scala:188)
[ERROR] 	at scala.reflect.api.Trees$Transformer.transformStats(Trees.scala:2587)
[ERROR] 	at scala.reflect.internal.Trees$class.itransform(Trees.scala:1397)
[ERROR] 	at scala.reflect.internal.SymbolTable.itransform(SymbolTable.scala:16)
[ERROR] 	at scala.reflect.internal.SymbolTable.itransform(SymbolTable.scala:16)
[ERROR] 	at scala.reflect.api.Trees$Transformer.transform(Trees.scala:2555)
[ERROR] 	at scala.tools.nsc.transform.TypingTransformers$TypingTransformer.scala$tools$nsc$transform$TypingTransformers$TypingTransformer$$super$transform(TypingTransformers.scala:40)
[ERROR] 	at scala.tools.nsc.transform.TypingTransformers$TypingTransformer$$anonfun$transform$1.apply(TypingTransformers.scala:40)
[ERROR] 	at scala.tools.nsc.transform.TypingTransformers$TypingTransformer$$anonfun$transform$1.apply(TypingTransformers.scala:40)
[ERROR] 	at scala.reflect.api.Trees$Transformer.atOwner(Trees.scala:2600)
[ERROR] 	at scala.tools.nsc.transform.TypingTransformers$TypingTransformer.atOwner(TypingTransformers.scala:30)
[ERROR] 	at scala.tools.nsc.transform.TypingTransformers$TypingTransformer.transform(TypingTransformers.scala:40)
[ERROR] 	at scala.tools.nsc.transform.ExplicitOuter$OuterPathTransformer.scala$reflect$internal$Trees$UnderConstructionTransformer$$super$transform(ExplicitOuter.scala:219)
[ERROR] 	at scala.reflect.internal.Trees$UnderConstructionTransformer$class.transform(Trees.scala:1680)
[ERROR] 	at scala.tools.nsc.transform.ExplicitOuter$OuterPathTransformer.transform(ExplicitOuter.scala:291)
[ERROR] 	at scala.tools.nsc.transform.ExplicitOuter$ExplicitOuterTransformer.transform(ExplicitOuter.scala:412)
[ERROR] 	at scala.tools.nsc.transform.ExplicitOuter$ExplicitOuterTransformer.transform(ExplicitOuter.scala:352)
[ERROR] 	at scala.reflect.api.Trees$Transformer.transformTemplate(Trees.scala:2563)
[ERROR] 	at scala.reflect.internal.Trees$$anonfun$itransform$4.apply(Trees.scala:1401)
[ERROR] 	at scala.reflect.internal.Trees$$anonfun$itransform$4.apply(Trees.scala:1400)
[ERROR] 	at scala.reflect.api.Trees$Transformer.atOwner(Trees.scala:2600)
[ERROR] 	at scala.tools.nsc.transform.TypingTransformers$TypingTransformer.atOwner(TypingTransformers.scala:30)
[ERROR] 	at scala.tools.nsc.transform.TypingTransformers$TypingTransformer.atOwner(TypingTransformers.scala:25)
[ERROR] 	at scala.tools.nsc.transform.TypingTransformers$TypingTransformer.atOwner(TypingTransformers.scala:17)
[ERROR] 	at scala.reflect.internal.Trees$class.itransform(Trees.scala:1399)
[ERROR] 	at scala.reflect.internal.SymbolTable.itransform(SymbolTable.scala:16)
[ERROR] 	at scala.reflect.internal.SymbolTable.itransform(SymbolTable.scala:16)
[ERROR] 	at scala.reflect.api.Trees$Transformer.transform(Trees.scala:2555)
[ERROR] 	at scala.tools.nsc.transform.TypingTransformers$TypingTransformer.transform(TypingTransformers.scala:44)
[ERROR] 	at scala.tools.nsc.transform.ExplicitOuter$OuterPathTransformer.scala$reflect$internal$Trees$UnderConstructionTransformer$$super$transform(ExplicitOuter.scala:219)
[ERROR] 	at scala.reflect.internal.Trees$UnderConstructionTransformer$class.transform(Trees.scala:1680)
[ERROR] 	at scala.tools.nsc.transform.ExplicitOuter$OuterPathTransformer.transform(ExplicitOuter.scala:291)
[ERROR] 	at scala.tools.nsc.transform.ExplicitOuter$ExplicitOuterTransformer.transform(ExplicitOuter.scala:496)
[ERROR] 	at scala.tools.nsc.transform.ExplicitOuter$ExplicitOuterTransformer.transform(ExplicitOuter.scala:352)
[ERROR] 	at scala.reflect.api.Trees$Transformer$$anonfun$transformStats$1.apply(Trees.scala:2589)
[ERROR] 	at scala.reflect.api.Trees$Transformer$$anonfun$transformStats$1.apply(Trees.scala:2587)
[ERROR] 	at scala.collection.immutable.List.loop$1(List.scala:172)
[ERROR] 	at scala.collection.immutable.List.mapConserve(List.scala:188)
[ERROR] 	at scala.reflect.api.Trees$Transformer.transformStats(Trees.scala:2587)
[ERROR] 	at scala.reflect.internal.Trees$class.itransform(Trees.scala:1359)
[ERROR] 	at scala.reflect.internal.SymbolTable.itransform(SymbolTable.scala:16)
[ERROR] 	at scala.reflect.internal.SymbolTable.itransform(SymbolTable.scala:16)
[ERROR] 	at scala.reflect.api.Trees$Transformer.transform(Trees.scala:2555)
[ERROR] 	at scala.tools.nsc.transform.TypingTransformers$TypingTransformer.transform(TypingTransformers.scala:44)
[ERROR] 	at scala.tools.nsc.transform.ExplicitOuter$OuterPathTransformer.scala$reflect$internal$Trees$UnderConstructionTransformer$$super$transform(ExplicitOuter.scala:219)
[ERROR] 	at scala.reflect.internal.Trees$UnderConstructionTransformer$class.transform(Trees.scala:1680)
[ERROR] 	at scala.tools.nsc.transform.ExplicitOuter$OuterPathTransformer.transform(ExplicitOuter.scala:291)
[ERROR] 	at scala.tools.nsc.transform.ExplicitOuter$ExplicitOuterTransformer.transform(ExplicitOuter.scala:496)
[ERROR] 	at scala.tools.nsc.transform.ExplicitOuter$ExplicitOuterTransformer.transform(ExplicitOuter.scala:352)
[ERROR] 	at scala.reflect.api.Trees$Transformer$$anonfun$transformTrees$1.apply(Trees.scala:2559)
[ERROR] 	at scala.reflect.api.Trees$Transformer$$anonfun$transformTrees$1.apply(Trees.scala:2559)
[ERROR] 	at scala.collection.immutable.List.loop$1(List.scala:172)
[ERROR] 	at scala.collection.immutable.List.mapConserve(List.scala:188)
[ERROR] 	at scala.reflect.api.Trees$Transformer.transformTrees(Trees.scala:2559)
[ERROR] 	at scala.reflect.internal.Trees$class.itransform(Trees.scala:1340)
[ERROR] 	at scala.reflect.internal.SymbolTable.itransform(SymbolTable.scala:16)
[ERROR] 	at scala.reflect.internal.SymbolTable.itransform(SymbolTable.scala:16)
[ERROR] 	at scala.reflect.api.Trees$Transformer.transform(Trees.scala:2555)
[ERROR] 	at scala.tools.nsc.transform.TypingTransformers$TypingTransformer.transform(TypingTransformers.scala:44)
[ERROR] 	at scala.tools.nsc.transform.ExplicitOuter$OuterPathTransformer.scala$reflect$internal$Trees$UnderConstructionTransformer$$super$transform(ExplicitOuter.scala:219)
[ERROR] 	at scala.reflect.internal.Trees$UnderConstructionTransformer$class.transform(Trees.scala:1680)
[ERROR] 	at scala.tools.nsc.transform.ExplicitOuter$OuterPathTransformer.transform(ExplicitOuter.scala:291)
[ERROR] 	at scala.tools.nsc.transform.ExplicitOuter$ExplicitOuterTransformer.transform(ExplicitOuter.scala:496)
[ERROR] 	at scala.tools.nsc.transform.ExplicitOuter$ExplicitOuterTransformer.transform(ExplicitOuter.scala:352)
[ERROR] 	at scala.reflect.api.Trees$Transformer$$anonfun$transformStats$1$$anonfun$apply$2.apply(Trees.scala:2588)
[ERROR] 	at scala.reflect.api.Trees$Transformer$$anonfun$transformStats$1$$anonfun$apply$2.apply(Trees.scala:2588)
[ERROR] 	at scala.reflect.api.Trees$Transformer.atOwner(Trees.scala:2600)
[ERROR] 	at scala.tools.nsc.transform.TypingTransformers$TypingTransformer.atOwner(TypingTransformers.scala:30)
[ERROR] 	at scala.tools.nsc.transform.TypingTransformers$TypingTransformer.atOwner(TypingTransformers.scala:25)
[ERROR] 	at scala.tools.nsc.transform.TypingTransformers$TypingTransformer.atOwner(TypingTransformers.scala:17)
[ERROR] 	at scala.reflect.api.Trees$Transformer$$anonfun$transformStats$1.apply(Trees.scala:2588)
[ERROR] 	at scala.reflect.api.Trees$Transformer$$anonfun$transformStats$1.apply(Trees.scala:2587)
[ERROR] 	at scala.collection.immutable.List.loop$1(List.scala:172)
[ERROR] 	at scala.collection.immutable.List.mapConserve(List.scala:188)
[ERROR] 	at scala.reflect.api.Trees$Transformer.transformStats(Trees.scala:2587)
[ERROR] 	at scala.reflect.internal.Trees$class.itransform(Trees.scala:1397)
[ERROR] 	at scala.reflect.internal.SymbolTable.itransform(SymbolTable.scala:16)
[ERROR] 	at scala.reflect.internal.SymbolTable.itransform(SymbolTable.scala:16)
[ERROR] 	at scala.reflect.api.Trees$Transformer.transform(Trees.scala:2555)
[ERROR] 	at scala.tools.nsc.transform.TypingTransformers$TypingTransformer.scala$tools$nsc$transform$TypingTransformers$TypingTransformer$$super$transform(TypingTransformers.scala:40)
[ERROR] 	at scala.tools.nsc.transform.TypingTransformers$TypingTransformer$$anonfun$transform$1.apply(TypingTransformers.scala:40)
[ERROR] 	at scala.tools.nsc.transform.TypingTransformers$TypingTransformer$$anonfun$transform$1.apply(TypingTransformers.scala:40)
[ERROR] 	at scala.reflect.api.Trees$Transformer.atOwner(Trees.scala:2600)
[ERROR] 	at scala.tools.nsc.transform.TypingTransformers$TypingTransformer.atOwner(TypingTransformers.scala:30)
[ERROR] 	at scala.tools.nsc.transform.TypingTransformers$TypingTransformer.transform(TypingTransformers.scala:40)
[ERROR] 	at scala.tools.nsc.transform.ExplicitOuter$OuterPathTransformer.scala$reflect$internal$Trees$UnderConstructionTransformer$$super$transform(ExplicitOuter.scala:219)
[ERROR] 	at scala.reflect.internal.Trees$UnderConstructionTransformer$class.transform(Trees.scala:1680)
[ERROR] 	at scala.tools.nsc.transform.ExplicitOuter$OuterPathTransformer.transform(ExplicitOuter.scala:291)
[ERROR] 	at scala.tools.nsc.transform.ExplicitOuter$ExplicitOuterTransformer.transform(ExplicitOuter.scala:412)
[ERROR] 	at scala.tools.nsc.transform.ExplicitOuter$ExplicitOuterTransformer.transform(ExplicitOuter.scala:352)
[ERROR] 	at scala.reflect.api.Trees$Transformer.transformTemplate(Trees.scala:2563)
[ERROR] 	at scala.reflect.internal.Trees$$anonfun$itransform$4.apply(Trees.scala:1401)
[ERROR] 	at scala.reflect.internal.Trees$$anonfun$itransform$4.apply(Trees.scala:1400)
[ERROR] 	at scala.reflect.api.Trees$Transformer.atOwner(Trees.scala:2600)
[ERROR] 	at scala.tools.nsc.transform.TypingTransformers$TypingTransformer.atOwner(TypingTransformers.scala:30)
[ERROR] 	at scala.tools.nsc.transform.TypingTransformers$TypingTransformer.atOwner(TypingTransformers.scala:25)
[ERROR] 	at scala.tools.nsc.transform.TypingTransformers$TypingTransformer.atOwner(TypingTransformers.scala:17)
[ERROR] 	at scala.reflect.internal.Trees$class.itransform(Trees.scala:1399)
[ERROR] 	at scala.reflect.internal.SymbolTable.itransform(SymbolTable.scala:16)
[ERROR] 	at scala.reflect.internal.SymbolTable.itransform(SymbolTable.scala:16)
[ERROR] 	at scala.reflect.api.Trees$Transformer.transform(Trees.scala:2555)
[ERROR] 	at scala.tools.nsc.transform.TypingTransformers$TypingTransformer.transform(TypingTransformers.scala:44)
[ERROR] 	at scala.tools.nsc.transform.ExplicitOuter$OuterPathTransformer.scala$reflect$internal$Trees$UnderConstructionTransformer$$super$transform(ExplicitOuter.scala:219)
[ERROR] 	at scala.reflect.internal.Trees$UnderConstructionTransformer$class.transform(Trees.scala:1680)
[ERROR] 	at scala.tools.nsc.transform.ExplicitOuter$OuterPathTransformer.transform(ExplicitOuter.scala:291)
[ERROR] 	at scala.tools.nsc.transform.ExplicitOuter$ExplicitOuterTransformer.transform(ExplicitOuter.scala:496)
[ERROR] 	at scala.tools.nsc.transform.ExplicitOuter$ExplicitOuterTransformer.transform(ExplicitOuter.scala:352)
[ERROR] 	at scala.reflect.api.Trees$Transformer$$anonfun$transformStats$1.apply(Trees.scala:2589)
[ERROR] 	at scala.reflect.api.Trees$Transformer$$anonfun$transformStats$1.apply(Trees.scala:2587)
[ERROR] 	at scala.collection.immutable.List.loop$1(List.scala:172)
[ERROR] 	at scala.collection.immutable.List.mapConserve(List.scala:188)
[ERROR] 	at scala.reflect.api.Trees$Transformer.transformStats(Trees.scala:2587)
[ERROR] 	at scala.reflect.internal.Trees$$anonfun$itransform$7.apply(Trees.scala:1419)
[ERROR] 	at scala.reflect.internal.Trees$$anonfun$itransform$7.apply(Trees.scala:1419)
[ERROR] 	at scala.reflect.api.Trees$Transformer.atOwner(Trees.scala:2600)
[ERROR] 	at scala.tools.nsc.transform.TypingTransformers$TypingTransformer.atOwner(TypingTransformers.scala:30)
[ERROR] 	at scala.tools.nsc.transform.TypingTransformers$TypingTransformer.atOwner(TypingTransformers.scala:25)
[ERROR] 	at scala.tools.nsc.transform.TypingTransformers$TypingTransformer.atOwner(TypingTransformers.scala:17)
[ERROR] 	at scala.reflect.internal.Trees$class.itransform(Trees.scala:1418)
[ERROR] 	at scala.reflect.internal.SymbolTable.itransform(SymbolTable.scala:16)
[ERROR] 	at scala.reflect.internal.SymbolTable.itransform(SymbolTable.scala:16)
[ERROR] 	at scala.reflect.api.Trees$Transformer.transform(Trees.scala:2555)
[ERROR] 	at scala.tools.nsc.transform.TypingTransformers$TypingTransformer.scala$tools$nsc$transform$TypingTransformers$TypingTransformer$$super$transform(TypingTransformers.scala:40)
[ERROR] 	at scala.tools.nsc.transform.TypingTransformers$TypingTransformer$$anonfun$transform$2.apply(TypingTransformers.scala:42)
[ERROR] 	at scala.tools.nsc.transform.TypingTransformers$TypingTransformer$$anonfun$transform$2.apply(TypingTransformers.scala:42)
[ERROR] 	at scala.reflect.api.Trees$Transformer.atOwner(Trees.scala:2600)
[ERROR] 	at scala.tools.nsc.transform.TypingTransformers$TypingTransformer.atOwner(TypingTransformers.scala:30)
[ERROR] 	at scala.tools.nsc.transform.TypingTransformers$TypingTransformer.transform(TypingTransformers.scala:42)
[ERROR] 	at scala.tools.nsc.transform.ExplicitOuter$OuterPathTransformer.scala$reflect$internal$Trees$UnderConstructionTransformer$$super$transform(ExplicitOuter.scala:219)
[ERROR] 	at scala.reflect.internal.Trees$UnderConstructionTransformer$class.transform(Trees.scala:1680)
[ERROR] 	at scala.tools.nsc.transform.ExplicitOuter$OuterPathTransformer.transform(ExplicitOuter.scala:291)
[ERROR] 	at scala.tools.nsc.transform.ExplicitOuter$ExplicitOuterTransformer.transform(ExplicitOuter.scala:496)
[ERROR] 	at scala.tools.nsc.transform.ExplicitOuter$ExplicitOuterTransformer.transform(ExplicitOuter.scala:352)
[ERROR] 	at scala.tools.nsc.ast.Trees$Transformer.transformUnit(Trees.scala:147)
[ERROR] 	at scala.tools.nsc.transform.ExplicitOuter$ExplicitOuterTransformer.scala$tools$nsc$transform$ExplicitOuter$ExplicitOuterTransformer$$super$transformUnit(ExplicitOuter.scala:504)
[ERROR] 	at scala.tools.nsc.transform.ExplicitOuter$ExplicitOuterTransformer$$anonfun$transformUnit$1.apply(ExplicitOuter.scala:504)
[ERROR] 	at scala.tools.nsc.transform.ExplicitOuter$ExplicitOuterTransformer$$anonfun$transformUnit$1.apply(ExplicitOuter.scala:504)
[ERROR] 	at scala.reflect.internal.SymbolTable.enteringPhase(SymbolTable.scala:235)
[ERROR] 	at scala.reflect.internal.SymbolTable.exitingPhase(SymbolTable.scala:256)
[ERROR] 	at scala.tools.nsc.transform.ExplicitOuter$ExplicitOuterTransformer.transformUnit(ExplicitOuter.scala:504)
[ERROR] 	at scala.tools.nsc.transform.Transform$Phase.apply(Transform.scala:30)
[ERROR] 	at scala.tools.nsc.Global$GlobalPhase$$anonfun$applyPhase$1.apply$mcV$sp(Global.scala:428)
[ERROR] 	at scala.tools.nsc.Global$GlobalPhase.withCurrentUnit(Global.scala:419)
[ERROR] 	at scala.tools.nsc.Global$GlobalPhase.applyPhase(Global.scala:428)
[ERROR] 	at scala.tools.nsc.Global$GlobalPhase$$anonfun$run$1.apply(Global.scala:386)
[ERROR] 	at scala.tools.nsc.Global$GlobalPhase$$anonfun$run$1.apply(Global.scala:386)
[ERROR] 	at scala.collection.Iterator$class.foreach(Iterator.scala:743)
[ERROR] 	at scala.collection.AbstractIterator.foreach(Iterator.scala:1195)
[ERROR] 	at scala.tools.nsc.Global$GlobalPhase.run(Global.scala:386)
[ERROR] 	at scala.tools.nsc.Global$Run.compileUnitsInternal(Global.scala:1338)
[ERROR] 	at scala.tools.nsc.Global$Run.compileUnits(Global.scala:1325)
[ERROR] 	at scala.tools.nsc.Global$Run.compileSources(Global.scala:1320)
[ERROR] 	at scala.tools.nsc.Global$Run.compile(Global.scala:1418)
[ERROR] 	at scala.tools.nsc.Driver.doCompile(Driver.scala:32)
[ERROR] 	at scala.tools.nsc.MainClass.doCompile(Main.scala:23)
[ERROR] 	at scala.tools.nsc.Driver.process(Driver.scala:51)
[ERROR] 	at scala.tools.nsc.Driver.main(Driver.scala:64)
[ERROR] 	at scala.tools.nsc.Main.main(Main.scala)
[ERROR] 	... 6 more
[INFO]                                                                         
[INFO] ------------------------------------------------------------------------
[INFO] Skipping avocado: A Variant Caller, Distributed
[INFO] This project has been banned from the build due to previous failures.
[INFO] ------------------------------------------------------------------------
[INFO] ------------------------------------------------------------------------
[INFO] Reactor Summary:
[INFO] 
[INFO] avocado: A Variant Caller, Distributed ............ SUCCESS [3.973s]
[INFO] avocado-core: Core variant calling algorithms ..... FAILURE [31.239s]
[INFO] avocado-cli: Command line interface for a distributed variant caller  SKIPPED
[INFO] ------------------------------------------------------------------------
[INFO] BUILD FAILURE
[INFO] ------------------------------------------------------------------------
[INFO] Total time: 35.440s
[INFO] Finished at: Sun Dec 31 04:42:18 PST 2017
[INFO] Final Memory: 33M/1040M
[INFO] ------------------------------------------------------------------------
[ERROR] Failed to execute goal net.alchim31.maven:scala-maven-plugin:3.2.2:testCompile (scala-test-compile-first) on project avocado-core-spark2_2.11: wrap: org.apache.commons.exec.ExecuteException: Process exited with an error: 240 (Exit value: 240) -> [Help 1]
[ERROR] 
[ERROR] To see the full stack trace of the errors, re-run Maven with the -e switch.
[ERROR] Re-run Maven using the -X switch to enable full debug logging.
[ERROR] 
[ERROR] For more information about the errors and possible solutions, please read the following articles:
[ERROR] [Help 1] http://cwiki.apache.org/confluence/display/MAVEN/MojoExecutionException
[ERROR] 
[ERROR] After correcting the problems, you can resume the build with the command
[ERROR]   mvn <goals> -rf :avocado-core-spark2_2.11
Build step 'Execute shell' marked build as failure
Recording test results
ERROR: Step ?Publish JUnit test result report? failed: No test report files were found. Configuration error?
Sending e-mails to: fnothaft@berkeley.edu
Finished: FAILURE