FailedConsole Output

Started by timer
[EnvInject] - Loading node environment variables.
Building remotely on research-jenkins-worker-09 (ubuntu ubuntu-gpu research-09 ubuntu-avx2) in workspace /home/jenkins/workspace/bdg-formats
Wiping out workspace first.
Cloning the remote Git repository
Cloning repository https://github.com/bigdatagenomics/bdg-formats.git
 > git init /home/jenkins/workspace/bdg-formats # timeout=10
Fetching upstream changes from https://github.com/bigdatagenomics/bdg-formats.git
 > git --version # timeout=10
 > git fetch --tags --progress https://github.com/bigdatagenomics/bdg-formats.git +refs/heads/*:refs/remotes/origin/*
 > git config remote.origin.url https://github.com/bigdatagenomics/bdg-formats.git # timeout=10
 > git config --add remote.origin.fetch +refs/heads/*:refs/remotes/origin/* # timeout=10
 > git config remote.origin.url https://github.com/bigdatagenomics/bdg-formats.git # timeout=10
Fetching upstream changes from https://github.com/bigdatagenomics/bdg-formats.git
 > git fetch --tags --progress https://github.com/bigdatagenomics/bdg-formats.git +refs/heads/*:refs/remotes/origin/*
 > git rev-parse refs/remotes/origin/master^{commit} # timeout=10
 > git rev-parse refs/remotes/origin/origin/master^{commit} # timeout=10
Checking out Revision 78d10134057be1236fb818aacfba4baaad02b0e7 (refs/remotes/origin/master)
 > git config core.sparsecheckout # timeout=10
 > git checkout -f 78d10134057be1236fb818aacfba4baaad02b0e7
 > git rev-list 78d10134057be1236fb818aacfba4baaad02b0e7 # timeout=10
[bdg-formats] $ /home/jenkins/tools/hudson.tasks.Maven_MavenInstallation/Maven_3.1.1/bin/mvn clean test package
[INFO] Scanning for projects...
[INFO]                                                                         
[INFO] ------------------------------------------------------------------------
[INFO] Building Big Data Genomics: Avro Formats 0.13.1-SNAPSHOT
[INFO] ------------------------------------------------------------------------
[INFO] 
[INFO] --- maven-clean-plugin:2.5:clean (default-clean) @ bdg-formats ---
[INFO] 
[INFO] --- maven-enforcer-plugin:1.2:enforce (enforce-maven) @ bdg-formats ---
[INFO] 
[INFO] --- avro-maven-plugin:1.8.2:schema (schemas) @ bdg-formats ---
[INFO] 
[INFO] --- avro-maven-plugin:1.8.2:protocol (schemas) @ bdg-formats ---
[INFO] 
[INFO] --- avro-maven-plugin:1.8.2:idl-protocol (schemas) @ bdg-formats ---
[INFO] 
[INFO] --- maven-resources-plugin:2.6:resources (default-resources) @ bdg-formats ---
[INFO] Using 'UTF-8' encoding to copy filtered resources.
[INFO] Copying 1 resource
[INFO] 
[INFO] --- maven-compiler-plugin:3.8.0:compile (default-compile) @ bdg-formats ---
[INFO] Changes detected - recompiling the module!
[INFO] Compiling 23 source files to /home/jenkins/workspace/bdg-formats/target/classes
[INFO] 
[INFO] --- maven-resources-plugin:2.6:testResources (default-testResources) @ bdg-formats ---
[INFO] Using 'UTF-8' encoding to copy filtered resources.
[INFO] skip non existing resourceDirectory /home/jenkins/workspace/bdg-formats/src/test/resources
[INFO] 
[INFO] --- maven-compiler-plugin:3.8.0:testCompile (default-testCompile) @ bdg-formats ---
[INFO] No sources to compile
[INFO] 
[INFO] --- maven-surefire-plugin:2.12.4:test (default-test) @ bdg-formats ---
[INFO] No tests to run.
[INFO] 
[INFO] --- maven-enforcer-plugin:1.2:enforce (enforce-maven) @ bdg-formats ---
[INFO] 
[INFO] --- avro-maven-plugin:1.8.2:schema (schemas) @ bdg-formats ---
[INFO] 
[INFO] --- avro-maven-plugin:1.8.2:protocol (schemas) @ bdg-formats ---
[INFO] 
[INFO] --- avro-maven-plugin:1.8.2:idl-protocol (schemas) @ bdg-formats ---
[INFO] 
[INFO] --- maven-resources-plugin:2.6:resources (default-resources) @ bdg-formats ---
[INFO] Using 'UTF-8' encoding to copy filtered resources.
[INFO] Copying 1 resource
[INFO] 
[INFO] --- maven-compiler-plugin:3.8.0:compile (default-compile) @ bdg-formats ---
[INFO] Changes detected - recompiling the module!
[INFO] Compiling 23 source files to /home/jenkins/workspace/bdg-formats/target/classes
[INFO] 
[INFO] --- maven-resources-plugin:2.6:testResources (default-testResources) @ bdg-formats ---
[INFO] Using 'UTF-8' encoding to copy filtered resources.
[INFO] skip non existing resourceDirectory /home/jenkins/workspace/bdg-formats/src/test/resources
[INFO] 
[INFO] --- maven-compiler-plugin:3.8.0:testCompile (default-testCompile) @ bdg-formats ---
[INFO] No sources to compile
[INFO] 
[INFO] --- maven-surefire-plugin:2.12.4:test (default-test) @ bdg-formats ---
[INFO] No tests to run.
[INFO] Skipping execution of surefire because it has already been run for this configuration
[INFO] 
[INFO] --- maven-jar-plugin:2.4:jar (default-jar) @ bdg-formats ---
[INFO] Building jar: /home/jenkins/workspace/bdg-formats/target/bdg-formats-0.13.1-SNAPSHOT.jar
[INFO] ------------------------------------------------------------------------
[INFO] BUILD SUCCESS
[INFO] ------------------------------------------------------------------------
[INFO] Total time: 4.831s
[INFO] Finished at: Fri Aug 30 10:20:02 PDT 2019
[INFO] Final Memory: 30M/1570M
[INFO] ------------------------------------------------------------------------
[bdg-formats] $ /home/jenkins/tools/hudson.tasks.Maven_MavenInstallation/Maven_3.1.1/bin/mvn --settings=/home/jenkins/workspace/settings.xml deploy
[INFO] Scanning for projects...
[INFO]                                                                         
[INFO] ------------------------------------------------------------------------
[INFO] Building Big Data Genomics: Avro Formats 0.13.1-SNAPSHOT
[INFO] ------------------------------------------------------------------------
[INFO] 
[INFO] --- maven-enforcer-plugin:1.2:enforce (enforce-maven) @ bdg-formats ---
[INFO] 
[INFO] --- avro-maven-plugin:1.8.2:schema (schemas) @ bdg-formats ---
[INFO] 
[INFO] --- avro-maven-plugin:1.8.2:protocol (schemas) @ bdg-formats ---
[INFO] 
[INFO] --- avro-maven-plugin:1.8.2:idl-protocol (schemas) @ bdg-formats ---
[INFO] 
[INFO] --- maven-resources-plugin:2.6:resources (default-resources) @ bdg-formats ---
[INFO] Using 'UTF-8' encoding to copy filtered resources.
[INFO] Copying 1 resource
[INFO] 
[INFO] --- maven-compiler-plugin:3.8.0:compile (default-compile) @ bdg-formats ---
[INFO] Changes detected - recompiling the module!
[INFO] Compiling 23 source files to /home/jenkins/workspace/bdg-formats/target/classes
[INFO] 
[INFO] --- maven-resources-plugin:2.6:testResources (default-testResources) @ bdg-formats ---
[INFO] Using 'UTF-8' encoding to copy filtered resources.
[INFO] skip non existing resourceDirectory /home/jenkins/workspace/bdg-formats/src/test/resources
[INFO] 
[INFO] --- maven-compiler-plugin:3.8.0:testCompile (default-testCompile) @ bdg-formats ---
[INFO] No sources to compile
[INFO] 
[INFO] --- maven-surefire-plugin:2.12.4:test (default-test) @ bdg-formats ---
[INFO] No tests to run.
[INFO] 
[INFO] --- maven-jar-plugin:2.4:jar (default-jar) @ bdg-formats ---
[INFO] Building jar: /home/jenkins/workspace/bdg-formats/target/bdg-formats-0.13.1-SNAPSHOT.jar
[INFO] 
[INFO] --- maven-install-plugin:2.4:install (default-install) @ bdg-formats ---
[INFO] Installing /home/jenkins/workspace/bdg-formats/target/bdg-formats-0.13.1-SNAPSHOT.jar to /home/jenkins/.m2/repository/org/bdgenomics/bdg-formats/bdg-formats/0.13.1-SNAPSHOT/bdg-formats-0.13.1-SNAPSHOT.jar
[INFO] Installing /home/jenkins/workspace/bdg-formats/pom.xml to /home/jenkins/.m2/repository/org/bdgenomics/bdg-formats/bdg-formats/0.13.1-SNAPSHOT/bdg-formats-0.13.1-SNAPSHOT.pom
[INFO] 
[INFO] --- maven-deploy-plugin:2.7:deploy (default-deploy) @ bdg-formats ---
Downloading: https://oss.sonatype.org/content/repositories/snapshots/org/bdgenomics/bdg-formats/bdg-formats/0.13.1-SNAPSHOT/maven-metadata.xml

[WARNING] Could not transfer metadata org.bdgenomics.bdg-formats:bdg-formats:0.13.1-SNAPSHOT/maven-metadata.xml from/to sonatype-nexus-snapshots (https://oss.sonatype.org/content/repositories/snapshots/): Failed to transfer file: https://oss.sonatype.org/content/repositories/snapshots/org/bdgenomics/bdg-formats/bdg-formats/0.13.1-SNAPSHOT/maven-metadata.xml. Return code is: 503 , ReasonPhrase:Service Temporarily Unavailable.
[INFO] ------------------------------------------------------------------------
[INFO] BUILD FAILURE
[INFO] ------------------------------------------------------------------------
[INFO] Total time: 6.670s
[INFO] Finished at: Fri Aug 30 10:20:10 PDT 2019
[INFO] Final Memory: 34M/2298M
[INFO] ------------------------------------------------------------------------
[ERROR] Failed to execute goal org.apache.maven.plugins:maven-deploy-plugin:2.7:deploy (default-deploy) on project bdg-formats: Failed to retrieve remote metadata org.bdgenomics.bdg-formats:bdg-formats:0.13.1-SNAPSHOT/maven-metadata.xml: Could not transfer metadata org.bdgenomics.bdg-formats:bdg-formats:0.13.1-SNAPSHOT/maven-metadata.xml from/to sonatype-nexus-snapshots (https://oss.sonatype.org/content/repositories/snapshots/): Failed to transfer file: https://oss.sonatype.org/content/repositories/snapshots/org/bdgenomics/bdg-formats/bdg-formats/0.13.1-SNAPSHOT/maven-metadata.xml. Return code is: 503 , ReasonPhrase:Service Temporarily Unavailable. -> [Help 1]
[ERROR] 
[ERROR] To see the full stack trace of the errors, re-run Maven with the -e switch.
[ERROR] Re-run Maven using the -X switch to enable full debug logging.
[ERROR] 
[ERROR] For more information about the errors and possible solutions, please read the following articles:
[ERROR] [Help 1] http://cwiki.apache.org/confluence/display/MAVEN/MojoExecutionException
Build step 'Invoke top-level Maven targets' marked build as failure
Sending e-mails to: massie+jenkins@berkeley.edu fnothaft@berkeley.edu
Setting commit status on GitHub for https://github.com/bigdatagenomics/bdg-formats/commit/78d10134057be1236fb818aacfba4baaad02b0e7
Warning: you have no plugins providing access control for builds, so falling back to legacy behavior of permitting any downstream builds to be triggered
Finished: FAILURE