FailedConsole Output

Started by timer
[EnvInject] - Loading node environment variables.
Building remotely on research-jenkins-worker-09 (ubuntu ubuntu-gpu research-09 ubuntu-avx2) in workspace /home/jenkins/workspace/bdg-formats
Wiping out workspace first.
Cloning the remote Git repository
Cloning repository https://github.com/bigdatagenomics/bdg-formats.git
 > git init /home/jenkins/workspace/bdg-formats # timeout=10
Fetching upstream changes from https://github.com/bigdatagenomics/bdg-formats.git
 > git --version # timeout=10
 > git fetch --tags --progress https://github.com/bigdatagenomics/bdg-formats.git +refs/heads/*:refs/remotes/origin/*
 > git config remote.origin.url https://github.com/bigdatagenomics/bdg-formats.git # timeout=10
 > git config --add remote.origin.fetch +refs/heads/*:refs/remotes/origin/* # timeout=10
 > git config remote.origin.url https://github.com/bigdatagenomics/bdg-formats.git # timeout=10
Fetching upstream changes from https://github.com/bigdatagenomics/bdg-formats.git
 > git fetch --tags --progress https://github.com/bigdatagenomics/bdg-formats.git +refs/heads/*:refs/remotes/origin/*
 > git rev-parse refs/remotes/origin/master^{commit} # timeout=10
 > git rev-parse refs/remotes/origin/origin/master^{commit} # timeout=10
Checking out Revision 4ab3aa900fa460113d279a41f9130039377f95fe (refs/remotes/origin/master)
 > git config core.sparsecheckout # timeout=10
 > git checkout -f 4ab3aa900fa460113d279a41f9130039377f95fe
 > git rev-list 4ab3aa900fa460113d279a41f9130039377f95fe # timeout=10
[bdg-formats] $ /home/jenkins/tools/hudson.tasks.Maven_MavenInstallation/Maven_3.1.1/bin/mvn clean test package
[INFO] Scanning for projects...
[INFO]                                                                         
[INFO] ------------------------------------------------------------------------
[INFO] Building Big Data Genomics: Avro Formats 0.16.0-SNAPSHOT
[INFO] ------------------------------------------------------------------------
Downloading: http://repo.maven.apache.org/maven2/org/apache/maven/plugins/maven-resources-plugin/2.6/maven-resources-plugin-2.6.pom

[INFO] ------------------------------------------------------------------------
[INFO] BUILD FAILURE
[INFO] ------------------------------------------------------------------------
[INFO] Total time: 0.484s
[INFO] Finished at: Wed Aug 19 17:38:48 PDT 2020
[INFO] Final Memory: 24M/1963M
[INFO] ------------------------------------------------------------------------
[ERROR] Plugin org.apache.maven.plugins:maven-resources-plugin:2.6 or one of its dependencies could not be resolved: Failed to read artifact descriptor for org.apache.maven.plugins:maven-resources-plugin:jar:2.6: Could not transfer artifact org.apache.maven.plugins:maven-resources-plugin:pom:2.6 from/to central (http://repo.maven.apache.org/maven2): Failed to transfer file: http://repo.maven.apache.org/maven2/org/apache/maven/plugins/maven-resources-plugin/2.6/maven-resources-plugin-2.6.pom. Return code is: 501 , ReasonPhrase:HTTPS Required. -> [Help 1]
[ERROR] 
[ERROR] To see the full stack trace of the errors, re-run Maven with the -e switch.
[ERROR] Re-run Maven using the -X switch to enable full debug logging.
[ERROR] 
[ERROR] For more information about the errors and possible solutions, please read the following articles:
[ERROR] [Help 1] http://cwiki.apache.org/confluence/display/MAVEN/PluginResolutionException
Build step 'Invoke top-level Maven targets' marked build as failure
Sending e-mails to: heuermh@berkeley.edu fnothaft@berkeley.edu
Setting commit status on GitHub for https://github.com/bigdatagenomics/bdg-formats/commit/4ab3aa900fa460113d279a41f9130039377f95fe
Warning: you have no plugins providing access control for builds, so falling back to legacy behavior of permitting any downstream builds to be triggered
Finished: FAILURE