Console Output

GitHub pull request #135 of commit ae737362d59902f9d8d462921941a7ca3484163b, no merge conflicts.
Running as SYSTEM
Setting status of ae737362d59902f9d8d462921941a7ca3484163b to PENDING with url https://amplab.cs.berkeley.edu/jenkins/job/confluo-prb/387/ and message: 'Build started for merge commit.'
[EnvInject] - Loading node environment variables.
Building remotely on amp-jenkins-staging-worker-02 (ubuntu ubuntu-gpu ubuntu-avx2 staging-02 staging) in workspace /home/jenkins/workspace/confluo-prb
[WS-CLEANUP] Deleting project workspace...
[WS-CLEANUP] Done
The recommended git tool is: NONE
using credential 63dd026e-dd71-456a-94d2-d67721ce74cc
Cloning the remote Git repository
Cloning repository git@github.com:ucbrise/confluo.git
 > git init /home/jenkins/workspace/confluo-prb # timeout=10
Fetching upstream changes from git@github.com:ucbrise/confluo.git
 > git --version # timeout=10
 > git --version # 'git version 2.7.4'
using GIT_SSH to set credentials private repo key
 > git fetch --tags --progress git@github.com:ucbrise/confluo.git +refs/heads/*:refs/remotes/origin/* # timeout=10
 > git config remote.origin.url git@github.com:ucbrise/confluo.git # timeout=10
 > git config --add remote.origin.fetch +refs/heads/*:refs/remotes/origin/* # timeout=10
 > git config remote.origin.url git@github.com:ucbrise/confluo.git # timeout=10
Fetching upstream changes from git@github.com:ucbrise/confluo.git
using GIT_SSH to set credentials private repo key
 > git fetch --tags --progress git@github.com:ucbrise/confluo.git +refs/pull/*:refs/remotes/origin/pr/* # timeout=10
 > git rev-parse ae737362d59902f9d8d462921941a7ca3484163b^{commit} # timeout=10
Checking out Revision ae737362d59902f9d8d462921941a7ca3484163b (detached)
 > git config core.sparsecheckout # timeout=10
 > git checkout -f ae737362d59902f9d8d462921941a7ca3484163b # timeout=10
Commit message: "remove useless test"
First time build. Skipping changelog.
[confluo-prb] $ /bin/sh -xe /tmp/jenkins7302093450434429682.sh
+ export BOOST_ROOT=/opt/rise/boost
+ pgrep confluod
+ rm -rf build
+ mkdir -p build
+ cd build
+ cmake ..
-- The C compiler identification is GNU 5.4.0
-- The CXX compiler identification is GNU 5.4.0
-- Check for working C compiler: /usr/bin/cc
-- Check for working C compiler: /usr/bin/cc -- works
-- Detecting C compiler ABI info
-- Detecting C compiler ABI info - done
-- Detecting C compile features
-- Detecting C compile features - done
-- Check for working CXX compiler: /usr/bin/c++
-- Check for working CXX compiler: /usr/bin/c++ -- works
-- Detecting CXX compiler ABI info
-- Detecting CXX compiler ABI info - done
-- Detecting CXX compile features
-- Detecting CXX compile features - done
-- ----------------------------------------------------------
-- Confluo version:                          0.1.0
-- Build configuration Summary
--   Build RPC Framework:                    ON
--     Build python client libraries:        ON
--     Build java client libraries:          ON
--   Build with unit tests:                  ON
--   Build documentation:                    OFF
--   Build examples:                         ON
-- ----------------------------------------------------------
-- Looking for pthread.h
-- Looking for pthread.h - found
-- Looking for pthread_create
-- Looking for pthread_create - not found
-- Looking for pthread_create in pthreads
-- Looking for pthread_create in pthreads - not found
-- Looking for pthread_create in pthread
-- Looking for pthread_create in pthread - found
-- Found Threads: TRUE  
-- Boost version: 1.62.0
-- Boost include dir: /opt/rise/boost/include
-- GTest include dir: /home/jenkins/workspace/confluo-prb/build/external/gtest/include
-- GTest static library: /home/jenkins/workspace/confluo-prb/build/external/gtest/lib/libgtest.a
-- GTest main static library: /home/jenkins/workspace/confluo-prb/build/external/gtest/lib/libgtest_main.a
-- Jemalloc library: /home/jenkins/workspace/confluo-prb/build/external/jemalloc/lib/libjemalloc.a
-- Thrift include dir: /home/jenkins/workspace/confluo-prb/build/external/thrift/include
-- Thrift static library: /home/jenkins/workspace/confluo-prb/build/external/thrift/lib/libthrift.a
-- Found PythonInterp: /home/jenkins/anaconda2/bin/python (found version "2.7.12") 
-- Found setuptools: /home/jenkins/anaconda2/lib/python2.7/site-packages/setuptools  
-- Found Java: /usr/lib/jvm/java-8-oracle/bin/java (found version "1.8.0.191") 
-- Found Ant: /usr/bin/ant  
-- Configuring done
-- Generating done
-- Build files have been written to: /home/jenkins/workspace/confluo-prb/build
+ make -j4
Scanning dependencies of target googletest
Scanning dependencies of target jemalloc
Scanning dependencies of target thrift
Scanning dependencies of target lz4
[  1%] Creating directories for 'jemalloc'
[  2%] Creating directories for 'googletest'
[  3%] Creating directories for 'thrift'
[  4%] Creating directories for 'lz4'
[  5%] Performing download step (download, verify and extract) for 'jemalloc'
[  5%] Performing download step (download, verify and extract) for 'thrift'
-- downloading...
     src='http://archive.apache.org/dist/thrift/0.11.0/thrift-0.11.0.tar.gz'
     dst='/home/jenkins/workspace/confluo-prb/build/thrift-prefix/src/thrift-0.11.0.tar.gz'
     timeout='none'
-- downloading...
     src='https://github.com/jemalloc/jemalloc/releases/download/5.0.1/jemalloc-5.0.1.tar.bz2'
     dst='/home/jenkins/workspace/confluo-prb/build/external/jemalloc/src/jemalloc-5.0.1.tar.bz2'
     timeout='none'
[  5%] Performing download step (download, verify and extract) for 'lz4'
[  6%] Performing download step (download, verify and extract) for 'googletest'
-- downloading...
     src='https://github.com/lz4/lz4/archive/v1.8.2.tar.gz'
     dst='/home/jenkins/workspace/confluo-prb/build/lz4-prefix/src/v1.8.2.tar.gz'
     timeout='none'
-- downloading...
     src='https://github.com/google/googletest/archive/release-1.8.0.tar.gz'
     dst='/home/jenkins/workspace/confluo-prb/build/googletest-prefix/src/release-1.8.0.tar.gz'
     timeout='none'
-- [download 0% complete]
-- [download 77% complete]
-- [download 100% complete]
-- [download 100% complete]
-- [download 100% complete]
-- [download 1% complete]
-- [download 0% complete]
-- [download 1% complete]
-- [download 2% complete]
-- [download 3% complete]
-- [download 4% complete]
-- [download 5% complete]
-- [download 6% complete]
-- [download 7% complete]
-- [download 8% complete]
-- [download 9% complete]
-- [download 10% complete]
-- [download 11% complete]
-- [download 12% complete]
-- [download 13% complete]
-- [download 14% complete]
-- [download 15% complete]
-- [download 16% complete]
-- [download 17% complete]
-- [download 18% complete]
-- [download 19% complete]
-- [download 20% complete]
-- [download 21% complete]
-- [download 22% complete]
-- [download 23% complete]
-- [download 24% complete]
-- [download 25% complete]
-- [download 26% complete]
-- [download 27% complete]
-- [download 28% complete]
-- [download 29% complete]
-- [download 30% complete]
-- [download 31% complete]
-- [download 32% complete]
-- [download 33% complete]
-- [download 34% complete]
-- [download 35% complete]
-- [download 36% complete]
-- [download 37% complete]
-- [download 38% complete]
-- [download 39% complete]
-- [download 40% complete]
-- [download 41% complete]
-- [download 42% complete]
-- [download 43% complete]
-- [download 46% complete]
-- [download 49% complete]
-- [download 52% complete]
-- [download 56% complete]
-- [download 57% complete]
-- [download 60% complete]
-- [download 63% complete]
-- [download 66% complete]
-- [download 70% complete]
-- [download 73% complete]
-- [download 76% complete]
-- [download 77% complete]
-- [download 81% complete]
-- [download 84% complete]
-- [download 87% complete]
-- [download 88% complete]
-- [download 91% complete]
-- [download 94% complete]
-- [download 98% complete]
-- [download 100% complete]
-- downloading... done
-- verifying file...
     file='/home/jenkins/workspace/confluo-prb/build/external/jemalloc/src/jemalloc-5.0.1.tar.bz2'
-- verifying file... warning: did not verify file - no URL_HASH specified?
-- extracting...
     src='/home/jenkins/workspace/confluo-prb/build/external/jemalloc/src/jemalloc-5.0.1.tar.bz2'
     dst='/home/jenkins/workspace/confluo-prb/build/external/jemalloc/src/jemalloc'
-- extracting... [tar xfz]
-- [download 2% complete]
-- [download 3% complete]
-- [download 0% complete]
-- [download 1% complete]
-- extracting... [analysis]
-- extracting... [rename]
-- extracting... [clean up]
-- extracting... done
-- [download 2% complete]
-- [download 3% complete]
[  7%] No patch step for 'jemalloc'
[  7%] No update step for 'jemalloc'
-- [download 4% complete]
[  8%] Performing configure step for 'jemalloc'
-- [download 5% complete]
-- [download 4% complete]
-- [download 5% complete]
-- [download 6% complete]
-- [download 7% complete]
-- [download 6% complete]
-- [download 8% complete]
-- [download 9% complete]
-- [download 10% complete]
-- [download 11% complete]
-- [download 12% complete]
-- [download 13% complete]
-- [download 14% complete]
-- [download 15% complete]
-- [download 16% complete]
-- [download 7% complete]
-- [download 17% complete]
-- [download 18% complete]
-- [download 19% complete]
-- [download 20% complete]
-- [download 21% complete]
-- [download 22% complete]
-- [download 23% complete]
-- [download 24% complete]
-- [download 25% complete]
-- [download 26% complete]
-- [download 28% complete]
-- [download 29% complete]
-- [download 30% complete]
-- [download 32% complete]
-- [download 33% complete]
-- [download 8% complete]
-- [download 34% complete]
-- [download 35% complete]
-- [download 37% complete]
-- [download 38% complete]
-- [download 39% complete]
-- [download 41% complete]
-- [download 42% complete]
-- [download 43% complete]
-- [download 44% complete]
-- [download 46% complete]
-- [download 47% complete]
-- [download 48% complete]
-- [download 49% complete]
-- [download 51% complete]
-- [download 52% complete]
-- [download 53% complete]
-- [download 55% complete]
-- [download 56% complete]
-- [download 57% complete]
-- [download 58% complete]
-- [download 60% complete]
-- [download 61% complete]
-- [download 62% complete]
-- [download 64% complete]
-- downloading... done
-- verifying file...
     file='/home/jenkins/workspace/confluo-prb/build/lz4-prefix/src/v1.8.2.tar.gz'
-- verifying file... warning: did not verify file - no URL_HASH specified?
-- [download 65% complete]
-- [download 66% complete]
-- [download 67% complete]
-- extracting...
     src='/home/jenkins/workspace/confluo-prb/build/lz4-prefix/src/v1.8.2.tar.gz'
     dst='/home/jenkins/workspace/confluo-prb/build/lz4-prefix/src/lz4'
-- extracting... [tar xfz]
-- [download 69% complete]
-- [download 70% complete]
-- [download 71% complete]
-- [download 72% complete]
-- [download 74% complete]
-- [download 75% complete]
-- [download 76% complete]
-- [download 78% complete]
-- [download 79% complete]
-- [download 80% complete]
-- [download 81% complete]
-- extracting... [analysis]
-- [download 83% complete]
-- extracting... [rename]
-- [download 84% complete]
-- [download 85% complete]
-- extracting... [clean up]
-- extracting... done
-- [download 87% complete]
-- [download 88% complete]
-- [download 89% complete]
-- [download 90% complete]
-- [download 92% complete]
-- [download 93% complete]
-- [download 94% complete]
-- [download 95% complete]
-- [download 97% complete]
-- [download 98% complete]
-- [download 99% complete]
-- [download 100% complete]
-- downloading... done
-- verifying file...
     file='/home/jenkins/workspace/confluo-prb/build/googletest-prefix/src/release-1.8.0.tar.gz'
-- verifying file... warning: did not verify file - no URL_HASH specified?
[  9%] No patch step for 'lz4'
-- extracting...
     src='/home/jenkins/workspace/confluo-prb/build/googletest-prefix/src/release-1.8.0.tar.gz'
     dst='/home/jenkins/workspace/confluo-prb/build/googletest-prefix/src/googletest'
-- extracting... [tar xfz]
[ 10%] No update step for 'lz4'
[ 10%] No configure step for 'lz4'
-- extracting... [analysis]
-- extracting... [rename]
-- extracting... [clean up]
-- extracting... done
[ 11%] No patch step for 'googletest'
[ 12%] Performing build step for 'lz4'
make[3]: warning: jobserver unavailable: using -j1.  Add '+' to parent make rule.
compiling static library
[ 12%] No update step for 'googletest'
-- [download 9% complete]
-- [download 10% complete]
-- [download 11% complete]
-- [download 12% complete]
-- [download 13% complete]
-- [download 14% complete]
-- [download 15% complete]
-- [download 16% complete]
[ 13%] Performing configure step for 'googletest'
-- The C compiler identification is GNU 5.4.0
-- The CXX compiler identification is GNU 5.4.0
-- [download 17% complete]
-- Check for working C compiler: /usr/bin/cc
-- [download 18% complete]
-- Check for working C compiler: /usr/bin/cc -- works
-- Detecting C compiler ABI info
-- [download 19% complete]
-- Detecting C compiler ABI info - done
-- Detecting C compile features
-- [download 20% complete]
-- [download 21% complete]
-- [download 22% complete]
-- [download 23% complete]
-- [download 24% complete]
-- [download 25% complete]
-- [download 26% complete]
-- [download 27% complete]
-- [download 28% complete]
-- [download 29% complete]
-- Detecting C compile features - done
-- Check for working CXX compiler: /usr/bin/c++
-- [download 30% complete]
-- [download 31% complete]
-- Check for working CXX compiler: /usr/bin/c++ -- works
-- Detecting CXX compiler ABI info
-- [download 32% complete]
-- [download 33% complete]
-- [download 34% complete]
-- [download 35% complete]
-- [download 36% complete]
-- Detecting CXX compiler ABI info - done
-- Detecting CXX compile features
-- [download 37% complete]
-- [download 38% complete]
-- [download 39% complete]
-- [download 40% complete]
-- [download 41% complete]
-- [download 42% complete]
-- [download 43% complete]
-- [download 44% complete]
-- [download 45% complete]
-- [download 46% complete]
-- Detecting CXX compile features - done
-- [download 47% complete]
-- Found PythonInterp: /home/jenkins/anaconda2/bin/python (found version "2.7.12") 
-- Looking for pthread.h
-- [download 48% complete]
-- [download 49% complete]
-- [download 50% complete]
-- Looking for pthread.h - found
-- Looking for pthread_create
-- [download 51% complete]
-- Looking for pthread_create - not found
-- Looking for pthread_create in pthreads
-- Looking for pthread_create in pthreads - not found
-- Looking for pthread_create in pthread
-- Looking for pthread_create in pthread - found
-- Found Threads: TRUE  
-- Configuring done
-- Generating done
-- Build files have been written to: /home/jenkins/workspace/confluo-prb/build/googletest-prefix/src/googletest-build
[ 13%] Performing build step for 'googletest'
Scanning dependencies of target gmock
[  9%] Building CXX object googlemock/CMakeFiles/gmock.dir/__/googletest/src/gtest-all.cc.o
-- [download 52% complete]
-- [download 53% complete]
-- [download 54% complete]
-- [download 55% complete]
-- [download 56% complete]
-- [download 57% complete]
-- [download 58% complete]
-- [download 59% complete]
-- [download 60% complete]
-- [download 61% complete]
-- [download 62% complete]
-- [download 63% complete]
-- [download 64% complete]
-- [download 65% complete]
-- [download 66% complete]
-- [download 67% complete]
-- [download 68% complete]
-- [download 69% complete]
-- [download 70% complete]
-- [download 71% complete]
-- [download 72% complete]
-- [download 73% complete]
-- [download 74% complete]
-- [download 75% complete]
-- [download 76% complete]
-- [download 77% complete]
-- [download 78% complete]
-- [download 79% complete]
-- [download 80% complete]
-- [download 81% complete]
-- [download 82% complete]
-- [download 83% complete]
-- [download 84% complete]
-- [download 85% complete]
-- [download 86% complete]
-- [download 87% complete]
-- [download 88% complete]
-- [download 89% complete]
-- [download 90% complete]
-- [download 91% complete]
-- [download 92% complete]
-- [download 93% complete]
-- [download 94% complete]
-- [download 95% complete]
-- [download 96% complete]
-- [download 97% complete]
-- [download 98% complete]
-- [download 99% complete]
-- [download 100% complete]
-- downloading... done
-- verifying file...
     file='/home/jenkins/workspace/confluo-prb/build/thrift-prefix/src/thrift-0.11.0.tar.gz'
-- verifying file... warning: did not verify file - no URL_HASH specified?
-- extracting...
     src='/home/jenkins/workspace/confluo-prb/build/thrift-prefix/src/thrift-0.11.0.tar.gz'
     dst='/home/jenkins/workspace/confluo-prb/build/thrift-prefix/src/thrift'
-- extracting... [tar xfz]
-- extracting... [analysis]
-- extracting... [rename]
-- extracting... [clean up]
-- extracting... done
[ 14%] No patch step for 'thrift'
[ 15%] No update step for 'thrift'
[ 15%] Performing configure step for 'thrift'
-- The C compiler identification is GNU 5.4.0
-- The CXX compiler identification is GNU 5.4.0
-- Check for working C compiler: /usr/bin/cc
-- Check for working C compiler: /usr/bin/cc -- works
-- Detecting C compiler ABI info
-- Detecting C compiler ABI info - done
-- Detecting C compile features
compiling dynamic library 1.8.2
-- Detecting C compile features - done
-- Check for working CXX compiler: /usr/bin/c++
-- Check for working CXX compiler: /usr/bin/c++ -- works
-- Detecting CXX compiler ABI info
-- Detecting CXX compiler ABI info - done
-- Detecting CXX compile features
-- Detecting CXX compile features - done
-- Parsed Thrift package version: 0.11.0
-- Parsed Thrift version: 0.11.0 (0.1.0)
-- Setting C++11 as the default language level.
-- To specify a different C++ language level, set CMAKE_CXX_STANDARD
-- Could NOT find RUN_HASKELL (missing:  RUN_HASKELL) 
-- Could NOT find CABAL (missing:  CABAL) 
-- Looking for arpa/inet.h
-- Looking for arpa/inet.h - found
-- Looking for fcntl.h
-- Looking for fcntl.h - found
-- Looking for getopt.h
-- Looking for getopt.h - found
-- Looking for inttypes.h
-- Looking for inttypes.h - found
-- Looking for netdb.h
-- Looking for netdb.h - found
-- Looking for netinet/in.h
-- Looking for netinet/in.h - found
-- Looking for stdint.h
-- Looking for stdint.h - found
-- Looking for unistd.h
-- Looking for unistd.h - found
-- Looking for pthread.h
-- Looking for pthread.h - found
-- Looking for sys/time.h
-- Looking for sys/time.h - found
-- Looking for sys/param.h
-- Looking for sys/param.h - found
-- Looking for sys/resource.h
-- Looking for sys/resource.h - found
-- Looking for sys/socket.h
-- Looking for sys/socket.h - found
-- Looking for sys/stat.h
-- Looking for sys/stat.h - found
-- Looking for sys/un.h
-- Looking for sys/un.h - found
-- Looking for sys/poll.h
-- Looking for sys/poll.h - found
-- Looking for sys/select.h
-- jemalloc configure command succeeded.  See also /home/jenkins/workspace/confluo-prb/build/external/jemalloc/src/jemalloc-stamp/jemalloc-configure-*.log
[ 15%] Performing build step for 'jemalloc'
-- Looking for sys/select.h - found
-- Looking for sched.h
-- Looking for sched.h - found
-- Looking for string.h
-- Looking for string.h - found
-- Looking for strings.h
-- Looking for strings.h - found
-- Looking for gethostbyname
-- Looking for gethostbyname - found
-- Looking for gethostbyname_r
-- Looking for gethostbyname_r - found
-- Looking for strerror_r
-- Looking for strerror_r - found
-- Looking for sched_get_priority_max
-- Looking for sched_get_priority_max - found
-- Looking for sched_get_priority_min
-- Looking for sched_get_priority_min - found
-- Performing Test STRERROR_R_CHAR_P
-- Performing Test STRERROR_R_CHAR_P - Success
-- Looking for pthread.h
-- Looking for pthread.h - found
-- Looking for pthread_create
-- Looking for pthread_create - not found
-- Looking for pthread_create in pthreads
-- Looking for pthread_create in pthreads - not found
-- Looking for pthread_create in pthread
-- Looking for pthread_create in pthread - found
-- Found Threads: TRUE  
-- Building without tests
-- Found OpenSSL: /usr/lib/x86_64-linux-gnu/libssl.so;/usr/lib/x86_64-linux-gnu/libcrypto.so (found version "1.0.2g") 
-- ----------------------------------------------------------
-- Thrift version:                               0.11.0 (0.1.0)
-- Thrift package version:                       0.11.0
-- Build configuration Summary
--   Build Thrift compiler:                      OFF
--   Build compiler plugin support:              OFF
--   Build with unit tests:                      OFF
--    - Disabled because BUILD_THRIFT=OFF and no valid THRIFT_COMPILER is given
--   Build examples:                             OFF
--    - Disabled because BUILD_THRIFT=OFF and no valid THRIFT_COMPILER is given
--   Build Thrift libraries:                     ON
--  Language libraries:
--   Build C++ library:                          ON
--     C++ Language Level:                       C++11 [fallback to earlier if compiler does not support it]
--   Build C (GLib) library:                     OFF
--    - Disabled by WITH_C_GLIB=OFF
--    - GLib missing
--   Build Java library:                         OFF
--    - Disabled by WITH_JAVA=OFF
--   Build Python library:                       OFF
--    - Disabled by WITH_PYTHON=OFF
--   Build Haskell library:                      OFF
--    - Disabled by WITH_HASKELL=OFF
--    - GHC missing
--    - Cabal missing
--  Library features:
--   Build shared libraries:                     OFF
--   Build static libraries:                     ON
--   Build with Boost static link library:       OFF
--   Build with Boost thread support:            OFF
--   Build with boost/tr1/functional (forced)    OFF
--   Build with boost/smart_ptr (forced)         OFF
--   Build with C++ std::thread support:         OFF
--   Build with libevent support:                OFF
--   Build with OpenSSL support:                 OFF
--   Build with Qt4 support:                     OFF
--   Build with Qt5 support:                     OFF
--   Build with ZLIB support:                    OFF
-- ----------------------------------------------------------
-- Configuring done
-- Generating done
-- Build files have been written to: /home/jenkins/workspace/confluo-prb/build/thrift-prefix/src/thrift-build
[ 16%] Performing build step for 'thrift'
Scanning dependencies of target thrift_static
[  2%] Building CXX object lib/cpp/CMakeFiles/thrift_static.dir/src/thrift/TApplicationException.cpp.o
[  5%] Building CXX object lib/cpp/CMakeFiles/thrift_static.dir/src/thrift/TOutput.cpp.o
[ 18%] Building CXX object googlemock/CMakeFiles/gmock.dir/src/gmock-all.cc.o
creating versioned links
[ 17%] No install step for 'lz4'
[ 18%] Completed 'lz4'
[  7%] Building CXX object lib/cpp/CMakeFiles/thrift_static.dir/src/thrift/async/TAsyncChannel.cpp.o
[ 18%] Built target lz4
Scanning dependencies of target confluoutils
[ 19%] Building CXX object libutils/CMakeFiles/confluoutils.dir/src/utils/assertions.cc.o
[ 20%] Building CXX object libutils/CMakeFiles/confluoutils.dir/src/utils/cmd_parse.cc.o
[ 10%] Building CXX object lib/cpp/CMakeFiles/thrift_static.dir/src/thrift/async/TConcurrentClientSyncInfo.cpp.o
[ 13%] Building CXX object lib/cpp/CMakeFiles/thrift_static.dir/src/thrift/concurrency/ThreadManager.cpp.o
[ 20%] Building CXX object libutils/CMakeFiles/confluoutils.dir/src/utils/config_utils.cc.o
[ 27%] Linking CXX static library libgmock.a
[ 27%] Built target gmock
Scanning dependencies of target gmock_main
[ 36%] Building CXX object googlemock/CMakeFiles/gmock_main.dir/__/googletest/src/gtest-all.cc.o
[ 15%] Building CXX object lib/cpp/CMakeFiles/thrift_static.dir/src/thrift/concurrency/TimerManager.cpp.o
[ 21%] Building CXX object libutils/CMakeFiles/confluoutils.dir/src/utils/error_handling.cc.o
[ 22%] Building CXX object libutils/CMakeFiles/confluoutils.dir/src/utils/file_utils.cc.o
[ 23%] Building CXX object libutils/CMakeFiles/confluoutils.dir/src/utils/io_utils.cc.o
[ 18%] Building CXX object lib/cpp/CMakeFiles/thrift_static.dir/src/thrift/concurrency/Util.cpp.o
[ 23%] Building CXX object libutils/CMakeFiles/confluoutils.dir/src/utils/logger.cc.o
[ 21%] Building CXX object lib/cpp/CMakeFiles/thrift_static.dir/src/thrift/processor/PeekProcessor.cpp.o
[ 24%] Building CXX object libutils/CMakeFiles/confluoutils.dir/src/utils/math_utils.cc.o
[ 25%] Building CXX object libutils/CMakeFiles/confluoutils.dir/src/utils/mmap_utils.cc.o
[ 25%] Building CXX object libutils/CMakeFiles/confluoutils.dir/src/utils/rand_utils.cc.o
[ 26%] Building CXX object libutils/CMakeFiles/confluoutils.dir/src/utils/string_utils.cc.o
[ 23%] Building CXX object lib/cpp/CMakeFiles/thrift_static.dir/src/thrift/protocol/TBase64Utils.cpp.o
[ 26%] Building CXX object lib/cpp/CMakeFiles/thrift_static.dir/src/thrift/protocol/TDebugProtocol.cpp.o
[ 27%] Building CXX object libutils/CMakeFiles/confluoutils.dir/src/utils/time_utils.cc.o
[ 27%] Linking CXX static library libconfluoutils.a
[ 27%] Built target confluoutils
Scanning dependencies of target gtest
[ 45%] Building CXX object googlemock/gtest/CMakeFiles/gtest.dir/src/gtest-all.cc.o
[ 28%] Building CXX object lib/cpp/CMakeFiles/thrift_static.dir/src/thrift/protocol/TJSONProtocol.cpp.o
[ 54%] Building CXX object googlemock/CMakeFiles/gmock_main.dir/src/gmock-all.cc.o
[ 31%] Building CXX object lib/cpp/CMakeFiles/thrift_static.dir/src/thrift/protocol/TMultiplexedProtocol.cpp.o
[ 34%] Building CXX object lib/cpp/CMakeFiles/thrift_static.dir/src/thrift/protocol/TProtocol.cpp.o
[ 36%] Building CXX object lib/cpp/CMakeFiles/thrift_static.dir/src/thrift/transport/TTransportException.cpp.o
[ 39%] Building CXX object lib/cpp/CMakeFiles/thrift_static.dir/src/thrift/transport/TFDTransport.cpp.o
[ 63%] Building CXX object googlemock/CMakeFiles/gmock_main.dir/src/gmock_main.cc.o
[ 42%] Building CXX object lib/cpp/CMakeFiles/thrift_static.dir/src/thrift/transport/TSimpleFileTransport.cpp.o
[ 72%] Linking CXX static library libgmock_main.a
[ 72%] Built target gmock_main
[ 81%] Linking CXX static library libgtest.a
[ 81%] Built target gtest
Scanning dependencies of target gtest_main
[ 90%] Building CXX object googlemock/gtest/CMakeFiles/gtest_main.dir/src/gtest_main.cc.o
[100%] Linking CXX static library libgtest_main.a
[100%] Built target gtest_main
[ 44%] Building CXX object lib/cpp/CMakeFiles/thrift_static.dir/src/thrift/transport/THttpTransport.cpp.o
[ 27%] Performing install step for 'googletest'
[ 27%] Built target gmock
[ 63%] Built target gmock_main
[ 81%] Built target gtest
[100%] Built target gtest_main
Install the project...
-- Install configuration: "RelWithDebInfo"
-- Installing: /home/jenkins/workspace/confluo-prb/build/external/gtest/lib/libgmock.a
-- Installing: /home/jenkins/workspace/confluo-prb/build/external/gtest/lib/libgmock_main.a
-- Installing: /home/jenkins/workspace/confluo-prb/build/external/gtest/include/gmock
-- Installing: /home/jenkins/workspace/confluo-prb/build/external/gtest/include/gmock/gmock-generated-nice-strict.h.pump
-- Installing: /home/jenkins/workspace/confluo-prb/build/external/gtest/include/gmock/internal
-- Installing: /home/jenkins/workspace/confluo-prb/build/external/gtest/include/gmock/internal/gmock-generated-internal-utils.h
-- Installing: /home/jenkins/workspace/confluo-prb/build/external/gtest/include/gmock/internal/gmock-internal-utils.h
-- Installing: /home/jenkins/workspace/confluo-prb/build/external/gtest/include/gmock/internal/gmock-generated-internal-utils.h.pump
-- Installing: /home/jenkins/workspace/confluo-prb/build/external/gtest/include/gmock/internal/gmock-port.h
-- Installing: /home/jenkins/workspace/confluo-prb/build/external/gtest/include/gmock/internal/custom
-- Installing: /home/jenkins/workspace/confluo-prb/build/external/gtest/include/gmock/internal/custom/gmock-generated-actions.h.pump
-- Installing: /home/jenkins/workspace/confluo-prb/build/external/gtest/include/gmock/internal/custom/gmock-port.h
-- Installing: /home/jenkins/workspace/confluo-prb/build/external/gtest/include/gmock/internal/custom/gmock-generated-actions.h
-- Installing: /home/jenkins/workspace/confluo-prb/build/external/gtest/include/gmock/internal/custom/gmock-matchers.h
-- Installing: /home/jenkins/workspace/confluo-prb/build/external/gtest/include/gmock/gmock-generated-actions.h.pump
-- Installing: /home/jenkins/workspace/confluo-prb/build/external/gtest/include/gmock/gmock.h
-- Installing: /home/jenkins/workspace/confluo-prb/build/external/gtest/include/gmock/gmock-generated-matchers.h
-- Installing: /home/jenkins/workspace/confluo-prb/build/external/gtest/include/gmock/gmock-cardinalities.h
-- Installing: /home/jenkins/workspace/confluo-prb/build/external/gtest/include/gmock/gmock-generated-actions.h
-- Installing: /home/jenkins/workspace/confluo-prb/build/external/gtest/include/gmock/gmock-generated-nice-strict.h
-- Installing: /home/jenkins/workspace/confluo-prb/build/external/gtest/include/gmock/gmock-more-actions.h
-- Installing: /home/jenkins/workspace/confluo-prb/build/external/gtest/include/gmock/gmock-spec-builders.h
-- Installing: /home/jenkins/workspace/confluo-prb/build/external/gtest/include/gmock/gmock-generated-function-mockers.h
-- Installing: /home/jenkins/workspace/confluo-prb/build/external/gtest/include/gmock/gmock-matchers.h
-- Installing: /home/jenkins/workspace/confluo-prb/build/external/gtest/include/gmock/gmock-generated-function-mockers.h.pump
-- Installing: /home/jenkins/workspace/confluo-prb/build/external/gtest/include/gmock/gmock-actions.h
-- Installing: /home/jenkins/workspace/confluo-prb/build/external/gtest/include/gmock/gmock-generated-matchers.h.pump
-- Installing: /home/jenkins/workspace/confluo-prb/build/external/gtest/include/gmock/gmock-more-matchers.h
-- Installing: /home/jenkins/workspace/confluo-prb/build/external/gtest/lib/libgtest.a
-- Installing: /home/jenkins/workspace/confluo-prb/build/external/gtest/lib/libgtest_main.a
-- Installing: /home/jenkins/workspace/confluo-prb/build/external/gtest/include/gtest
-- Installing: /home/jenkins/workspace/confluo-prb/build/external/gtest/include/gtest/gtest-printers.h
-- Installing: /home/jenkins/workspace/confluo-prb/build/external/gtest/include/gtest/internal
-- Installing: /home/jenkins/workspace/confluo-prb/build/external/gtest/include/gtest/internal/gtest-type-util.h
-- Installing: /home/jenkins/workspace/confluo-prb/build/external/gtest/include/gtest/internal/gtest-death-test-internal.h
-- Installing: /home/jenkins/workspace/confluo-prb/build/external/gtest/include/gtest/internal/gtest-param-util-generated.h.pump
-- Installing: /home/jenkins/workspace/confluo-prb/build/external/gtest/include/gtest/internal/gtest-tuple.h
-- Installing: /home/jenkins/workspace/confluo-prb/build/external/gtest/include/gtest/internal/gtest-internal.h
-- Installing: /home/jenkins/workspace/confluo-prb/build/external/gtest/include/gtest/internal/gtest-tuple.h.pump
-- Installing: /home/jenkins/workspace/confluo-prb/build/external/gtest/include/gtest/internal/gtest-param-util-generated.h
-- Installing: /home/jenkins/workspace/confluo-prb/build/external/gtest/include/gtest/internal/gtest-string.h
-- Installing: /home/jenkins/workspace/confluo-prb/build/external/gtest/include/gtest/internal/gtest-port.h
-- Installing: /home/jenkins/workspace/confluo-prb/build/external/gtest/include/gtest/internal/gtest-type-util.h.pump
-- Installing: /home/jenkins/workspace/confluo-prb/build/external/gtest/include/gtest/internal/gtest-param-util.h
-- Installing: /home/jenkins/workspace/confluo-prb/build/external/gtest/include/gtest/internal/custom
-- Installing: /home/jenkins/workspace/confluo-prb/build/external/gtest/include/gtest/internal/custom/gtest-printers.h
-- Installing: /home/jenkins/workspace/confluo-prb/build/external/gtest/include/gtest/internal/custom/gtest-port.h
-- Installing: /home/jenkins/workspace/confluo-prb/build/external/gtest/include/gtest/internal/custom/gtest.h
-- Installing: /home/jenkins/workspace/confluo-prb/build/external/gtest/include/gtest/internal/gtest-linked_ptr.h
-- Installing: /home/jenkins/workspace/confluo-prb/build/external/gtest/include/gtest/internal/gtest-filepath.h
-- Installing: /home/jenkins/workspace/confluo-prb/build/external/gtest/include/gtest/internal/gtest-port-arch.h
-- Installing: /home/jenkins/workspace/confluo-prb/build/external/gtest/include/gtest/gtest-death-test.h
-- Installing: /home/jenkins/workspace/confluo-prb/build/external/gtest/include/gtest/gtest-param-test.h.pump
-- Installing: /home/jenkins/workspace/confluo-prb/build/external/gtest/include/gtest/gtest-param-test.h
-- Installing: /home/jenkins/workspace/confluo-prb/build/external/gtest/include/gtest/gtest-typed-test.h
-- Installing: /home/jenkins/workspace/confluo-prb/build/external/gtest/include/gtest/gtest.h
-- Installing: /home/jenkins/workspace/confluo-prb/build/external/gtest/include/gtest/gtest-spi.h
-- Installing: /home/jenkins/workspace/confluo-prb/build/external/gtest/include/gtest/gtest-test-part.h
-- Installing: /home/jenkins/workspace/confluo-prb/build/external/gtest/include/gtest/gtest_pred_impl.h
-- Installing: /home/jenkins/workspace/confluo-prb/build/external/gtest/include/gtest/gtest_prod.h
-- Installing: /home/jenkins/workspace/confluo-prb/build/external/gtest/include/gtest/gtest-message.h
[ 28%] Completed 'googletest'
[ 28%] Built target googletest
Scanning dependencies of target pyclient
[ 29%] Building Python client
[ 47%] Building CXX object lib/cpp/CMakeFiles/thrift_static.dir/src/thrift/transport/THttpClient.cpp.o
[ 50%] Building CXX object lib/cpp/CMakeFiles/thrift_static.dir/src/thrift/transport/THttpServer.cpp.o
running build
running build_py
creating /home/jenkins/workspace/confluo-prb/build/pyclient/lib
creating /home/jenkins/workspace/confluo-prb/build/pyclient/lib/confluo
creating /home/jenkins/workspace/confluo-prb/build/pyclient/lib/confluo/rpc
copying confluo/rpc/stream.py -> /home/jenkins/workspace/confluo-prb/build/pyclient/lib/confluo/rpc
copying confluo/rpc/constants.py -> /home/jenkins/workspace/confluo-prb/build/pyclient/lib/confluo/rpc
copying confluo/rpc/schema.py -> /home/jenkins/workspace/confluo-prb/build/pyclient/lib/confluo/rpc
copying confluo/rpc/data_types.py -> /home/jenkins/workspace/confluo-prb/build/pyclient/lib/confluo/rpc
copying confluo/rpc/ttypes.py -> /home/jenkins/workspace/confluo-prb/build/pyclient/lib/confluo/rpc
copying confluo/rpc/rpc_service.py -> /home/jenkins/workspace/confluo-prb/build/pyclient/lib/confluo/rpc
copying confluo/rpc/configuration_params.py -> /home/jenkins/workspace/confluo-prb/build/pyclient/lib/confluo/rpc
copying confluo/rpc/batch.py -> /home/jenkins/workspace/confluo-prb/build/pyclient/lib/confluo/rpc
copying confluo/rpc/client.py -> /home/jenkins/workspace/confluo-prb/build/pyclient/lib/confluo/rpc
copying confluo/rpc/type_conversions.py -> /home/jenkins/workspace/confluo-prb/build/pyclient/lib/confluo/rpc
copying confluo/rpc/storage.py -> /home/jenkins/workspace/confluo-prb/build/pyclient/lib/confluo/rpc
copying confluo/rpc/__init__.py -> /home/jenkins/workspace/confluo-prb/build/pyclient/lib/confluo/rpc
[ 29%] Built target pyclient
[ 52%] Building CXX object lib/cpp/CMakeFiles/thrift_static.dir/src/thrift/transport/TSocket.cpp.o
Scanning dependencies of target javaclient
[ 30%] Generating confluo-client-0.1.0.jar, confluo-client-0.1.0.pom
Buildfile: /home/jenkins/workspace/confluo-prb/build/javaclient/build.xml

test-offline:

get-deps:
    [mkdir] Created dir: /home/jenkins/.m2/repository/org/apache/thrift/libthrift/0.11.0
      [get] Getting: https://repo.maven.apache.org/maven2/org/apache/thrift/libthrift/0.11.0/libthrift-0.11.0.jar
      [get] To: /home/jenkins/.m2/repository/org/apache/thrift/libthrift/0.11.0/libthrift-0.11.0.jar
      [get] Getting: https://repo.maven.apache.org/maven2/org/slf4j/slf4j-api/1.7.12/slf4j-api-1.7.12.jar
      [get] To: /home/jenkins/.m2/repository/org/slf4j/slf4j-api/1.7.12/slf4j-api-1.7.12.jar
      [get] Getting: https://repo.maven.apache.org/maven2/org/apache/httpcomponents/httpclient/4.4.1/httpclient-4.4.1.jar
      [get] To: /home/jenkins/.m2/repository/org/apache/httpcomponents/httpclient/4.4.1/httpclient-4.4.1.jar
[ 55%] Building CXX object lib/cpp/CMakeFiles/thrift_static.dir/src/thrift/transport/TSocketPool.cpp.o
      [get] Getting: https://repo.maven.apache.org/maven2/commons-logging/commons-logging/1.2/commons-logging-1.2.jar
      [get] To: /home/jenkins/.m2/repository/commons-logging/commons-logging/1.2/commons-logging-1.2.jar
      [get] Getting: https://repo.maven.apache.org/maven2/commons-codec/commons-codec/1.9/commons-codec-1.9.jar
      [get] To: /home/jenkins/.m2/repository/commons-codec/commons-codec/1.9/commons-codec-1.9.jar
      [get] Getting: https://repo.maven.apache.org/maven2/org/apache/httpcomponents/httpcore/4.4.1/httpcore-4.4.1.jar
      [get] To: /home/jenkins/.m2/repository/org/apache/httpcomponents/httpcore/4.4.1/httpcore-4.4.1.jar
      [get] Getting: https://repo.maven.apache.org/maven2/junit/junit/4.12/junit-4.12.jar
      [get] To: /home/jenkins/.m2/repository/junit/junit/4.12/junit-4.12.jar
      [get] Getting: https://repo.maven.apache.org/maven2/org/hamcrest/hamcrest-core/1.3/hamcrest-core-1.3.jar
      [get] To: /home/jenkins/.m2/repository/org/hamcrest/hamcrest-core/1.3/hamcrest-core-1.3.jar
      [get] Getting: https://repo.maven.apache.org/maven2/com/google/code/gson/gson/2.2.4/gson-2.2.4.jar
      [get] To: /home/jenkins/.m2/repository/com/google/code/gson/gson/2.2.4/gson-2.2.4.jar

compile:
    [mkdir] Created dir: /home/jenkins/workspace/confluo-prb/build/javaclient/target/classes
    [javac] Compiling 41 source files to /home/jenkins/workspace/confluo-prb/build/javaclient/target/classes
[ 57%] Building CXX object lib/cpp/CMakeFiles/thrift_static.dir/src/thrift/transport/TServerSocket.cpp.o
[ 60%] Building CXX object lib/cpp/CMakeFiles/thrift_static.dir/src/thrift/transport/TTransportUtils.cpp.o
    [javac] Note: Some input files use unchecked or unsafe operations.
    [javac] Note: Recompile with -Xlint:unchecked for details.
     [copy] Copying 2 files to /home/jenkins/workspace/confluo-prb/build/javaclient/target/classes

jar:
[ 63%] Building CXX object lib/cpp/CMakeFiles/thrift_static.dir/src/thrift/transport/TBufferTransports.cpp.o
      [jar] Building jar: /home/jenkins/workspace/confluo-prb/build/javaclient/target/confluo-client-0.1.0.jar
[ 65%] Building CXX object lib/cpp/CMakeFiles/thrift_static.dir/src/thrift/server/TConnectedClient.cpp.o

BUILD SUCCESSFUL
Total time: 4 seconds
[ 31%] Building Confluo Java Client library using Ant
[ 31%] Built target javaclient
[ 68%] Building CXX object lib/cpp/CMakeFiles/thrift_static.dir/src/thrift/server/TServerFramework.cpp.o
[ 71%] Building CXX object lib/cpp/CMakeFiles/thrift_static.dir/src/thrift/server/TSimpleServer.cpp.o
Scanning dependencies of target confluo
[ 31%] Building CXX object libconfluo/CMakeFiles/confluo.dir/src/confluo_store.cc.o
[ 32%] Building CXX object libconfluo/CMakeFiles/confluo.dir/src/atomic_multilog.cc.o
[ 73%] Building CXX object lib/cpp/CMakeFiles/thrift_static.dir/src/thrift/server/TThreadPoolServer.cpp.o
[ 76%] Building CXX object lib/cpp/CMakeFiles/thrift_static.dir/src/thrift/server/TThreadedServer.cpp.o
[ 78%] Building CXX object lib/cpp/CMakeFiles/thrift_static.dir/src/thrift/transport/TPipe.cpp.o
[ 81%] Building CXX object lib/cpp/CMakeFiles/thrift_static.dir/src/thrift/transport/TPipeServer.cpp.o
[ 84%] Building CXX object lib/cpp/CMakeFiles/thrift_static.dir/src/thrift/transport/TFileTransport.cpp.o
[ 86%] Building CXX object lib/cpp/CMakeFiles/thrift_static.dir/src/thrift/VirtualProfiling.cpp.o
[ 89%] Building CXX object lib/cpp/CMakeFiles/thrift_static.dir/src/thrift/server/TServer.cpp.o
[ 92%] Building CXX object lib/cpp/CMakeFiles/thrift_static.dir/src/thrift/concurrency/PosixThreadFactory.cpp.o
[ 94%] Building CXX object lib/cpp/CMakeFiles/thrift_static.dir/src/thrift/concurrency/Mutex.cpp.o
[ 97%] Building CXX object lib/cpp/CMakeFiles/thrift_static.dir/src/thrift/concurrency/Monitor.cpp.o
[100%] Linking CXX static library ../libthrift.a
[100%] Built target thrift_static
[ 33%] Performing install step for 'thrift'
[ 34%] Building CXX object libconfluo/CMakeFiles/confluo.dir/src/filter.cc.o
[100%] Built target thrift_static
Install the project...
-- Install configuration: "RelWithDebInfo"
-- Installing: /home/jenkins/workspace/confluo-prb/build/external/thrift/lib/libthrift.a
-- Installing: /home/jenkins/workspace/confluo-prb/build/external/thrift/include/thrift
-- Installing: /home/jenkins/workspace/confluo-prb/build/external/thrift/include/thrift/Thrift.h
-- Installing: /home/jenkins/workspace/confluo-prb/build/external/thrift/include/thrift/protocol
-- Installing: /home/jenkins/workspace/confluo-prb/build/external/thrift/include/thrift/protocol/TCompactProtocol.h
-- Installing: /home/jenkins/workspace/confluo-prb/build/external/thrift/include/thrift/protocol/TJSONProtocol.h
-- Installing: /home/jenkins/workspace/confluo-prb/build/external/thrift/include/thrift/protocol/TProtocol.h
-- Installing: /home/jenkins/workspace/confluo-prb/build/external/thrift/include/thrift/protocol/TProtocolTap.h
-- Installing: /home/jenkins/workspace/confluo-prb/build/external/thrift/include/thrift/protocol/TProtocolException.h
-- Installing: /home/jenkins/workspace/confluo-prb/build/external/thrift/include/thrift/protocol/THeaderProtocol.h
-- Installing: /home/jenkins/workspace/confluo-prb/build/external/thrift/include/thrift/protocol/TBinaryProtocol.tcc
-- Installing: /home/jenkins/workspace/confluo-prb/build/external/thrift/include/thrift/protocol/TDebugProtocol.h
-- Installing: /home/jenkins/workspace/confluo-prb/build/external/thrift/include/thrift/protocol/TCompactProtocol.tcc
-- Installing: /home/jenkins/workspace/confluo-prb/build/external/thrift/include/thrift/protocol/TBase64Utils.h
-- Installing: /home/jenkins/workspace/confluo-prb/build/external/thrift/include/thrift/protocol/TProtocolDecorator.h
-- Installing: /home/jenkins/workspace/confluo-prb/build/external/thrift/include/thrift/protocol/TProtocolTypes.h
-- Installing: /home/jenkins/workspace/confluo-prb/build/external/thrift/include/thrift/protocol/TVirtualProtocol.h
-- Installing: /home/jenkins/workspace/confluo-prb/build/external/thrift/include/thrift/protocol/TBinaryProtocol.h
-- Installing: /home/jenkins/workspace/confluo-prb/build/external/thrift/include/thrift/protocol/TMultiplexedProtocol.h
-- Installing: /home/jenkins/workspace/confluo-prb/build/external/thrift/include/thrift/async
-- Installing: /home/jenkins/workspace/confluo-prb/build/external/thrift/include/thrift/async/TAsyncBufferProcessor.h
-- Installing: /home/jenkins/workspace/confluo-prb/build/external/thrift/include/thrift/async/TEvhttpServer.h
-- Installing: /home/jenkins/workspace/confluo-prb/build/external/thrift/include/thrift/async/TAsyncProtocolProcessor.h
-- Installing: /home/jenkins/workspace/confluo-prb/build/external/thrift/include/thrift/async/TAsyncDispatchProcessor.h
-- Installing: /home/jenkins/workspace/confluo-prb/build/external/thrift/include/thrift/async/TAsyncChannel.h
-- Installing: /home/jenkins/workspace/confluo-prb/build/external/thrift/include/thrift/async/TConcurrentClientSyncInfo.h
-- Installing: /home/jenkins/workspace/confluo-prb/build/external/thrift/include/thrift/async/TAsyncProcessor.h
-- Installing: /home/jenkins/workspace/confluo-prb/build/external/thrift/include/thrift/async/TEvhttpClientChannel.h
-- Installing: /home/jenkins/workspace/confluo-prb/build/external/thrift/include/thrift/TOutput.h
-- Installing: /home/jenkins/workspace/confluo-prb/build/external/thrift/include/thrift/processor
-- Installing: /home/jenkins/workspace/confluo-prb/build/external/thrift/include/thrift/processor/PeekProcessor.h
-- Installing: /home/jenkins/workspace/confluo-prb/build/external/thrift/include/thrift/processor/TMultiplexedProcessor.h
-- Installing: /home/jenkins/workspace/confluo-prb/build/external/thrift/include/thrift/processor/StatsProcessor.h
-- Installing: /home/jenkins/workspace/confluo-prb/build/external/thrift/include/thrift/TLogging.h
-- Installing: /home/jenkins/workspace/confluo-prb/build/external/thrift/include/thrift/transport
-- Installing: /home/jenkins/workspace/confluo-prb/build/external/thrift/include/thrift/transport/TFDTransport.h
-- Installing: /home/jenkins/workspace/confluo-prb/build/external/thrift/include/thrift/transport/TTransport.h
-- Installing: /home/jenkins/workspace/confluo-prb/build/external/thrift/include/thrift/transport/TServerSocket.h
-- Installing: /home/jenkins/workspace/confluo-prb/build/external/thrift/include/thrift/transport/TShortReadTransport.h
-- Installing: /home/jenkins/workspace/confluo-prb/build/external/thrift/include/thrift/transport/TServerTransport.h
-- Installing: /home/jenkins/workspace/confluo-prb/build/external/thrift/include/thrift/transport/TTransportException.h
-- Installing: /home/jenkins/workspace/confluo-prb/build/external/thrift/include/thrift/transport/TTransportUtils.h
-- Installing: /home/jenkins/workspace/confluo-prb/build/external/thrift/include/thrift/transport/TNonblockingSSLServerSocket.h
-- Installing: /home/jenkins/workspace/confluo-prb/build/external/thrift/include/thrift/transport/TSimpleFileTransport.h
-- Installing: /home/jenkins/workspace/confluo-prb/build/external/thrift/include/thrift/transport/TSSLServerSocket.h
-- Installing: /home/jenkins/workspace/confluo-prb/build/external/thrift/include/thrift/transport/THeaderTransport.h
-- Installing: /home/jenkins/workspace/confluo-prb/build/external/thrift/include/thrift/transport/TNonblockingServerTransport.h
-- Installing: /home/jenkins/workspace/confluo-prb/build/external/thrift/include/thrift/transport/TPipeServer.h
-- Installing: /home/jenkins/workspace/confluo-prb/build/external/thrift/include/thrift/transport/THttpClient.h
-- Installing: /home/jenkins/workspace/confluo-prb/build/external/thrift/include/thrift/transport/PlatformSocket.h
-- Installing: /home/jenkins/workspace/confluo-prb/build/external/thrift/include/thrift/transport/TBufferTransports.h
-- Installing: /home/jenkins/workspace/confluo-prb/build/external/thrift/include/thrift/transport/TSocketPool.h
-- Installing: /home/jenkins/workspace/confluo-prb/build/external/thrift/include/thrift/transport/TSSLSocket.h
-- Installing: /home/jenkins/workspace/confluo-prb/build/external/thrift/include/thrift/transport/TPipe.h
-- Installing: /home/jenkins/workspace/confluo-prb/build/external/thrift/include/thrift/transport/THttpTransport.h
-- Installing: /home/jenkins/workspace/confluo-prb/build/external/thrift/include/thrift/transport/TSocket.h
-- Installing: /home/jenkins/workspace/confluo-prb/build/external/thrift/include/thrift/transport/TVirtualTransport.h
-- Installing: /home/jenkins/workspace/confluo-prb/build/external/thrift/include/thrift/transport/TZlibTransport.h
-- Installing: /home/jenkins/workspace/confluo-prb/build/external/thrift/include/thrift/transport/THttpServer.h
-- Installing: /home/jenkins/workspace/confluo-prb/build/external/thrift/include/thrift/transport/TFileTransport.h
-- Installing: /home/jenkins/workspace/confluo-prb/build/external/thrift/include/thrift/transport/TNonblockingServerSocket.h
-- Installing: /home/jenkins/workspace/confluo-prb/build/external/thrift/include/thrift/server
-- Installing: /home/jenkins/workspace/confluo-prb/build/external/thrift/include/thrift/server/TNonblockingServer.h
-- Installing: /home/jenkins/workspace/confluo-prb/build/external/thrift/include/thrift/server/TSimpleServer.h
-- Installing: /home/jenkins/workspace/confluo-prb/build/external/thrift/include/thrift/server/TThreadPoolServer.h
-- Installing: /home/jenkins/workspace/confluo-prb/build/external/thrift/include/thrift/server/TServer.h
-- Installing: /home/jenkins/workspace/confluo-prb/build/external/thrift/include/thrift/server/TThreadedServer.h
-- Installing: /home/jenkins/workspace/confluo-prb/build/external/thrift/include/thrift/server/TConnectedClient.h
-- Installing: /home/jenkins/workspace/confluo-prb/build/external/thrift/include/thrift/server/TServerFramework.h
-- Installing: /home/jenkins/workspace/confluo-prb/build/external/thrift/include/thrift/stdcxx.h
-- Installing: /home/jenkins/workspace/confluo-prb/build/external/thrift/include/thrift/thrift-config.h
-- Installing: /home/jenkins/workspace/confluo-prb/build/external/thrift/include/thrift/qt
-- Installing: /home/jenkins/workspace/confluo-prb/build/external/thrift/include/thrift/qt/TQIODeviceTransport.h
-- Installing: /home/jenkins/workspace/confluo-prb/build/external/thrift/include/thrift/qt/TQTcpServer.h
-- Installing: /home/jenkins/workspace/confluo-prb/build/external/thrift/include/thrift/TApplicationException.h
-- Installing: /home/jenkins/workspace/confluo-prb/build/external/thrift/include/thrift/TProcessor.h
-- Installing: /home/jenkins/workspace/confluo-prb/build/external/thrift/include/thrift/TBase.h
-- Installing: /home/jenkins/workspace/confluo-prb/build/external/thrift/include/thrift/TToString.h
-- Installing: /home/jenkins/workspace/confluo-prb/build/external/thrift/include/thrift/windows
-- Installing: /home/jenkins/workspace/confluo-prb/build/external/thrift/include/thrift/windows/GetTimeOfDay.h
-- Installing: /home/jenkins/workspace/confluo-prb/build/external/thrift/include/thrift/windows/Operators.h
-- Installing: /home/jenkins/workspace/confluo-prb/build/external/thrift/include/thrift/windows/OverlappedSubmissionThread.h
-- Installing: /home/jenkins/workspace/confluo-prb/build/external/thrift/include/thrift/windows/TWinsockSingleton.h
-- Installing: /home/jenkins/workspace/confluo-prb/build/external/thrift/include/thrift/windows/SocketPair.h
-- Installing: /home/jenkins/workspace/confluo-prb/build/external/thrift/include/thrift/windows/WinFcntl.h
-- Installing: /home/jenkins/workspace/confluo-prb/build/external/thrift/include/thrift/windows/config.h
-- Installing: /home/jenkins/workspace/confluo-prb/build/external/thrift/include/thrift/windows/Sync.h
-- Installing: /home/jenkins/workspace/confluo-prb/build/external/thrift/include/thrift/TDispatchProcessor.h
-- Installing: /home/jenkins/workspace/confluo-prb/build/external/thrift/include/thrift/concurrency
-- Installing: /home/jenkins/workspace/confluo-prb/build/external/thrift/include/thrift/concurrency/StdThreadFactory.h
-- Installing: /home/jenkins/workspace/confluo-prb/build/external/thrift/include/thrift/concurrency/Mutex.h
-- Installing: /home/jenkins/workspace/confluo-prb/build/external/thrift/include/thrift/concurrency/BoostThreadFactory.h
-- Installing: /home/jenkins/workspace/confluo-prb/build/external/thrift/include/thrift/concurrency/Thread.h
-- Installing: /home/jenkins/workspace/confluo-prb/build/external/thrift/include/thrift/concurrency/Util.h
-- Installing: /home/jenkins/workspace/confluo-prb/build/external/thrift/include/thrift/concurrency/PlatformThreadFactory.h
-- Installing: /home/jenkins/workspace/confluo-prb/build/external/thrift/include/thrift/concurrency/FunctionRunner.h
-- Installing: /home/jenkins/workspace/confluo-prb/build/external/thrift/include/thrift/concurrency/Monitor.h
-- Installing: /home/jenkins/workspace/confluo-prb/build/external/thrift/include/thrift/concurrency/Exception.h
-- Installing: /home/jenkins/workspace/confluo-prb/build/external/thrift/include/thrift/concurrency/ThreadManager.h
-- Installing: /home/jenkins/workspace/confluo-prb/build/external/thrift/include/thrift/concurrency/TimerManager.h
-- Installing: /home/jenkins/workspace/confluo-prb/build/external/thrift/include/thrift/concurrency/PosixThreadFactory.h
-- Up-to-date: /home/jenkins/workspace/confluo-prb/build/external/thrift/include/thrift
-- Installing: /home/jenkins/workspace/confluo-prb/build/external/thrift/include/thrift/config.h
[ 34%] Completed 'thrift'
[ 34%] Built target thrift
[ 34%] Building CXX object libconfluo/CMakeFiles/confluo.dir/src/read_tail.cc.o
[ 35%] Building CXX object libconfluo/CMakeFiles/confluo.dir/src/trigger.cc.o
Scanning dependencies of target rpcclient
[ 35%] Building CXX object librpc/CMakeFiles/rpcclient.dir/src/rpc_constants.cc.o
[ 36%] Building CXX object librpc/CMakeFiles/rpcclient.dir/src/rpc_server.cc.o
[ 37%] Building CXX object libconfluo/CMakeFiles/confluo.dir/src/atomic_multilog_metadata.cc.o
[ 38%] Building CXX object librpc/CMakeFiles/rpcclient.dir/src/rpc_service.cc.o
[ 39%] Building CXX object librpc/CMakeFiles/rpcclient.dir/src/rpc_types.cc.o
[ 39%] Building CXX object libconfluo/CMakeFiles/confluo.dir/src/alert.cc.o
[ 39%] Building CXX object librpc/CMakeFiles/rpcclient.dir/src/rpc_client.cc.o
-- jemalloc build command succeeded.  See also /home/jenkins/workspace/confluo-prb/build/external/jemalloc/src/jemalloc-stamp/jemalloc-build-*.log
[ 39%] Performing install step for 'jemalloc'
-- jemalloc install command succeeded.  See also /home/jenkins/workspace/confluo-prb/build/external/jemalloc/src/jemalloc-stamp/jemalloc-install-*.log
[ 40%] Completed 'jemalloc'
[ 40%] Built target jemalloc
[ 41%] Building CXX object librpc/CMakeFiles/rpcclient.dir/src/rpc_alert_stream.cc.o
[ 42%] Building CXX object libconfluo/CMakeFiles/confluo.dir/src/alert_index.cc.o
[ 43%] Building CXX object librpc/CMakeFiles/rpcclient.dir/src/rpc_record_batch_builder.cc.o
[ 44%] Building CXX object libconfluo/CMakeFiles/confluo.dir/src/aggregated_reflog.cc.o
[ 44%] Building CXX object librpc/CMakeFiles/rpcclient.dir/src/rpc_type_conversions.cc.o
[ 45%] Building CXX object librpc/CMakeFiles/rpcclient.dir/src/rpc_record_stream.cc.o
[ 45%] Building CXX object libconfluo/CMakeFiles/confluo.dir/src/aggregate/aggregate.cc.o
[ 46%] Building CXX object libconfluo/CMakeFiles/confluo.dir/src/aggregate/aggregate_info.cc.o
[ 47%] Building CXX object libconfluo/CMakeFiles/confluo.dir/src/aggregate/aggregate_manager.cc.o
[ 48%] Building CXX object libconfluo/CMakeFiles/confluo.dir/src/aggregate/aggregate_ops.cc.o
[ 48%] Building CXX object libconfluo/CMakeFiles/confluo.dir/src/compression/confluo_encoder.cc.o
[ 49%] Building CXX object libconfluo/CMakeFiles/confluo.dir/src/container/data_log.cc.o
[ 50%] Building CXX object libconfluo/CMakeFiles/confluo.dir/src/container/reflog.cc.o
[ 50%] Building CXX object libconfluo/CMakeFiles/confluo.dir/src/container/cursor/alert_cursor.cc.o
[ 51%] Linking CXX static library librpcclient.a
[ 51%] Built target rpcclient
[ 52%] Building CXX object libconfluo/CMakeFiles/confluo.dir/src/container/cursor/offset_cursors.cc.o
[ 53%] Building CXX object libconfluo/CMakeFiles/confluo.dir/src/container/cursor/record_cursors.cc.o
[ 53%] Building CXX object libconfluo/CMakeFiles/confluo.dir/src/parser/aggregate_parser.cc.o
[ 54%] Building CXX object libconfluo/CMakeFiles/confluo.dir/src/parser/expression_compiler.cc.o
[ 55%] Building CXX object libconfluo/CMakeFiles/confluo.dir/src/parser/expression_parser.cc.o
[ 56%] Building CXX object libconfluo/CMakeFiles/confluo.dir/src/parser/schema_parser.cc.o
[ 56%] Building CXX object libconfluo/CMakeFiles/confluo.dir/src/parser/trigger_parser.cc.o
[ 57%] Building CXX object libconfluo/CMakeFiles/confluo.dir/src/planner/query_ops.cc.o
[ 58%] Building CXX object libconfluo/CMakeFiles/confluo.dir/src/planner/query_plan.cc.o
[ 58%] Building CXX object libconfluo/CMakeFiles/confluo.dir/src/planner/query_planner.cc.o
[ 59%] Building CXX object libconfluo/CMakeFiles/confluo.dir/src/schema/column.cc.o
[ 60%] Building CXX object libconfluo/CMakeFiles/confluo.dir/src/schema/field.cc.o
[ 60%] Building CXX object libconfluo/CMakeFiles/confluo.dir/src/schema/index_state.cc.o
[ 61%] Building CXX object libconfluo/CMakeFiles/confluo.dir/src/schema/record.cc.o
[ 62%] Building CXX object libconfluo/CMakeFiles/confluo.dir/src/schema/record_batch.cc.o
[ 63%] Building CXX object libconfluo/CMakeFiles/confluo.dir/src/schema/schema.cc.o
[ 63%] Building CXX object libconfluo/CMakeFiles/confluo.dir/src/schema/schema_snapshot.cc.o
[ 64%] Building CXX object libconfluo/CMakeFiles/confluo.dir/src/archival/io/incremental_file_offset.cc.o
[ 65%] Building CXX object libconfluo/CMakeFiles/confluo.dir/src/archival/io/incremental_file_stream.cc.o
[ 65%] Building CXX object libconfluo/CMakeFiles/confluo.dir/src/archival/io/incremental_file_reader.cc.o
[ 66%] Building CXX object libconfluo/CMakeFiles/confluo.dir/src/archival/io/incremental_file_writer.cc.o
[ 67%] Building CXX object libconfluo/CMakeFiles/confluo.dir/src/archival/archival_actions.cc.o
[ 67%] Building CXX object libconfluo/CMakeFiles/confluo.dir/src/archival/archival_metadata.cc.o
[ 68%] Building CXX object libconfluo/CMakeFiles/confluo.dir/src/archival/archival_utils.cc.o
[ 69%] Building CXX object libconfluo/CMakeFiles/confluo.dir/src/archival/atomic_multilog_archiver.cc.o
[ 70%] Building CXX object libconfluo/CMakeFiles/confluo.dir/src/archival/filter_archiver.cc.o
[ 70%] Building CXX object libconfluo/CMakeFiles/confluo.dir/src/archival/filter_log_archiver.cc.o
[ 71%] Building CXX object libconfluo/CMakeFiles/confluo.dir/src/archival/index_archiver.cc.o
[ 72%] Building CXX object libconfluo/CMakeFiles/confluo.dir/src/archival/index_log_archiver.cc.o
[ 72%] Building CXX object libconfluo/CMakeFiles/confluo.dir/src/archival/load_utils.cc.o
[ 73%] Building CXX object libconfluo/CMakeFiles/confluo.dir/src/storage/reference_counts.cc.o
[ 74%] Building CXX object libconfluo/CMakeFiles/confluo.dir/src/storage/ptr_aux_block.cc.o
[ 74%] Building CXX object libconfluo/CMakeFiles/confluo.dir/src/storage/ptr_metadata.cc.o
[ 75%] Building CXX object libconfluo/CMakeFiles/confluo.dir/src/storage/memory_stat.cc.o
[ 76%] Building CXX object libconfluo/CMakeFiles/confluo.dir/src/storage/storage.cc.o
[ 77%] Building CXX object libconfluo/CMakeFiles/confluo.dir/src/storage/storage_allocator.cc.o
[ 77%] Building CXX object libconfluo/CMakeFiles/confluo.dir/src/threads/periodic_task.cc.o
[ 78%] Building CXX object libconfluo/CMakeFiles/confluo.dir/src/threads/task_pool.cc.o
[ 79%] Building CXX object libconfluo/CMakeFiles/confluo.dir/src/threads/thread_manager.cc.o
[ 79%] Building CXX object libconfluo/CMakeFiles/confluo.dir/src/types/byte_string.cc.o
[ 80%] Building CXX object libconfluo/CMakeFiles/confluo.dir/src/types/data_type.cc.o
[ 81%] Building CXX object libconfluo/CMakeFiles/confluo.dir/src/types/immutable_value.cc.o
[ 81%] Building CXX object libconfluo/CMakeFiles/confluo.dir/src/types/primitive_types.cc.o
[ 82%] Building CXX object libconfluo/CMakeFiles/confluo.dir/src/types/mutable_value.cc.o
[ 83%] Building CXX object libconfluo/CMakeFiles/confluo.dir/src/types/raw_data.cc.o
[ 84%] Building CXX object libconfluo/CMakeFiles/confluo.dir/src/types/numeric.cc.o
[ 84%] Building CXX object libconfluo/CMakeFiles/confluo.dir/src/types/type_properties.cc.o
[ 85%] Building CXX object libconfluo/CMakeFiles/confluo.dir/src/types/type_manager.cc.o
[ 86%] Linking CXX static library libconfluo.a
[ 86%] Built target confluo
Scanning dependencies of target ctest
Scanning dependencies of target tstest
Scanning dependencies of target rpctest
[ 87%] Building CXX object libconfluo/CMakeFiles/ctest.dir/test/test_main.cc.o
[ 88%] Building CXX object examples/libtimeseries/CMakeFiles/tstest.dir/test/test_main.cc.o
Scanning dependencies of target confluod
[ 88%] Building CXX object librpc/CMakeFiles/rpctest.dir/test/test_main.cc.o
[ 88%] Building CXX object librpc/CMakeFiles/confluod.dir/src/rpc_constants.cc.o
[ 89%] Building CXX object librpc/CMakeFiles/confluod.dir/src/rpc_service.cc.o
[ 90%] Building CXX object librpc/CMakeFiles/confluod.dir/src/rpc_server.cc.o
[ 91%] Linking CXX executable ../../bin/tstest
[ 91%] Built target tstest
[ 91%] Building CXX object librpc/CMakeFiles/confluod.dir/src/rpc_types.cc.o
[ 92%] Building CXX object librpc/CMakeFiles/confluod.dir/src/rpc_alert_stream.cc.o
Scanning dependencies of target stest
[ 93%] Building CXX object examples/libstreaming/CMakeFiles/stest.dir/test/test_main.cc.o
[ 94%] Linking CXX executable rpctest
[ 94%] Built target rpctest
[ 95%] Building CXX object librpc/CMakeFiles/confluod.dir/src/rpc_client.cc.o
[ 96%] Building CXX object librpc/CMakeFiles/confluod.dir/src/rpc_record_batch_builder.cc.o
[ 96%] Building CXX object librpc/CMakeFiles/confluod.dir/src/rpc_record_stream.cc.o
[ 97%] Building CXX object librpc/CMakeFiles/confluod.dir/src/rpc_type_conversions.cc.o
[ 98%] Linking CXX executable ../../bin/stest
[ 99%] Building CXX object librpc/CMakeFiles/confluod.dir/src/confluo_server.cc.o
[ 99%] Built target stest
[ 99%] Linking CXX executable confluod
[ 99%] Built target confluod
[100%] Linking CXX executable ctest
[100%] Built target ctest
+ make test ARGS=-VV
Running tests...
UpdateCTestConfiguration  from :/home/jenkins/workspace/confluo-prb/build/DartConfiguration.tcl
Parse Config file:/home/jenkins/workspace/confluo-prb/build/DartConfiguration.tcl
UpdateCTestConfiguration  from :/home/jenkins/workspace/confluo-prb/build/DartConfiguration.tcl
Parse Config file:/home/jenkins/workspace/confluo-prb/build/DartConfiguration.tcl
Test project /home/jenkins/workspace/confluo-prb/build
Constructing a list of tests
Done constructing a list of tests
Checking test dependency graph...
Checking test dependency graph end
test 1
    Start 1: ConfluoTest

1: Test command: /home/jenkins/workspace/confluo-prb/build/libconfluo/ctest
1: Test timeout computed to be: 1500
1: [==========] Running 167 tests from 41 test cases.
1: [----------] Global test environment set-up.
1: [----------] 4 tests from AggregateTest
1: [ RUN      ] AggregateTest.SumTest
1: 2021-03-15 20:50:08 WARN: Could not find configuration file in any of /etc/conf/confluo.conf, ./conf/confluo.conf
1: [       OK ] AggregateTest.SumTest (0 ms)
1: [ RUN      ] AggregateTest.MinTest
1: [       OK ] AggregateTest.MinTest (0 ms)
1: [ RUN      ] AggregateTest.MaxTest
1: [       OK ] AggregateTest.MaxTest (0 ms)
1: [ RUN      ] AggregateTest.CountTest
1: [       OK ] AggregateTest.CountTest (0 ms)
1: [----------] 4 tests from AggregateTest (0 ms total)
1: 
1: [----------] 2 tests from AggregatedReflogTest
1: [ RUN      ] AggregatedReflogTest.GetSetTest
1: [       OK ] AggregatedReflogTest.GetSetTest (1 ms)
1: [ RUN      ] AggregatedReflogTest.MultiThreadedGetSetTest
1: [       OK ] AggregatedReflogTest.MultiThreadedGetSetTest (1 ms)
1: [----------] 2 tests from AggregatedReflogTest (2 ms total)
1: 
1: [----------] 2 tests from BitmapTest
1: [ RUN      ] BitmapTest.GetSetBitTest
1: [       OK ] BitmapTest.GetSetBitTest (8 ms)
1: [ RUN      ] BitmapTest.GetSetValPosTest
1: [       OK ] BitmapTest.GetSetValPosTest (1 ms)
1: [----------] 2 tests from BitmapTest (9 ms total)
1: 
1: [----------] 3 tests from BitmapArrayTest
1: [ RUN      ] BitmapArrayTest.UnsizedBitmapArrayTest
1: [       OK ] BitmapArrayTest.UnsizedBitmapArrayTest (9 ms)
1: [ RUN      ] BitmapArrayTest.UnsignedBitmapArrayTest
1: [       OK ] BitmapArrayTest.UnsignedBitmapArrayTest (9 ms)
1: [ RUN      ] BitmapArrayTest.SignedBitmapArrayTest
1: [       OK ] BitmapArrayTest.SignedBitmapArrayTest (13 ms)
1: [----------] 3 tests from BitmapArrayTest (31 ms total)
1: 
1: [----------] 1 test from BatchedCursorTest
1: [ RUN      ] BatchedCursorTest.IntVectorTest
1: [       OK ] BatchedCursorTest.IntVectorTest (0 ms)
1: [----------] 1 test from BatchedCursorTest (0 ms total)
1: 
1: [----------] 3 tests from ByteStringTest
1: [ RUN      ] ByteStringTest.FromUnsignedIntegerTest
1: [       OK ] ByteStringTest.FromUnsignedIntegerTest (0 ms)
1: [ RUN      ] ByteStringTest.FromSignedIntegerTest
1: [       OK ] ByteStringTest.FromSignedIntegerTest (0 ms)
1: [ RUN      ] ByteStringTest.FromStringTest
1: [       OK ] ByteStringTest.FromStringTest (0 ms)
1: [----------] 3 tests from ByteStringTest (0 ms total)
1: 
1: [----------] 2 tests from ColumnTest
1: [ RUN      ] ColumnTest.GetterTest
1: [       OK ] ColumnTest.GetterTest (0 ms)
1: [ RUN      ] ColumnTest.IndexStateTest
1: [       OK ] ColumnTest.IndexStateTest (0 ms)
1: [----------] 2 tests from ColumnTest (0 ms total)
1: 
1: [----------] 1 test from DataTypesTest
1: [ RUN      ] DataTypesTest.GetterTest
1: [       OK ] DataTypesTest.GetterTest (0 ms)
1: [----------] 1 test from DataTypesTest (0 ms total)
1: 
1: [----------] 16 tests from LZ4EncodeTest
1: [ RUN      ] LZ4EncodeTest.EncodeDecodeFullTest
1: [       OK ] LZ4EncodeTest.EncodeDecodeFullTest (0 ms)
1: [ RUN      ] LZ4EncodeTest.EncodeDecodePartialTest
1: [       OK ] LZ4EncodeTest.EncodeDecodePartialTest (0 ms)
1: [ RUN      ] LZ4EncodeTest.EncodeDecodePartialLessThanBlockSizeTest
1: [       OK ] LZ4EncodeTest.EncodeDecodePartialLessThanBlockSizeTest (0 ms)
1: [ RUN      ] LZ4EncodeTest.EncodeDecodePartialLastIndexTest
1: [       OK ] LZ4EncodeTest.EncodeDecodePartialLastIndexTest (0 ms)
1: [ RUN      ] LZ4EncodeTest.EncodeDecodeIndexTest
1: [       OK ] LZ4EncodeTest.EncodeDecodeIndexTest (0 ms)
1: [ RUN      ] LZ4EncodeTest.EncodeDecodeIdxPtrTest
1: [       OK ] LZ4EncodeTest.EncodeDecodeIdxPtrTest (0 ms)
1: [ RUN      ] LZ4EncodeTest.EncodeDecodeFullBigBlockTest
1: [       OK ] LZ4EncodeTest.EncodeDecodeFullBigBlockTest (0 ms)
1: [ RUN      ] LZ4EncodeTest.EncodeDecodePartialBigBlockTest
1: [       OK ] LZ4EncodeTest.EncodeDecodePartialBigBlockTest (0 ms)
1: [ RUN      ] LZ4EncodeTest.EncodeDecodeIndexBigBlockTest
1: [       OK ] LZ4EncodeTest.EncodeDecodeIndexBigBlockTest (0 ms)
1: [ RUN      ] LZ4EncodeTest.EncodeDecodeIdxPtrBigBlockTest
1: [       OK ] LZ4EncodeTest.EncodeDecodeIdxPtrBigBlockTest (0 ms)
1: [ RUN      ] LZ4EncodeTest.EncodeDecodeFullDivisibleBlockTest
1: [       OK ] LZ4EncodeTest.EncodeDecodeFullDivisibleBlockTest (0 ms)
1: [ RUN      ] LZ4EncodeTest.EncodeDecodePartialDivisibleBlockTest
1: [       OK ] LZ4EncodeTest.EncodeDecodePartialDivisibleBlockTest (0 ms)
1: [ RUN      ] LZ4EncodeTest.EncodeDecodePartialLessThanBlockSizeDivisibleBlockTest
1: [       OK ] LZ4EncodeTest.EncodeDecodePartialLessThanBlockSizeDivisibleBlockTest (0 ms)
1: [ RUN      ] LZ4EncodeTest.EncodeDecodePartialLastIndexDivisibleBlockTest
1: [       OK ] LZ4EncodeTest.EncodeDecodePartialLastIndexDivisibleBlockTest (0 ms)
1: [ RUN      ] LZ4EncodeTest.EncodeDecodeIndexDivisibleBlockTest
1: [       OK ] LZ4EncodeTest.EncodeDecodeIndexDivisibleBlockTest (0 ms)
1: [ RUN      ] LZ4EncodeTest.EncodeDecodeIdxPtrDivisibleBlockTest
1: [       OK ] LZ4EncodeTest.EncodeDecodeIdxPtrDivisibleBlockTest (1 ms)
1: [----------] 16 tests from LZ4EncodeTest (1 ms total)
1: 
1: [----------] 7 tests from DeltaEncodeTest
1: [ RUN      ] DeltaEncodeTest.DecodeFullTest
1: [       OK ] DeltaEncodeTest.DecodeFullTest (0 ms)
1: [ RUN      ] DeltaEncodeTest.DecodePartialTest
1: [       OK ] DeltaEncodeTest.DecodePartialTest (0 ms)
1: [ RUN      ] DeltaEncodeTest.DecodePtrIndexTest
1: [       OK ] DeltaEncodeTest.DecodePtrIndexTest (1 ms)
1: [ RUN      ] DeltaEncodeTest.DecodeIndexTest
1: [       OK ] DeltaEncodeTest.DecodeIndexTest (1 ms)
1: [ RUN      ] DeltaEncodeTest.DecodeFullRandTest
1: [       OK ] DeltaEncodeTest.DecodeFullRandTest (2 ms)
1: [ RUN      ] DeltaEncodeTest.DecodePartialRandTest
1: [       OK ] DeltaEncodeTest.DecodePartialRandTest (0 ms)
1: [ RUN      ] DeltaEncodeTest.DecodePtrIndexRandTest
1: [       OK ] DeltaEncodeTest.DecodePtrIndexRandTest (2 ms)
1: [----------] 7 tests from DeltaEncodeTest (6 ms total)
1: 
1: [----------] 3 tests from DeltaEncodedArrayTest
1: [ RUN      ] DeltaEncodedArrayTest.EliasGammaEncodedArrayOneElemTest
1: [       OK ] DeltaEncodedArrayTest.EliasGammaEncodedArrayOneElemTest (0 ms)
1: [ RUN      ] DeltaEncodedArrayTest.EliasGammaEncodedArrayTest
1: [       OK ] DeltaEncodedArrayTest.EliasGammaEncodedArrayTest (483 ms)
1: [ RUN      ] DeltaEncodedArrayTest.ToFromByteArrayTest
1: [       OK ] DeltaEncodedArrayTest.ToFromByteArrayTest (1 ms)
1: [----------] 3 tests from DeltaEncodedArrayTest (484 ms total)
1: 
1: [----------] 2 tests from ConfluoStoreTest
1: [ RUN      ] ConfluoStoreTest.AddTableTest
1: [       OK ] ConfluoStoreTest.AddTableTest (118 ms)
1: [ RUN      ] ConfluoStoreTest.RemoveTableTest
1: 2021-03-15 20:50:09 INFO: monitor task started...
1: [       OK ] ConfluoStoreTest.RemoveTableTest (75 ms)
1: [----------] 2 tests from ConfluoStoreTest (193 ms total)
1: 
1: [----------] 12 tests from AtomicMultilogTest
1: [ RUN      ] AtomicMultilogTest.AppendAndGetInMemoryTest
1: 2021-03-15 20:50:09 INFO: monitor task started...
1: 2021-03-15 20:50:09 INFO: monitor task started...
1: [       OK ] AtomicMultilogTest.AppendAndGetInMemoryTest (76 ms)
1: [ RUN      ] AtomicMultilogTest.AppendAndGetDurableTest
1: 2021-03-15 20:50:09 INFO: monitor task started...
1: [       OK ] AtomicMultilogTest.AppendAndGetDurableTest (1744 ms)
1: [ RUN      ] AtomicMultilogTest.AppendAndGetDurableRelaxedTest
1: 2021-03-15 20:50:11 INFO: monitor task started...
1: [       OK ] AtomicMultilogTest.AppendAndGetDurableRelaxedTest (257 ms)
1: [ RUN      ] AtomicMultilogTest.AppendAndGetRecordTest1
1: 2021-03-15 20:50:11 INFO: monitor task started...
1: [       OK ] AtomicMultilogTest.AppendAndGetRecordTest1 (89 ms)
1: [ RUN      ] AtomicMultilogTest.AppendAndGetRecordTest2
1: 2021-03-15 20:50:11 INFO: monitor task started...
1: [       OK ] AtomicMultilogTest.AppendAndGetRecordTest2 (70 ms)
1: [ RUN      ] AtomicMultilogTest.ArchiveTest
1: 2021-03-15 20:50:11 INFO: monitor task started...
1: [       OK ] AtomicMultilogTest.ArchiveTest (71 ms)
1: [ RUN      ] AtomicMultilogTest.IndexTest
1: 2021-03-15 20:50:12 INFO: monitor task started...
1: [       OK ] AtomicMultilogTest.IndexTest (71 ms)
1: [ RUN      ] AtomicMultilogTest.RemoveIndexTest
1: 2021-03-15 20:50:12 INFO: monitor task started...
1: [       OK ] AtomicMultilogTest.RemoveIndexTest (71 ms)
1: [ RUN      ] AtomicMultilogTest.RemoveFilterTriggerTest
1: 2021-03-15 20:50:12 INFO: monitor task started...
1: [       OK ] AtomicMultilogTest.RemoveFilterTriggerTest (1075 ms)
1: [ RUN      ] AtomicMultilogTest.FilterAggregateTriggerTest
1: 2021-03-15 20:50:13 INFO: monitor task started...
1: 2021-03-15 20:50:16 INFO: Alert: { timestamp: 1615866613305, trigger-name: "trigger1", trigger-expression: "agg1 >= double(10.000000)", trigger-value: "double(32.000000)", version: 416 }
1: 2021-03-15 20:50:16 INFO: Alert: { timestamp: 1615866613305, trigger-name: "trigger2", trigger-expression: "agg2 >= double(10.000000)", trigger-value: "double(36.000000)", version: 416 }
1: 2021-03-15 20:50:16 INFO: Alert: { timestamp: 1615866613305, trigger-name: "trigger3", trigger-expression: "agg3 >= double(10.000000)", trigger-value: "double(12.000000)", version: 416 }
1: 2021-03-15 20:50:16 INFO: Alert: { timestamp: 1615866613305, trigger-name: "trigger5", trigger-expression: "agg5 >= double(10.000000)", trigger-value: "double(12.000000)", version: 416 }
1: 2021-03-15 20:50:16 INFO: Alert: { timestamp: 1615866613305, trigger-name: "trigger6", trigger-expression: "agg6 >= double(10.000000)", trigger-value: "double(54.000000)", version: 416 }
1: 2021-03-15 20:50:16 INFO: Alert: { timestamp: 1615866613305, trigger-name: "trigger7", trigger-expression: "agg7 >= double(10.000000)", trigger-value: "double(20.000000)", version: 416 }
1: 2021-03-15 20:50:16 INFO: Alert: { timestamp: 1615866613305, trigger-name: "trigger8", trigger-expression: "agg8 >= double(10.000000)", trigger-value: "double(26.000000)", version: 416 }
1: [       OK ] AtomicMultilogTest.FilterAggregateTriggerTest (3102 ms)
1: [ RUN      ] AtomicMultilogTest.BatchIndexTest
1: 2021-03-15 20:50:16 INFO: monitor task started...
1: [       OK ] AtomicMultilogTest.BatchIndexTest (98 ms)
1: [ RUN      ] AtomicMultilogTest.BatchFilterAggregateTriggerTest
1: 2021-03-15 20:50:16 INFO: monitor task started...
1: 2021-03-15 20:50:17 INFO: Alert: { timestamp: 1615866616482, trigger-name: "trigger1", trigger-expression: "agg1 >= double(10.000000)", trigger-value: "double(32.000000)", version: 416 }
1: 2021-03-15 20:50:17 INFO: Alert: { timestamp: 1615866616482, trigger-name: "trigger2", trigger-expression: "agg2 >= double(10.000000)", trigger-value: "double(36.000000)", version: 416 }
1: 2021-03-15 20:50:17 INFO: Alert: { timestamp: 1615866616482, trigger-name: "trigger3", trigger-expression: "agg3 >= double(10.000000)", trigger-value: "double(12.000000)", version: 416 }
1: 2021-03-15 20:50:17 INFO: Alert: { timestamp: 1615866616482, trigger-name: "trigger5", trigger-expression: "agg5 >= double(10.000000)", trigger-value: "double(12.000000)", version: 416 }
1: 2021-03-15 20:50:17 INFO: Alert: { timestamp: 1615866616482, trigger-name: "trigger6", trigger-expression: "agg6 >= double(10.000000)", trigger-value: "double(54.000000)", version: 416 }
1: 2021-03-15 20:50:17 INFO: Alert: { timestamp: 1615866616482, trigger-name: "trigger7", trigger-expression: "agg7 >= double(10.000000)", trigger-value: "double(20.000000)", version: 416 }
1: 2021-03-15 20:50:17 INFO: Alert: { timestamp: 1615866616482, trigger-name: "trigger8", trigger-expression: "agg8 >= double(10.000000)", trigger-value: "double(26.000000)", version: 416 }
1: [       OK ] AtomicMultilogTest.BatchFilterAggregateTriggerTest (1075 ms)
1: [----------] 12 tests from AtomicMultilogTest (7800 ms total)
1: 
1: [----------] 7 tests from ExpressionCompilerTest
1: [ RUN      ] ExpressionCompilerTest.CompilerTest
1: [       OK ] ExpressionCompilerTest.CompilerTest (1 ms)
1: [ RUN      ] ExpressionCompilerTest.TestCompiledExpressionRecordTest
1: [       OK ] ExpressionCompilerTest.TestCompiledExpressionRecordTest (0 ms)
1: [ RUN      ] ExpressionCompilerTest.TestCompiledExpressionBufferTest
1: [       OK ] ExpressionCompilerTest.TestCompiledExpressionBufferTest (0 ms)
1: [ RUN      ] ExpressionCompilerTest.TestMintermRecordTest
1: [       OK ] ExpressionCompilerTest.TestMintermRecordTest (0 ms)
1: [ RUN      ] ExpressionCompilerTest.TestMintermBufferTest
1: [       OK ] ExpressionCompilerTest.TestMintermBufferTest (0 ms)
1: [ RUN      ] ExpressionCompilerTest.TestPredicateRecordTest
1: [       OK ] ExpressionCompilerTest.TestPredicateRecordTest (0 ms)
1: [ RUN      ] ExpressionCompilerTest.TestPredicateBufferTest
1: [       OK ] ExpressionCompilerTest.TestPredicateBufferTest (0 ms)
1: [----------] 7 tests from ExpressionCompilerTest (1 ms total)
1: 
1: [----------] 5 tests from ExpressionParserTest
1: [ RUN      ] ExpressionParserTest.ParsePredicateTest
1: [       OK ] ExpressionParserTest.ParsePredicateTest (0 ms)
1: [ RUN      ] ExpressionParserTest.ParseOrTest
1: [       OK ] ExpressionParserTest.ParseOrTest (0 ms)
1: [ RUN      ] ExpressionParserTest.ParseAndTest
1: [       OK ] ExpressionParserTest.ParseAndTest (0 ms)
1: [ RUN      ] ExpressionParserTest.ParseNotTest
1: [       OK ] ExpressionParserTest.ParseNotTest (0 ms)
1: [ RUN      ] ExpressionParserTest.ParseAndOrTest
1: [       OK ] ExpressionParserTest.ParseAndOrTest (0 ms)
1: [----------] 5 tests from ExpressionParserTest (0 ms total)
1: 
1: [----------] 4 tests from FilterTest
1: [ RUN      ] FilterTest.FilterFunctionTest
1: [       OK ] FilterTest.FilterFunctionTest (164 ms)
1: [ RUN      ] FilterTest.FilterExpressionTest
1: [       OK ] FilterTest.FilterExpressionTest (34 ms)
1: [ RUN      ] FilterTest.AggregateTest
1: [       OK ] FilterTest.AggregateTest (225 ms)
1: [ RUN      ] FilterTest.MultiThreadedAggregateTest
1: [       OK ] FilterTest.MultiThreadedAggregateTest (481 ms)
1: [----------] 4 tests from FilterTest (904 ms total)
1: 
1: [----------] 4 tests from FilterArchivalTest
1: [ RUN      ] FilterArchivalTest.FilterCorrectnessTestSingleCall
1: [       OK ] FilterArchivalTest.FilterCorrectnessTestSingleCall (509 ms)
1: [ RUN      ] FilterArchivalTest.FilterCorrectnessTestMultipleCalls
1: [       OK ] FilterArchivalTest.FilterCorrectnessTestMultipleCalls (435 ms)
1: [ RUN      ] FilterArchivalTest.FirstReflogArchivedTest
1: [       OK ] FilterArchivalTest.FirstReflogArchivedTest (316 ms)
1: [ RUN      ] FilterArchivalTest.MultipleReflogsArchivedTest
1: [       OK ] FilterArchivalTest.MultipleReflogsArchivedTest (372 ms)
1: [----------] 4 tests from FilterArchivalTest (1632 ms total)
1: 
1: [----------] 4 tests from FilterLoadTest
1: [ RUN      ] FilterLoadTest.FilterLogLoadTest
1: [       OK ] FilterLoadTest.FilterLogLoadTest (1892 ms)
1: [ RUN      ] FilterLoadTest.FilterReplayTest
1: [       OK ] FilterLoadTest.FilterReplayTest (1176 ms)
1: [ RUN      ] FilterLoadTest.FilterLogLoadReplayTest
1: [       OK ] FilterLoadTest.FilterLogLoadReplayTest (1553 ms)
1: [ RUN      ] FilterLoadTest.FilterLogResumeArchivalAfterLoadTest
1: [       OK ] FilterLoadTest.FilterLogResumeArchivalAfterLoadTest (1423 ms)
1: [----------] 4 tests from FilterLoadTest (6045 ms total)
1: 
1: [----------] 8 tests from ImmutableValueTest
1: [ RUN      ] ImmutableValueTest.BoolValueTest
1: [       OK ] ImmutableValueTest.BoolValueTest (0 ms)
1: [ RUN      ] ImmutableValueTest.CharValueTest
1: [       OK ] ImmutableValueTest.CharValueTest (0 ms)
1: [ RUN      ] ImmutableValueTest.ShortValueTest
1: [       OK ] ImmutableValueTest.ShortValueTest (0 ms)
1: [ RUN      ] ImmutableValueTest.IntValueTest
1: [       OK ] ImmutableValueTest.IntValueTest (0 ms)
1: [ RUN      ] ImmutableValueTest.LongValueTest
1: [       OK ] ImmutableValueTest.LongValueTest (0 ms)
1: [ RUN      ] ImmutableValueTest.FloatValueTest
1: [       OK ] ImmutableValueTest.FloatValueTest (0 ms)
1: [ RUN      ] ImmutableValueTest.DoubleValueTest
1: [       OK ] ImmutableValueTest.DoubleValueTest (0 ms)
1: [ RUN      ] ImmutableValueTest.StringValueTest
1: [       OK ] ImmutableValueTest.StringValueTest (0 ms)
1: [----------] 8 tests from ImmutableValueTest (0 ms total)
1: 
1: [----------] 1 test from IndexLoadTest
1: [ RUN      ] IndexLoadTest.IndexLogLoadTest
1: [       OK ] IndexLoadTest.IndexLogLoadTest (324 ms)
1: [----------] 1 test from IndexLoadTest (324 ms total)
1: 
1: [----------] 1 test from IndexStateTest
1: [ RUN      ] IndexStateTest.StateTransitionTest
1: [       OK ] IndexStateTest.StateTransitionTest (0 ms)
1: [----------] 1 test from IndexStateTest (0 ms total)
1: 
1: [----------] 3 tests from StorageAllocatorTest
1: [ RUN      ] StorageAllocatorTest.AllocTest
1: 2021-03-15 20:50:26 INFO: Allocation latency: 1247
1: [       OK ] StorageAllocatorTest.AllocTest (0 ms)
1: [ RUN      ] StorageAllocatorTest.DeallocTest
1: [       OK ] StorageAllocatorTest.DeallocTest (0 ms)
1: [ RUN      ] StorageAllocatorTest.GetMetaDataTest
1: [       OK ] StorageAllocatorTest.GetMetaDataTest (0 ms)
1: [----------] 3 tests from StorageAllocatorTest (0 ms total)
1: 
1: [----------] 2 tests from MemoryStatTest
1: [ RUN      ] MemoryStatTest.IncrementGetTest
1: [       OK ] MemoryStatTest.IncrementGetTest (0 ms)
1: [ RUN      ] MemoryStatTest.DecrementGetTest
1: [       OK ] MemoryStatTest.DecrementGetTest (0 ms)
1: [----------] 2 tests from MemoryStatTest (0 ms total)
1: 
1: [----------] 9 tests from MonoLogTest
1: [ RUN      ] MonoLogTest.MonoLogExp2BaseTest
1: [       OK ] MonoLogTest.MonoLogExp2BaseTest (26 ms)
1: [ RUN      ] MonoLogTest.MonoLogExp2BaseReadWriteTest
1: [       OK ] MonoLogTest.MonoLogExp2BaseReadWriteTest (0 ms)
1: [ RUN      ] MonoLogTest.MonoLogExp2Test
1: [       OK ] MonoLogTest.MonoLogExp2Test (344 ms)
1: [ RUN      ] MonoLogTest.MonoLogExp2LinearBaseTest
1: [       OK ] MonoLogTest.MonoLogExp2LinearBaseTest (48 ms)
1: [ RUN      ] MonoLogTest.MonoLogExp2LinearBaseReadWriteTest
1: [       OK ] MonoLogTest.MonoLogExp2LinearBaseReadWriteTest (0 ms)
1: [ RUN      ] MonoLogTest.MonoLogExp2LinearTest
1: [       OK ] MonoLogTest.MonoLogExp2LinearTest (590 ms)
1: [ RUN      ] MonoLogTest.MonoLogLinearIMTest
1: [       OK ] MonoLogTest.MonoLogLinearIMTest (406 ms)
1: [ RUN      ] MonoLogTest.MonoLogLinearDRTest
1: [       OK ] MonoLogTest.MonoLogLinearDRTest (454 ms)
1: [ RUN      ] MonoLogTest.MonoLogLinearDTest
1: [       OK ] MonoLogTest.MonoLogLinearDTest (440 ms)
1: [----------] 9 tests from MonoLogTest (2308 ms total)
1: 
1: [----------] 2 tests from MonologLinearArchivalTest
1: [ RUN      ] MonologLinearArchivalTest.ArchivalTest
1: [       OK ] MonologLinearArchivalTest.ArchivalTest (1 ms)
1: [ RUN      ] MonologLinearArchivalTest.PtrSwapTest
1: [       OK ] MonologLinearArchivalTest.PtrSwapTest (68 ms)
1: [----------] 2 tests from MonologLinearArchivalTest (69 ms total)
1: 
1: [----------] 1 test from MonologLinearLoadTest
1: [ RUN      ] MonologLinearLoadTest.FullyArchivedLogLoadTest
1: [       OK ] MonologLinearLoadTest.FullyArchivedLogLoadTest (71 ms)
1: [----------] 1 test from MonologLinearLoadTest (71 ms total)
1: 
1: [----------] 16 tests from MutableValueTest
1: [ RUN      ] MutableValueTest.BoolValueTest
1: [       OK ] MutableValueTest.BoolValueTest (0 ms)
1: [ RUN      ] MutableValueTest.CharValueTest
1: [       OK ] MutableValueTest.CharValueTest (0 ms)
1: [ RUN      ] MutableValueTest.ShortValueTest
1: [       OK ] MutableValueTest.ShortValueTest (0 ms)
1: [ RUN      ] MutableValueTest.IntValueTest
1: [       OK ] MutableValueTest.IntValueTest (0 ms)
1: [ RUN      ] MutableValueTest.LongValueTest
1: [       OK ] MutableValueTest.LongValueTest (0 ms)
1: [ RUN      ] MutableValueTest.FloatValueTest
1: [       OK ] MutableValueTest.FloatValueTest (1 ms)
1: [ RUN      ] MutableValueTest.DoubleValueTest
1: [       OK ] MutableValueTest.DoubleValueTest (0 ms)
1: [ RUN      ] MutableValueTest.StringValueTest
1: [       OK ] MutableValueTest.StringValueTest (0 ms)
1: [ RUN      ] MutableValueTest.BoolParseTest
1: [       OK ] MutableValueTest.BoolParseTest (0 ms)
1: [ RUN      ] MutableValueTest.CharParseTest
1: [       OK ] MutableValueTest.CharParseTest (0 ms)
1: [ RUN      ] MutableValueTest.ShortParseTest
1: [       OK ] MutableValueTest.ShortParseTest (0 ms)
1: [ RUN      ] MutableValueTest.IntParseTest
1: [       OK ] MutableValueTest.IntParseTest (0 ms)
1: [ RUN      ] MutableValueTest.LongParseTest
1: [       OK ] MutableValueTest.LongParseTest (0 ms)
1: [ RUN      ] MutableValueTest.FloatParseTest
1: [       OK ] MutableValueTest.FloatParseTest (0 ms)
1: [ RUN      ] MutableValueTest.DoubleParseTest
1: [       OK ] MutableValueTest.DoubleParseTest (0 ms)
1: [ RUN      ] MutableValueTest.StringParseTest
1: [       OK ] MutableValueTest.StringParseTest (0 ms)
1: [----------] 16 tests from MutableValueTest (1 ms total)
1: 
1: [----------] 1 test from PeriodicTaskTest
1: [ RUN      ] PeriodicTaskTest.DummyTaskTest
1: 2021-03-15 20:50:28 INFO: dummy task started...
1: [       OK ] PeriodicTaskTest.DummyTaskTest (1000 ms)
1: [----------] 1 test from PeriodicTaskTest (1000 ms total)
1: 
1: [----------] 3 tests from PtrTest
1: [ RUN      ] PtrTest.MetadataSizeTest
1: [       OK ] PtrTest.MetadataSizeTest (0 ms)
1: [ RUN      ] PtrTest.CopyTest
1: [       OK ] PtrTest.CopyTest (0 ms)
1: [ RUN      ] PtrTest.SwapTest
1: [       OK ] PtrTest.SwapTest (0 ms)
1: [----------] 3 tests from PtrTest (1 ms total)
1: 
1: [----------] 6 tests from RadixTreeTest
1: [ RUN      ] RadixTreeTest.InsertGetTest
1: [       OK ] RadixTreeTest.InsertGetTest (0 ms)
1: [ RUN      ] RadixTreeTest.UpperLowerBoundTest
1: [       OK ] RadixTreeTest.UpperLowerBoundTest (1 ms)
1: [ RUN      ] RadixTreeTest.IteratorTest
1: [       OK ] RadixTreeTest.IteratorTest (2 ms)
1: [ RUN      ] RadixTreeTest.ReflogRangeLookupTest
1: [       OK ] RadixTreeTest.ReflogRangeLookupTest (1 ms)
1: [ RUN      ] RadixTreeTest.ApproxCountTest
1: [       OK ] RadixTreeTest.ApproxCountTest (8 ms)
1: [ RUN      ] RadixTreeTest.RangeLookupTest
1: [       OK ] RadixTreeTest.RangeLookupTest (2 ms)
1: [----------] 6 tests from RadixTreeTest (14 ms total)
1: 
1: [----------] 2 tests from RecordBatchTest
1: [ RUN      ] RecordBatchTest.RecordBatchBuilderTest1
1: [       OK ] RecordBatchTest.RecordBatchBuilderTest1 (0 ms)
1: [ RUN      ] RecordBatchTest.RecordBatchBuilderTest2
1: [       OK ] RecordBatchTest.RecordBatchBuilderTest2 (0 ms)
1: [----------] 2 tests from RecordBatchTest (0 ms total)
1: 
1: [----------] 1 test from SchemaParserTest
1: [ RUN      ] SchemaParserTest.BasicTest
1: [       OK ] SchemaParserTest.BasicTest (2 ms)
1: [----------] 1 test from SchemaParserTest (2 ms total)
1: 
1: [----------] 3 tests from SchemaTest
1: [ RUN      ] SchemaTest.SchemaBuilderTest
1: [       OK ] SchemaTest.SchemaBuilderTest (0 ms)
1: [ RUN      ] SchemaTest.SchemaOpsTest
1: [       OK ] SchemaTest.SchemaOpsTest (0 ms)
1: [ RUN      ] SchemaTest.SchemaApplyTest
1: [       OK ] SchemaTest.SchemaApplyTest (0 ms)
1: [----------] 3 tests from SchemaTest (0 ms total)
1: 
1: [----------] 9 tests from StreamTest
1: [ RUN      ] StreamTest.BasicTest
1: [       OK ] StreamTest.BasicTest (0 ms)
1: [ RUN      ] StreamTest.TakeTest
1: [       OK ] StreamTest.TakeTest (0 ms)
1: [ RUN      ] StreamTest.ForEachTest
1: [       OK ] StreamTest.ForEachTest (0 ms)
1: [ RUN      ] StreamTest.MapTest
1: [       OK ] StreamTest.MapTest (0 ms)
1: [ RUN      ] StreamTest.ConcatTest
1: [       OK ] StreamTest.ConcatTest (0 ms)
1: [ RUN      ] StreamTest.FilterTest
1: [       OK ] StreamTest.FilterTest (0 ms)
1: [ RUN      ] StreamTest.FlatMapTest
1: [       OK ] StreamTest.FlatMapTest (1 ms)
1: [ RUN      ] StreamTest.DistinctTest
1: [       OK ] StreamTest.DistinctTest (0 ms)
1: [ RUN      ] StreamTest.ContainerTest
1: [       OK ] StreamTest.ContainerTest (0 ms)
1: [----------] 9 tests from StreamTest (1 ms total)
1: 
1: [----------] 2 tests from StringMapTest
1: [ RUN      ] StringMapTest.PutGetTest
1: [       OK ] StringMapTest.PutGetTest (0 ms)
1: [ RUN      ] StringMapTest.PutRemoveGetTest
1: [       OK ] StringMapTest.PutRemoveGetTest (0 ms)
1: [----------] 2 tests from StringMapTest (0 ms total)
1: 
1: [----------] 1 test from AtomicMultilogMetadataTest
1: [ RUN      ] AtomicMultilogMetadataTest.ReadWriteTest
1: [       OK ] AtomicMultilogMetadataTest.ReadWriteTest (0 ms)
1: [----------] 1 test from AtomicMultilogMetadataTest (0 ms total)
1: 
1: [----------] 1 test from TaskTest
1: [ RUN      ] TaskTest.AddTaskTest
1: [       OK ] TaskTest.AddTaskTest (0 ms)
1: [----------] 1 test from TaskTest (0 ms total)
1: 
1: [----------] 2 tests from ThreadManagerTest
1: [ RUN      ] ThreadManagerTest.RegisterDeregisterTest
1: [       OK ] ThreadManagerTest.RegisterDeregisterTest (0 ms)
1: [ RUN      ] ThreadManagerTest.MultiThreadedRegisterDeregisterTest
1: [       OK ] ThreadManagerTest.MultiThreadedRegisterDeregisterTest (3 ms)
1: [----------] 2 tests from ThreadManagerTest (3 ms total)
1: 
1: [----------] 1 test from AggregateParserTest
1: [ RUN      ] AggregateParserTest.ParseTest
1: [       OK ] AggregateParserTest.ParseTest (0 ms)
1: [----------] 1 test from AggregateParserTest (0 ms total)
1: 
1: [----------] 1 test from TriggerParserTest
1: [ RUN      ] TriggerParserTest.ParseTest
1: [       OK ] TriggerParserTest.ParseTest (0 ms)
1: [----------] 1 test from TriggerParserTest (0 ms total)
1: 
1: [----------] 9 tests from TypeManagerTest
1: [ RUN      ] TypeManagerTest.RegisterTest
1: [       OK ] TypeManagerTest.RegisterTest (0 ms)
1: [ RUN      ] TypeManagerTest.FilterTest
1: 2021-03-15 20:50:29 INFO: monitor task started...
1: [       OK ] TypeManagerTest.FilterTest (98 ms)
1: [ RUN      ] TypeManagerTest.IPAddressTest
1: [       OK ] TypeManagerTest.IPAddressTest (13 ms)
1: [ RUN      ] TypeManagerTest.SizeTypeTest
1: [       OK ] TypeManagerTest.SizeTypeTest (7 ms)
1: [ RUN      ] TypeManagerTest.CompilerTest
1: [       OK ] TypeManagerTest.CompilerTest (8 ms)
1: [ RUN      ] TypeManagerTest.SchemaTest
1: [       OK ] TypeManagerTest.SchemaTest (0 ms)
1: [ RUN      ] TypeManagerTest.DataTypesGetterTest
1: [       OK ] TypeManagerTest.DataTypesGetterTest (0 ms)
1: [ RUN      ] TypeManagerTest.SerializeTest
1: [       OK ] TypeManagerTest.SerializeTest (2 ms)
1: [ RUN      ] TypeManagerTest.DeserializeTest
1: [       OK ] TypeManagerTest.DeserializeTest (1 ms)
1: [----------] 9 tests from TypeManagerTest (129 ms total)
1: 
1: [----------] Global test environment tear-down
1: [==========] 167 tests from 41 test cases ran. (21031 ms total)
1: [  PASSED  ] 167 tests.
1/6 Test #1: ConfluoTest ......................   Passed   21.19 sec
test 2
    Start 2: RpcTest

2: Test command: /home/jenkins/workspace/confluo-prb/build/librpc/rpctest
2: Test timeout computed to be: 1500
2: [==========] Running 14 tests from 3 test cases.
2: [----------] Global test environment set-up.
2: [----------] 1 test from ClientConnectionTest
2: [ RUN      ] ClientConnectionTest.ConcurrentConnectionsTest
2: 2021-03-15 20:50:30 INFO: Connecting to 127.0.0.1:9090
2: Thrift: Mon Mar 15 20:50:30 2021 TSocket::open() connect() <Host: 127.0.0.1 Port: 9090>Connection refused
2: 2021-03-15 20:50:30 INFO: Connecting to 127.0.0.1:9090
2: 2021-03-15 20:50:30 INFO: Incoming connection
2: 			SocketInfo: <Host: 127.0.0.1 Port: 56794>
2: 			PeerHost: localhost
2: 			PeerAddress: 127.0.0.1
2: 			PeerPort: 56794
2: 2021-03-15 20:50:30 WARN: Could not find configuration file in any of /etc/conf/confluo.conf, ./conf/confluo.conf
2: 2021-03-15 20:50:30 INFO: Registered handler thread 140248225666816 as 0
2: 2021-03-15 20:50:30 INFO: Disconnecting from localhost:9090
2: 2021-03-15 20:50:30 INFO: Deregistered handler thread 140248225666816 as 0
2: 2021-03-15 20:50:30 INFO: Connecting to 127.0.0.1:9090
2: 2021-03-15 20:50:30 INFO: Incoming connection
2: 			SocketInfo: <Host: 127.0.0.1 Port: 56796>
2: 			PeerHost: localhost
2: 			PeerAddress: 127.0.0.1
2: 			PeerPort: 56796
2: 2021-03-15 20:50:30 INFO: Registered handler thread 140248187172608 as 0
2: 2021-03-15 20:50:30 INFO: Connecting to 127.0.0.1:9090
2: 2021-03-15 20:50:30 INFO: Incoming connection
2: 			SocketInfo: <Host: 127.0.0.1 Port: 56798>
2: 			PeerHost: localhost
2: 			PeerAddress: 127.0.0.1
2: 			PeerPort: 56798
2: 2021-03-15 20:50:30 INFO: Registered handler thread 140248186119936 as 1
2: 2021-03-15 20:50:30 INFO: Connecting to 127.0.0.1:9090
2: 2021-03-15 20:50:30 INFO: Incoming connection
2: 			SocketInfo: <Host: 127.0.0.1 Port: 56800>
2: 			PeerHost: localhost
2: 			PeerAddress: 127.0.0.1
2: 			PeerPort: 56800
2: 2021-03-15 20:50:30 INFO: Registered handler thread 140248185067264 as 2
2: 2021-03-15 20:50:30 INFO: Connecting to 127.0.0.1:9090
2: 2021-03-15 20:50:30 INFO: Incoming connection
2: 			SocketInfo: <Host: 127.0.0.1 Port: 56802>
2: 			PeerHost: localhost
2: 			PeerAddress: 127.0.0.1
2: 			PeerPort: 56802
2: 2021-03-15 20:50:30 INFO: Registered handler thread 140248184014592 as 3
2: 2021-03-15 20:50:30 INFO: Connecting to 127.0.0.1:9090
2: 2021-03-15 20:50:30 INFO: Incoming connection
2: 			SocketInfo: <Host: 127.0.0.1 Port: 56804>
2: 			PeerHost: localhost
2: 			PeerAddress: 127.0.0.1
2: 			PeerPort: 56804
2: 2021-03-15 20:50:30 INFO: Registered handler thread 140248182961920 as 4
2: 2021-03-15 20:50:30 INFO: Connecting to 127.0.0.1:9090
2: 2021-03-15 20:50:30 INFO: Incoming connection
2: 			SocketInfo: <Host: 127.0.0.1 Port: 56806>
2: 			PeerHost: localhost
2: 			PeerAddress: 127.0.0.1
2: 			PeerPort: 56806
2: 2021-03-15 20:50:30 INFO: Registered handler thread 140248181909248 as 5
2: 2021-03-15 20:50:30 INFO: Connecting to 127.0.0.1:9090
2: 2021-03-15 20:50:30 INFO: Incoming connection
2: 			SocketInfo: <Host: 127.0.0.1 Port: 56808>
2: 			PeerHost: localhost
2: 			PeerAddress: 127.0.0.1
2: 			PeerPort: 56808
2: 2021-03-15 20:50:30 INFO: Registered handler thread 140248180856576 as 6
2: 2021-03-15 20:50:30 INFO: Connecting to 127.0.0.1:9090
2: 2021-03-15 20:50:30 INFO: Incoming connection
2: 			SocketInfo: <Host: 127.0.0.1 Port: 56810>
2: 			PeerHost: localhost
2: 			PeerAddress: 127.0.0.1
2: 			PeerPort: 56810
2: 2021-03-15 20:50:30 INFO: Registered handler thread 140248179803904 as 7
2: 2021-03-15 20:50:30 INFO: Connecting to 127.0.0.1:9090
2: 2021-03-15 20:50:30 INFO: Incoming connection
2: 			SocketInfo: <Host: 127.0.0.1 Port: 56812>
2: 			PeerHost: localhost
2: 			PeerAddress: 127.0.0.1
2: 			PeerPort: 56812
2: 2021-03-15 20:50:30 INFO: Registered handler thread 140248178751232 as 8
2: 2021-03-15 20:50:30 INFO: Connecting to 127.0.0.1:9090
2: 2021-03-15 20:50:30 INFO: Incoming connection
2: 			SocketInfo: <Host: 127.0.0.1 Port: 56814>
2: 			PeerHost: localhost
2: 			PeerAddress: 127.0.0.1
2: 			PeerPort: 56814
2: 2021-03-15 20:50:30 INFO: Registered handler thread 140248177698560 as 9
2: 2021-03-15 20:50:30 INFO: Connecting to 127.0.0.1:9090
2: 2021-03-15 20:50:30 INFO: Incoming connection
2: 			SocketInfo: <Host: 127.0.0.1 Port: 56816>
2: 			PeerHost: localhost
2: 			PeerAddress: 127.0.0.1
2: 			PeerPort: 56816
2: 2021-03-15 20:50:30 INFO: Registered handler thread 140248176645888 as 10
2: 2021-03-15 20:50:30 INFO: Connecting to 127.0.0.1:9090
2: 2021-03-15 20:50:30 INFO: Incoming connection
2: 			SocketInfo: <Host: 127.0.0.1 Port: 56818>
2: 			PeerHost: localhost
2: 			PeerAddress: 127.0.0.1
2: 			PeerPort: 56818
2: 2021-03-15 20:50:30 INFO: Registered handler thread 140248175593216 as 11
2: 2021-03-15 20:50:30 INFO: Connecting to 127.0.0.1:9090
2: 2021-03-15 20:50:30 INFO: Incoming connection
2: 			SocketInfo: <Host: 127.0.0.1 Port: 56820>
2: 			PeerHost: localhost
2: 			PeerAddress: 127.0.0.1
2: 			PeerPort: 56820
2: 2021-03-15 20:50:30 INFO: Registered handler thread 140248174540544 as 12
2: 2021-03-15 20:50:30 INFO: Connecting to 127.0.0.1:9090
2: 2021-03-15 20:50:30 INFO: Incoming connection
2: 			SocketInfo: <Host: 127.0.0.1 Port: 56822>
2: 			PeerHost: localhost
2: 			PeerAddress: 127.0.0.1
2: 			PeerPort: 56822
2: 2021-03-15 20:50:30 INFO: Registered handler thread 140248173487872 as 13
2: 2021-03-15 20:50:30 INFO: Connecting to 127.0.0.1:9090
2: 2021-03-15 20:50:30 INFO: Incoming connection
2: 			SocketInfo: <Host: 127.0.0.1 Port: 56824>
2: 			PeerHost: localhost
2: 			PeerAddress: 127.0.0.1
2: 			PeerPort: 56824
2: 2021-03-15 20:50:30 INFO: Registered handler thread 140248172435200 as 14
2: 2021-03-15 20:50:30 INFO: Connecting to 127.0.0.1:9090
2: 2021-03-15 20:50:30 INFO: Incoming connection
2: 			SocketInfo: <Host: 127.0.0.1 Port: 56826>
2: 			PeerHost: localhost
2: 			PeerAddress: 127.0.0.1
2: 			PeerPort: 56826
2: 2021-03-15 20:50:30 INFO: Registered handler thread 140248171382528 as 15
2: 2021-03-15 20:50:30 INFO: Connecting to 127.0.0.1:9090
2: 2021-03-15 20:50:30 INFO: Incoming connection
2: 			SocketInfo: <Host: 127.0.0.1 Port: 56828>
2: 			PeerHost: localhost
2: 			PeerAddress: 127.0.0.1
2: 			PeerPort: 56828
2: 2021-03-15 20:50:30 INFO: Registered handler thread 140248170329856 as 16
2: 2021-03-15 20:50:30 INFO: Connecting to 127.0.0.1:9090
2: 2021-03-15 20:50:30 INFO: Incoming connection
2: 			SocketInfo: <Host: 127.0.0.1 Port: 56830>
2: 			PeerHost: localhost
2: 			PeerAddress: 127.0.0.1
2: 			PeerPort: 56830
2: 2021-03-15 20:50:30 INFO: Registered handler thread 140248169277184 as 17
2: 2021-03-15 20:50:30 INFO: Connecting to 127.0.0.1:9090
2: 2021-03-15 20:50:30 INFO: Incoming connection
2: 			SocketInfo: <Host: 127.0.0.1 Port: 56832>
2: 			PeerHost: localhost
2: 			PeerAddress: 127.0.0.1
2: 			PeerPort: 56832
2: 2021-03-15 20:50:30 INFO: Registered handler thread 140248168224512 as 18
2: 2021-03-15 20:50:30 INFO: Connecting to 127.0.0.1:9090
2: 2021-03-15 20:50:30 INFO: Incoming connection
2: 			SocketInfo: <Host: 127.0.0.1 Port: 56834>
2: 			PeerHost: localhost
2: 			PeerAddress: 127.0.0.1
2: 			PeerPort: 56834
2: 2021-03-15 20:50:30 INFO: Registered handler thread 140248167171840 as 19
2: 2021-03-15 20:50:30 INFO: Connecting to 127.0.0.1:9090
2: 2021-03-15 20:50:30 INFO: Incoming connection
2: 			SocketInfo: <Host: 127.0.0.1 Port: 56836>
2: 			PeerHost: localhost
2: 			PeerAddress: 127.0.0.1
2: 			PeerPort: 56836
2: 2021-03-15 20:50:30 INFO: Registered handler thread 140248166119168 as 20
2: 2021-03-15 20:50:30 INFO: Connecting to 127.0.0.1:9090
2: 2021-03-15 20:50:30 INFO: Incoming connection
2: 			SocketInfo: <Host: 127.0.0.1 Port: 56838>
2: 			PeerHost: localhost
2: 			PeerAddress: 127.0.0.1
2: 			PeerPort: 56838
2: 2021-03-15 20:50:30 INFO: Registered handler thread 140248165066496 as 21
2: 2021-03-15 20:50:30 INFO: Connecting to 127.0.0.1:9090
2: 2021-03-15 20:50:30 INFO: Incoming connection
2: 			SocketInfo: <Host: 127.0.0.1 Port: 56840>
2: 			PeerHost: localhost
2: 			PeerAddress: 127.0.0.1
2: 			PeerPort: 56840
2: 2021-03-15 20:50:30 INFO: Registered handler thread 140248164013824 as 22
2: 2021-03-15 20:50:30 INFO: Connecting to 127.0.0.1:9090
2: 2021-03-15 20:50:30 INFO: Incoming connection
2: 			SocketInfo: <Host: 127.0.0.1 Port: 56842>
2: 			PeerHost: localhost
2: 			PeerAddress: 127.0.0.1
2: 			PeerPort: 56842
2: 2021-03-15 20:50:30 INFO: Registered handler thread 140248162961152 as 23
2: 2021-03-15 20:50:30 INFO: Connecting to 127.0.0.1:9090
2: 2021-03-15 20:50:30 INFO: Incoming connection
2: 			SocketInfo: <Host: 127.0.0.1 Port: 56844>
2: 			PeerHost: localhost
2: 			PeerAddress: 127.0.0.1
2: 			PeerPort: 56844
2: 2021-03-15 20:50:30 INFO: Registered handler thread 140248161908480 as 24
2: 2021-03-15 20:50:30 INFO: Connecting to 127.0.0.1:9090
2: 2021-03-15 20:50:30 INFO: Incoming connection
2: 			SocketInfo: <Host: 127.0.0.1 Port: 56846>
2: 			PeerHost: localhost
2: 			PeerAddress: 127.0.0.1
2: 			PeerPort: 56846
2: 2021-03-15 20:50:30 INFO: Registered handler thread 140248160855808 as 25
2: 2021-03-15 20:50:30 INFO: Connecting to 127.0.0.1:9090
2: 2021-03-15 20:50:30 INFO: Incoming connection
2: 			SocketInfo: <Host: 127.0.0.1 Port: 56848>
2: 			PeerHost: localhost
2: 			PeerAddress: 127.0.0.1
2: 			PeerPort: 56848
2: 2021-03-15 20:50:30 INFO: Registered handler thread 140248159803136 as 26
2: 2021-03-15 20:50:30 INFO: Connecting to 127.0.0.1:9090
2: 2021-03-15 20:50:30 INFO: Incoming connection
2: 			SocketInfo: <Host: 127.0.0.1 Port: 56850>
2: 			PeerHost: localhost
2: 			PeerAddress: 127.0.0.1
2: 			PeerPort: 56850
2: 2021-03-15 20:50:30 INFO: Registered handler thread 140248158750464 as 27
2: 2021-03-15 20:50:30 INFO: Connecting to 127.0.0.1:9090
2: 2021-03-15 20:50:30 INFO: Incoming connection
2: 			SocketInfo: <Host: 127.0.0.1 Port: 56852>
2: 			PeerHost: localhost
2: 			PeerAddress: 127.0.0.1
2: 			PeerPort: 56852
2: 2021-03-15 20:50:30 INFO: Registered handler thread 140248157697792 as 28
2: 2021-03-15 20:50:30 INFO: Connecting to 127.0.0.1:9090
2: 2021-03-15 20:50:30 INFO: Incoming connection
2: 			SocketInfo: <Host: 127.0.0.1 Port: 56854>
2: 			PeerHost: localhost
2: 			PeerAddress: 127.0.0.1
2: 			PeerPort: 56854
2: 2021-03-15 20:50:30 INFO: Registered handler thread 140248156645120 as 29
2: 2021-03-15 20:50:30 INFO: Connecting to 127.0.0.1:9090
2: 2021-03-15 20:50:30 INFO: Incoming connection
2: 			SocketInfo: <Host: 127.0.0.1 Port: 56856>
2: 			PeerHost: localhost
2: 			PeerAddress: 127.0.0.1
2: 			PeerPort: 56856
2: 2021-03-15 20:50:30 INFO: Registered handler thread 140248155592448 as 30
2: 2021-03-15 20:50:30 INFO: Connecting to 127.0.0.1:9090
2: 2021-03-15 20:50:30 INFO: Incoming connection
2: 			SocketInfo: <Host: 127.0.0.1 Port: 56858>
2: 			PeerHost: localhost
2: 			PeerAddress: 127.0.0.1
2: 			PeerPort: 56858
2: 2021-03-15 20:50:30 INFO: Registered handler thread 140248154539776 as 31
2: 2021-03-15 20:50:30 INFO: Connecting to 127.0.0.1:9090
2: 2021-03-15 20:50:30 INFO: Incoming connection
2: 			SocketInfo: <Host: 127.0.0.1 Port: 56860>
2: 			PeerHost: localhost
2: 			PeerAddress: 127.0.0.1
2: 			PeerPort: 56860
2: 2021-03-15 20:50:30 INFO: Registered handler thread 140248153487104 as 32
2: 2021-03-15 20:50:30 INFO: Connecting to 127.0.0.1:9090
2: 2021-03-15 20:50:30 INFO: Incoming connection
2: 			SocketInfo: <Host: 127.0.0.1 Port: 56862>
2: 			PeerHost: localhost
2: 			PeerAddress: 127.0.0.1
2: 			PeerPort: 56862
2: 2021-03-15 20:50:30 INFO: Registered handler thread 140248152434432 as 33
2: 2021-03-15 20:50:30 INFO: Connecting to 127.0.0.1:9090
2: 2021-03-15 20:50:30 INFO: Incoming connection
2: 			SocketInfo: <Host: 127.0.0.1 Port: 56864>
2: 			PeerHost: localhost
2: 			PeerAddress: 127.0.0.1
2: 			PeerPort: 56864
2: 2021-03-15 20:50:30 INFO: Registered handler thread 140248151381760 as 34
2: 2021-03-15 20:50:30 INFO: Connecting to 127.0.0.1:9090
2: 2021-03-15 20:50:30 INFO: Incoming connection
2: 			SocketInfo: <Host: 127.0.0.1 Port: 56866>
2: 			PeerHost: localhost
2: 			PeerAddress: 127.0.0.1
2: 			PeerPort: 56866
2: 2021-03-15 20:50:30 INFO: Registered handler thread 140248150329088 as 35
2: 2021-03-15 20:50:30 INFO: Connecting to 127.0.0.1:9090
2: 2021-03-15 20:50:30 INFO: Incoming connection
2: 			SocketInfo: <Host: 127.0.0.1 Port: 56868>
2: 			PeerHost: localhost
2: 			PeerAddress: 127.0.0.1
2: 			PeerPort: 56868
2: 2021-03-15 20:50:30 INFO: Registered handler thread 140248149276416 as 36
2: 2021-03-15 20:50:30 INFO: Connecting to 127.0.0.1:9090
2: 2021-03-15 20:50:30 INFO: Incoming connection
2: 			SocketInfo: <Host: 127.0.0.1 Port: 56870>
2: 			PeerHost: localhost
2: 			PeerAddress: 127.0.0.1
2: 			PeerPort: 56870
2: 2021-03-15 20:50:30 INFO: Registered handler thread 140248148223744 as 37
2: 2021-03-15 20:50:30 INFO: Connecting to 127.0.0.1:9090
2: 2021-03-15 20:50:30 INFO: Incoming connection
2: 			SocketInfo: <Host: 127.0.0.1 Port: 56872>
2: 			PeerHost: localhost
2: 			PeerAddress: 127.0.0.1
2: 			PeerPort: 56872
2: 2021-03-15 20:50:30 INFO: Registered handler thread 140248147171072 as 38
2: 2021-03-15 20:50:30 INFO: Connecting to 127.0.0.1:9090
2: 2021-03-15 20:50:30 INFO: Incoming connection
2: 			SocketInfo: <Host: 127.0.0.1 Port: 56874>
2: 			PeerHost: localhost
2: 			PeerAddress: 127.0.0.1
2: 			PeerPort: 56874
2: 2021-03-15 20:50:30 INFO: Registered handler thread 140248146118400 as 39
2: 2021-03-15 20:50:30 INFO: Connecting to 127.0.0.1:9090
2: 2021-03-15 20:50:30 INFO: Incoming connection
2: 			SocketInfo: <Host: 127.0.0.1 Port: 56876>
2: 			PeerHost: localhost
2: 			PeerAddress: 127.0.0.1
2: 			PeerPort: 56876
2: 2021-03-15 20:50:30 INFO: Registered handler thread 140248145065728 as 40
2: 2021-03-15 20:50:30 INFO: Connecting to 127.0.0.1:9090
2: 2021-03-15 20:50:30 INFO: Incoming connection
2: 			SocketInfo: <Host: 127.0.0.1 Port: 56878>
2: 			PeerHost: localhost
2: 			PeerAddress: 127.0.0.1
2: 			PeerPort: 56878
2: 2021-03-15 20:50:30 INFO: Registered handler thread 140248144013056 as 41
2: 2021-03-15 20:50:30 INFO: Connecting to 127.0.0.1:9090
2: 2021-03-15 20:50:30 INFO: Incoming connection
2: 			SocketInfo: <Host: 127.0.0.1 Port: 56880>
2: 			PeerHost: localhost
2: 			PeerAddress: 127.0.0.1
2: 			PeerPort: 56880
2: 2021-03-15 20:50:30 INFO: Registered handler thread 140248142960384 as 42
2: 2021-03-15 20:50:30 INFO: Connecting to 127.0.0.1:9090
2: 2021-03-15 20:50:30 INFO: Incoming connection
2: 			SocketInfo: <Host: 127.0.0.1 Port: 56882>
2: 			PeerHost: localhost
2: 			PeerAddress: 127.0.0.1
2: 			PeerPort: 56882
2: 2021-03-15 20:50:30 INFO: Registered handler thread 140248141907712 as 43
2: 2021-03-15 20:50:30 INFO: Connecting to 127.0.0.1:9090
2: 2021-03-15 20:50:30 INFO: Incoming connection
2: 			SocketInfo: <Host: 127.0.0.1 Port: 56884>
2: 			PeerHost: localhost
2: 			PeerAddress: 127.0.0.1
2: 			PeerPort: 56884
2: 2021-03-15 20:50:30 INFO: Registered handler thread 140248140855040 as 44
2: 2021-03-15 20:50:30 INFO: Connecting to 127.0.0.1:9090
2: 2021-03-15 20:50:30 INFO: Incoming connection
2: 			SocketInfo: <Host: 127.0.0.1 Port: 56886>
2: 			PeerHost: localhost
2: 			PeerAddress: 127.0.0.1
2: 			PeerPort: 56886
2: 2021-03-15 20:50:30 INFO: Registered handler thread 140248139802368 as 45
2: 2021-03-15 20:50:30 INFO: Connecting to 127.0.0.1:9090
2: 2021-03-15 20:50:30 INFO: Incoming connection
2: 			SocketInfo: <Host: 127.0.0.1 Port: 56888>
2: 			PeerHost: localhost
2: 			PeerAddress: 127.0.0.1
2: 			PeerPort: 56888
2: 2021-03-15 20:50:30 INFO: Registered handler thread 140248138749696 as 46
2: 2021-03-15 20:50:30 INFO: Connecting to 127.0.0.1:9090
2: 2021-03-15 20:50:30 INFO: Incoming connection
2: 			SocketInfo: <Host: 127.0.0.1 Port: 56890>
2: 			PeerHost: localhost
2: 			PeerAddress: 127.0.0.1
2: 			PeerPort: 56890
2: 2021-03-15 20:50:30 INFO: Registered handler thread 140248137697024 as 47
2: 2021-03-15 20:50:30 INFO: Disconnecting from localhost:9090
2: 2021-03-15 20:50:30 INFO: Deregistered handler thread 140248187172608 as 0
2: 2021-03-15 20:50:30 INFO: Disconnecting from localhost:9090
2: 2021-03-15 20:50:30 INFO: Deregistered handler thread 140248186119936 as 1
2: 2021-03-15 20:50:30 INFO: Disconnecting from localhost:9090
2: 2021-03-15 20:50:30 INFO: Deregistered handler thread 140248185067264 as 2
2: 2021-03-15 20:50:30 INFO: Disconnecting from localhost:9090
2: 2021-03-15 20:50:30 INFO: Deregistered handler thread 140248184014592 as 3
2: 2021-03-15 20:50:30 INFO: Disconnecting from localhost:9090
2: 2021-03-15 20:50:30 INFO: Deregistered handler thread 140248182961920 as 4
2: 2021-03-15 20:50:30 INFO: Disconnecting from localhost:9090
2: 2021-03-15 20:50:30 INFO: Deregistered handler thread 140248181909248 as 5
2: 2021-03-15 20:50:30 INFO: Disconnecting from localhost:9090
2: 2021-03-15 20:50:30 INFO: Deregistered handler thread 140248180856576 as 6
2: 2021-03-15 20:50:30 INFO: Disconnecting from localhost:9090
2: 2021-03-15 20:50:30 INFO: Deregistered handler thread 140248179803904 as 7
2: 2021-03-15 20:50:30 INFO: Disconnecting from localhost:9090
2: 2021-03-15 20:50:30 INFO: Deregistered handler thread 140248178751232 as 8
2: 2021-03-15 20:50:30 INFO: Disconnecting from localhost:9090
2: 2021-03-15 20:50:30 INFO: Deregistered handler thread 140248177698560 as 9
2: 2021-03-15 20:50:30 INFO: Disconnecting from localhost:9090
2: 2021-03-15 20:50:30 INFO: Deregistered handler thread 140248176645888 as 10
2: 2021-03-15 20:50:30 INFO: Disconnecting from localhost:9090
2: 2021-03-15 20:50:30 INFO: Deregistered handler thread 140248175593216 as 11
2: 2021-03-15 20:50:30 INFO: Disconnecting from localhost:9090
2: 2021-03-15 20:50:30 INFO: Deregistered handler thread 140248174540544 as 12
2: 2021-03-15 20:50:30 INFO: Disconnecting from localhost:9090
2: 2021-03-15 20:50:30 INFO: Deregistered handler thread 140248173487872 as 13
2: 2021-03-15 20:50:30 INFO: Disconnecting from localhost:9090
2: 2021-03-15 20:50:30 INFO: Deregistered handler thread 140248172435200 as 14
2: 2021-03-15 20:50:30 INFO: Disconnecting from localhost:9090
2: 2021-03-15 20:50:30 INFO: Deregistered handler thread 140248171382528 as 15
2: 2021-03-15 20:50:30 INFO: Disconnecting from localhost:9090
2: 2021-03-15 20:50:30 INFO: Deregistered handler thread 140248170329856 as 16
2: 2021-03-15 20:50:30 INFO: Disconnecting from localhost:9090
2: 2021-03-15 20:50:30 INFO: Deregistered handler thread 140248169277184 as 17
2: 2021-03-15 20:50:30 INFO: Disconnecting from localhost:9090
2: 2021-03-15 20:50:30 INFO: Deregistered handler thread 140248168224512 as 18
2: 2021-03-15 20:50:30 INFO: Disconnecting from localhost:9090
2: 2021-03-15 20:50:30 INFO: Deregistered handler thread 140248167171840 as 19
2: 2021-03-15 20:50:30 INFO: Disconnecting from localhost:9090
2: 2021-03-15 20:50:30 INFO: Deregistered handler thread 140248166119168 as 20
2: 2021-03-15 20:50:30 INFO: Disconnecting from localhost:9090
2: 2021-03-15 20:50:30 INFO: Deregistered handler thread 140248165066496 as 21
2: 2021-03-15 20:50:30 INFO: Disconnecting from localhost:9090
2: 2021-03-15 20:50:30 INFO: Deregistered handler thread 140248164013824 as 22
2: 2021-03-15 20:50:30 INFO: Disconnecting from localhost:9090
2: 2021-03-15 20:50:30 INFO: Deregistered handler thread 140248162961152 as 23
2: 2021-03-15 20:50:30 INFO: Disconnecting from localhost:9090
2: 2021-03-15 20:50:30 INFO: Deregistered handler thread 140248161908480 as 24
2: 2021-03-15 20:50:30 INFO: Disconnecting from localhost:9090
2: 2021-03-15 20:50:30 INFO: Deregistered handler thread 140248160855808 as 25
2: 2021-03-15 20:50:30 INFO: Disconnecting from localhost:9090
2: 2021-03-15 20:50:30 INFO: Deregistered handler thread 140248159803136 as 26
2: 2021-03-15 20:50:30 INFO: Disconnecting from localhost:9090
2: 2021-03-15 20:50:30 INFO: Deregistered handler thread 140248158750464 as 27
2: 2021-03-15 20:50:30 INFO: Disconnecting from localhost:9090
2: 2021-03-15 20:50:30 INFO: Deregistered handler thread 140248157697792 as 28
2: 2021-03-15 20:50:30 INFO: Disconnecting from localhost:9090
2: 2021-03-15 20:50:30 INFO: Deregistered handler thread 140248156645120 as 29
2: 2021-03-15 20:50:30 INFO: Disconnecting from localhost:9090
2: 2021-03-15 20:50:30 INFO: Deregistered handler thread 140248155592448 as 30
2: 2021-03-15 20:50:30 INFO: Disconnecting from localhost:9090
2: 2021-03-15 20:50:30 INFO: Deregistered handler thread 140248154539776 as 31
2: 2021-03-15 20:50:30 INFO: Disconnecting from localhost:9090
2: 2021-03-15 20:50:30 INFO: Deregistered handler thread 140248153487104 as 32
2: 2021-03-15 20:50:30 INFO: Disconnecting from localhost:9090
2: 2021-03-15 20:50:30 INFO: Deregistered handler thread 140248152434432 as 33
2: 2021-03-15 20:50:30 INFO: Disconnecting from localhost:9090
2: 2021-03-15 20:50:30 INFO: Deregistered handler thread 140248151381760 as 34
2: 2021-03-15 20:50:30 INFO: Disconnecting from localhost:9090
2: 2021-03-15 20:50:30 INFO: Deregistered handler thread 140248150329088 as 35
2: 2021-03-15 20:50:30 INFO: Disconnecting from localhost:9090
2: 2021-03-15 20:50:30 INFO: Deregistered handler thread 140248149276416 as 36
2: 2021-03-15 20:50:30 INFO: Disconnecting from localhost:9090
2: 2021-03-15 20:50:30 INFO: Deregistered handler thread 140248148223744 as 37
2: 2021-03-15 20:50:30 INFO: Disconnecting from localhost:9090
2: 2021-03-15 20:50:30 INFO: Deregistered handler thread 140248147171072 as 38
2: 2021-03-15 20:50:30 INFO: Disconnecting from localhost:9090
2: 2021-03-15 20:50:30 INFO: Deregistered handler thread 140248146118400 as 39
2: 2021-03-15 20:50:30 INFO: Disconnecting from localhost:9090
2: 2021-03-15 20:50:30 INFO: Deregistered handler thread 140248145065728 as 40
2: 2021-03-15 20:50:30 INFO: Disconnecting from localhost:9090
2: 2021-03-15 20:50:30 INFO: Deregistered handler thread 140248144013056 as 41
2: 2021-03-15 20:50:30 INFO: Disconnecting from localhost:9090
2: 2021-03-15 20:50:30 INFO: Deregistered handler thread 140248142960384 as 42
2: 2021-03-15 20:50:30 INFO: Disconnecting from localhost:9090
2: 2021-03-15 20:50:30 INFO: Deregistered handler thread 140248141907712 as 43
2: 2021-03-15 20:50:30 INFO: Disconnecting from localhost:9090
2: 2021-03-15 20:50:30 INFO: Deregistered handler thread 140248140855040 as 44
2: 2021-03-15 20:50:30 INFO: Disconnecting from localhost:9090
2: 2021-03-15 20:50:30 INFO: Deregistered handler thread 140248139802368 as 45
2: 2021-03-15 20:50:30 INFO: Disconnecting from localhost:9090
2: 2021-03-15 20:50:30 INFO: Deregistered handler thread 140248138749696 as 46
2: 2021-03-15 20:50:30 INFO: Disconnecting from localhost:9090
2: 2021-03-15 20:50:30 INFO: Deregistered handler thread 140248137697024 as 47
2: [       OK ] ClientConnectionTest.ConcurrentConnectionsTest (314 ms)
2: [----------] 1 test from ClientConnectionTest (314 ms total)
2: 
2: [----------] 7 tests from ClientReadOpsTest
2: [ RUN      ] ClientReadOpsTest.ReadInMemoryTest
2: 2021-03-15 20:50:30 INFO: Connecting to 127.0.0.1:9090
2: Thrift: Mon Mar 15 20:50:30 2021 TSocket::open() connect() <Host: 127.0.0.1 Port: 9090>Connection refused
2: 2021-03-15 20:50:30 INFO: monitor task started...
2: 2021-03-15 20:50:30 INFO: Connecting to 127.0.0.1:9090
2: 2021-03-15 20:50:30 INFO: Incoming connection
2: 			SocketInfo: <Host: 127.0.0.1 Port: 56894>
2: 			PeerHost: localhost
2: 			PeerAddress: 127.0.0.1
2: 			PeerPort: 56894
2: 2021-03-15 20:50:30 INFO: Registered handler thread 140248137697024 as 1
2: 2021-03-15 20:50:30 INFO: Disconnecting from localhost:9090
2: 2021-03-15 20:50:30 INFO: Deregistered handler thread 140248137697024 as 1
2: 2021-03-15 20:50:30 INFO: Connecting to 127.0.0.1:9090
2: 2021-03-15 20:50:30 INFO: Incoming connection
2: 			SocketInfo: <Host: 127.0.0.1 Port: 56896>
2: 			PeerHost: localhost
2: 			PeerAddress: 127.0.0.1
2: 			PeerPort: 56896
2: 2021-03-15 20:50:30 INFO: Registered handler thread 140248138749696 as 1
2: 2021-03-15 20:50:30 INFO: Disconnecting from localhost:9090
2: 2021-03-15 20:50:30 INFO: Deregistered handler thread 140248138749696 as 1
2: [       OK ] ClientReadOpsTest.ReadInMemoryTest (263 ms)
2: [ RUN      ] ClientReadOpsTest.ReadDurableTest
2: 2021-03-15 20:50:30 INFO: Connecting to 127.0.0.1:9090
2: Thrift: Mon Mar 15 20:50:30 2021 TSocket::open() connect() <Host: 127.0.0.1 Port: 9090>Connection refused
2: 2021-03-15 20:50:30 INFO: monitor task started...
2: 2021-03-15 20:50:31 INFO: Connecting to 127.0.0.1:9090
2: 2021-03-15 20:50:31 INFO: Incoming connection
2: 			SocketInfo: <Host: 127.0.0.1 Port: 56900>
2: 			PeerHost: localhost
2: 			PeerAddress: 127.0.0.1
2: 			PeerPort: 56900
2: 2021-03-15 20:50:31 INFO: Registered handler thread 140248138749696 as 1
2: 2021-03-15 20:50:31 INFO: Disconnecting from localhost:9090
2: 2021-03-15 20:50:31 INFO: Deregistered handler thread 140248138749696 as 1
2: 2021-03-15 20:50:31 INFO: Connecting to 127.0.0.1:9090
2: 2021-03-15 20:50:31 INFO: Incoming connection
2: 			SocketInfo: <Host: 127.0.0.1 Port: 56902>
2: 			PeerHost: localhost
2: 			PeerAddress: 127.0.0.1
2: 			PeerPort: 56902
2: 2021-03-15 20:50:31 INFO: Registered handler thread 140248137697024 as 1
2: 2021-03-15 20:50:32 INFO: Disconnecting from localhost:9090
2: 2021-03-15 20:50:32 INFO: Deregistered handler thread 140248137697024 as 1
2: [       OK ] ClientReadOpsTest.ReadDurableTest (1854 ms)
2: [ RUN      ] ClientReadOpsTest.ReadDurableRelaxedTest
2: 2021-03-15 20:50:32 INFO: Connecting to 127.0.0.1:9090
2: Thrift: Mon Mar 15 20:50:32 2021 TSocket::open() connect() <Host: 127.0.0.1 Port: 9090>Connection refused
2: 2021-03-15 20:50:32 INFO: monitor task started...
2: 2021-03-15 20:50:32 INFO: Connecting to 127.0.0.1:9090
2: 2021-03-15 20:50:32 INFO: Incoming connection
2: 			SocketInfo: <Host: 127.0.0.1 Port: 56906>
2: 			PeerHost: localhost
2: 			PeerAddress: 127.0.0.1
2: 			PeerPort: 56906
2: 2021-03-15 20:50:32 INFO: Registered handler thread 140248137697024 as 1
2: 2021-03-15 20:50:32 INFO: Disconnecting from localhost:9090
2: 2021-03-15 20:50:32 INFO: Deregistered handler thread 140248137697024 as 1
2: 2021-03-15 20:50:32 INFO: Connecting to 127.0.0.1:9090
2: 2021-03-15 20:50:32 INFO: Incoming connection
2: 			SocketInfo: <Host: 127.0.0.1 Port: 56908>
2: 			PeerHost: localhost
2: 			PeerAddress: 127.0.0.1
2: 			PeerPort: 56908
2: 2021-03-15 20:50:32 INFO: Registered handler thread 140248138749696 as 1
2: 2021-03-15 20:50:32 INFO: Disconnecting from localhost:9090
2: 2021-03-15 20:50:32 INFO: Deregistered handler thread 140248138749696 as 1
2: [       OK ] ClientReadOpsTest.ReadDurableRelaxedTest (310 ms)
2: [ RUN      ] ClientReadOpsTest.AdHocFilterTest
2: 2021-03-15 20:50:33 INFO: Connecting to 127.0.0.1:9090
2: Thrift: Mon Mar 15 20:50:33 2021 TSocket::open() connect() <Host: 127.0.0.1 Port: 9090>Connection refused
2: 2021-03-15 20:50:33 INFO: monitor task started...
2: 2021-03-15 20:50:33 INFO: Connecting to 127.0.0.1:9090
2: 2021-03-15 20:50:33 INFO: Incoming connection
2: 			SocketInfo: <Host: 127.0.0.1 Port: 56912>
2: 			PeerHost: localhost
2: 			PeerAddress: 127.0.0.1
2: 			PeerPort: 56912
2: 2021-03-15 20:50:33 INFO: Registered handler thread 140248138749696 as 1
2: 2021-03-15 20:50:33 INFO: Disconnecting from localhost:9090
2: 2021-03-15 20:50:33 INFO: Deregistered handler thread 140248138749696 as 1
2: 2021-03-15 20:50:33 INFO: Connecting to 127.0.0.1:9090
2: 2021-03-15 20:50:33 INFO: Incoming connection
2: 			SocketInfo: <Host: 127.0.0.1 Port: 56914>
2: 			PeerHost: localhost
2: 			PeerAddress: 127.0.0.1
2: 			PeerPort: 56914
2: 2021-03-15 20:50:33 INFO: Registered handler thread 140248137697024 as 1
2: 2021-03-15 20:50:33 INFO: Disconnecting from localhost:9090
2: 2021-03-15 20:50:33 INFO: Deregistered handler thread 140248137697024 as 1
2: [       OK ] ClientReadOpsTest.AdHocFilterTest (196 ms)
2: [ RUN      ] ClientReadOpsTest.FilterAggregateTriggerTest
2: 2021-03-15 20:50:33 INFO: Connecting to 127.0.0.1:9090
2: Thrift: Mon Mar 15 20:50:33 2021 TSocket::open() connect() <Host: 127.0.0.1 Port: 9090>Connection refused
2: 2021-03-15 20:50:33 INFO: monitor task started...
2: 2021-03-15 20:50:33 INFO: Connecting to 127.0.0.1:9090
2: 2021-03-15 20:50:33 INFO: Incoming connection
2: 			SocketInfo: <Host: 127.0.0.1 Port: 56918>
2: 			PeerHost: localhost
2: 			PeerAddress: 127.0.0.1
2: 			PeerPort: 56918
2: 2021-03-15 20:50:33 INFO: Registered handler thread 140248137697024 as 1
2: 2021-03-15 20:50:33 INFO: Disconnecting from localhost:9090
2: 2021-03-15 20:50:33 INFO: Deregistered handler thread 140248137697024 as 1
2: 2021-03-15 20:50:33 INFO: Connecting to 127.0.0.1:9090
2: 2021-03-15 20:50:33 INFO: Incoming connection
2: 			SocketInfo: <Host: 127.0.0.1 Port: 56920>
2: 			PeerHost: localhost
2: 			PeerAddress: 127.0.0.1
2: 			PeerPort: 56920
2: 2021-03-15 20:50:33 INFO: Registered handler thread 140248138749696 as 1
2: Aggregate: double(32.000000)
2: 2021-03-15 20:50:34 INFO: Alert: { timestamp: 1615866633270, trigger-name: "trigger1", trigger-expression: "agg1 >= double(10.000000)", trigger-value: "double(32.000000)", version: 416 }
2: 2021-03-15 20:50:34 INFO: Alert: { timestamp: 1615866633270, trigger-name: "trigger2", trigger-expression: "agg2 >= double(10.000000)", trigger-value: "double(36.000000)", version: 416 }
2: 2021-03-15 20:50:34 INFO: Alert: { timestamp: 1615866633270, trigger-name: "trigger3", trigger-expression: "agg3 >= double(10.000000)", trigger-value: "double(12.000000)", version: 416 }
2: 2021-03-15 20:50:34 INFO: Alert: { timestamp: 1615866633270, trigger-name: "trigger5", trigger-expression: "agg5 >= double(10.000000)", trigger-value: "double(12.000000)", version: 416 }
2: 2021-03-15 20:50:34 INFO: Alert: { timestamp: 1615866633270, trigger-name: "trigger6", trigger-expression: "agg6 >= double(10.000000)", trigger-value: "double(54.000000)", version: 416 }
2: 2021-03-15 20:50:34 INFO: Alert: { timestamp: 1615866633270, trigger-name: "trigger7", trigger-expression: "agg7 >= double(10.000000)", trigger-value: "double(20.000000)", version: 416 }
2: 2021-03-15 20:50:34 INFO: Alert: { timestamp: 1615866633270, trigger-name: "trigger8", trigger-expression: "agg8 >= double(10.000000)", trigger-value: "double(26.000000)", version: 416 }
2: 2021-03-15 20:50:34 INFO: Disconnecting from localhost:9090
2: 2021-03-15 20:50:34 INFO: Deregistered handler thread 140248138749696 as 1
2: [       OK ] ClientReadOpsTest.FilterAggregateTriggerTest (1233 ms)
2: [ RUN      ] ClientReadOpsTest.BatchAdHocFilterTest
2: 2021-03-15 20:50:34 INFO: Connecting to 127.0.0.1:9090
2: Thrift: Mon Mar 15 20:50:34 2021 TSocket::open() connect() <Host: 127.0.0.1 Port: 9090>Connection refused
2: 2021-03-15 20:50:34 INFO: monitor task started...
2: 2021-03-15 20:50:34 INFO: Connecting to 127.0.0.1:9090
2: 2021-03-15 20:50:34 INFO: Incoming connection
2: 			SocketInfo: <Host: 127.0.0.1 Port: 56924>
2: 			PeerHost: localhost
2: 			PeerAddress: 127.0.0.1
2: 			PeerPort: 56924
2: 2021-03-15 20:50:34 INFO: Registered handler thread 140248138749696 as 1
2: 2021-03-15 20:50:34 INFO: Disconnecting from localhost:9090
2: 2021-03-15 20:50:34 INFO: Deregistered handler thread 140248138749696 as 1
2: 2021-03-15 20:50:34 INFO: Connecting to 127.0.0.1:9090
2: 2021-03-15 20:50:34 INFO: Incoming connection
2: 			SocketInfo: <Host: 127.0.0.1 Port: 56926>
2: 			PeerHost: localhost
2: 			PeerAddress: 127.0.0.1
2: 			PeerPort: 56926
2: 2021-03-15 20:50:34 INFO: Registered handler thread 140248137697024 as 1
2: 2021-03-15 20:50:34 INFO: Disconnecting from localhost:9090
2: 2021-03-15 20:50:34 INFO: Deregistered handler thread 140248137697024 as 1
2: [       OK ] ClientReadOpsTest.BatchAdHocFilterTest (219 ms)
2: [ RUN      ] ClientReadOpsTest.BatchFilterAggregateTriggerTest
2: 2021-03-15 20:50:34 INFO: Connecting to 127.0.0.1:9090
2: Thrift: Mon Mar 15 20:50:34 2021 TSocket::open() connect() <Host: 127.0.0.1 Port: 9090>Connection refused
2: 2021-03-15 20:50:34 INFO: monitor task started...
2: 2021-03-15 20:50:34 INFO: Connecting to 127.0.0.1:9090
2: 2021-03-15 20:50:34 INFO: Incoming connection
2: 			SocketInfo: <Host: 127.0.0.1 Port: 56930>
2: 			PeerHost: localhost
2: 			PeerAddress: 127.0.0.1
2: 			PeerPort: 56930
2: 2021-03-15 20:50:34 INFO: Registered handler thread 140248137697024 as 1
2: 2021-03-15 20:50:34 INFO: Disconnecting from localhost:9090
2: 2021-03-15 20:50:34 INFO: Deregistered handler thread 140248137697024 as 1
2: 2021-03-15 20:50:34 INFO: Connecting to 127.0.0.1:9090
2: 2021-03-15 20:50:34 INFO: Incoming connection
2: 			SocketInfo: <Host: 127.0.0.1 Port: 56932>
2: 			PeerHost: localhost
2: 			PeerAddress: 127.0.0.1
2: 			PeerPort: 56932
2: 2021-03-15 20:50:34 INFO: Registered handler thread 140248138749696 as 1
2: 2021-03-15 20:50:35 INFO: Alert: { timestamp: 1615866634729, trigger-name: "trigger1", trigger-expression: "agg1 >= double(10.000000)", trigger-value: "double(32.000000)", version: 416 }
2: 2021-03-15 20:50:35 INFO: Alert: { timestamp: 1615866634729, trigger-name: "trigger2", trigger-expression: "agg2 >= double(10.000000)", trigger-value: "double(36.000000)", version: 416 }
2: 2021-03-15 20:50:35 INFO: Alert: { timestamp: 1615866634729, trigger-name: "trigger3", trigger-expression: "agg3 >= double(10.000000)", trigger-value: "double(12.000000)", version: 416 }
2: 2021-03-15 20:50:35 INFO: Alert: { timestamp: 1615866634729, trigger-name: "trigger5", trigger-expression: "agg5 >= double(10.000000)", trigger-value: "double(12.000000)", version: 416 }
2: 2021-03-15 20:50:35 INFO: Alert: { timestamp: 1615866634729, trigger-name: "trigger6", trigger-expression: "agg6 >= double(10.000000)", trigger-value: "double(54.000000)", version: 416 }
2: 2021-03-15 20:50:35 INFO: Alert: { timestamp: 1615866634729, trigger-name: "trigger7", trigger-expression: "agg7 >= double(10.000000)", trigger-value: "double(20.000000)", version: 416 }
2: 2021-03-15 20:50:35 INFO: Alert: { timestamp: 1615866634729, trigger-name: "trigger8", trigger-expression: "agg8 >= double(10.000000)", trigger-value: "double(26.000000)", version: 416 }
2: 2021-03-15 20:50:35 INFO: Disconnecting from localhost:9090
2: 2021-03-15 20:50:35 INFO: Deregistered handler thread 140248138749696 as 1
2: [       OK ] ClientReadOpsTest.BatchFilterAggregateTriggerTest (1222 ms)
2: [----------] 7 tests from ClientReadOpsTest (5297 ms total)
2: 
2: [----------] 6 tests from ClientWriteOpsTest
2: [ RUN      ] ClientWriteOpsTest.CreateTableTest
2: 2021-03-15 20:50:35 INFO: Connecting to 127.0.0.1:9090
2: Thrift: Mon Mar 15 20:50:35 2021 TSocket::open() connect() <Host: 127.0.0.1 Port: 9090>Connection refused
2: 2021-03-15 20:50:35 INFO: Connecting to 127.0.0.1:9090
2: 2021-03-15 20:50:35 INFO: Incoming connection
2: 			SocketInfo: <Host: 127.0.0.1 Port: 56936>
2: 			PeerHost: localhost
2: 			PeerAddress: 127.0.0.1
2: 			PeerPort: 56936
2: 2021-03-15 20:50:35 INFO: Registered handler thread 140248138749696 as 1
2: 2021-03-15 20:50:35 INFO: Disconnecting from localhost:9090
2: 2021-03-15 20:50:35 INFO: Deregistered handler thread 140248138749696 as 1
2: 2021-03-15 20:50:35 INFO: Connecting to 127.0.0.1:9090
2: 2021-03-15 20:50:35 INFO: Incoming connection
2: 			SocketInfo: <Host: 127.0.0.1 Port: 56938>
2: 			PeerHost: localhost
2: 			PeerAddress: 127.0.0.1
2: 			PeerPort: 56938
2: 2021-03-15 20:50:35 INFO: Registered handler thread 140248137697024 as 1
2: 2021-03-15 20:50:36 INFO: monitor task started...
2: 2021-03-15 20:50:36 INFO: Disconnecting from localhost:9090
2: 2021-03-15 20:50:36 INFO: Deregistered handler thread 140248137697024 as 1
2: [       OK ] ClientWriteOpsTest.CreateTableTest (219 ms)
2: [ RUN      ] ClientWriteOpsTest.WriteTest
2: 2021-03-15 20:50:36 INFO: Connecting to 127.0.0.1:9090
2: Thrift: Mon Mar 15 20:50:36 2021 TSocket::open() connect() <Host: 127.0.0.1 Port: 9090>Connection refused
2: 2021-03-15 20:50:36 INFO: monitor task started...
2: 2021-03-15 20:50:36 INFO: Connecting to 127.0.0.1:9090
2: 2021-03-15 20:50:36 INFO: Incoming connection
2: 			SocketInfo: <Host: 127.0.0.1 Port: 56942>
2: 			PeerHost: localhost
2: 			PeerAddress: 127.0.0.1
2: 			PeerPort: 56942
2: 2021-03-15 20:50:36 INFO: Registered handler thread 140248137697024 as 1
2: 2021-03-15 20:50:36 INFO: Disconnecting from localhost:9090
2: 2021-03-15 20:50:36 INFO: Deregistered handler thread 140248137697024 as 1
2: 2021-03-15 20:50:36 INFO: Connecting to 127.0.0.1:9090
2: 2021-03-15 20:50:36 INFO: Incoming connection
2: 			SocketInfo: <Host: 127.0.0.1 Port: 56944>
2: 			PeerHost: localhost
2: 			PeerAddress: 127.0.0.1
2: 			PeerPort: 56944
2: 2021-03-15 20:50:36 INFO: Registered handler thread 140248138749696 as 1
2: 2021-03-15 20:50:36 INFO: Disconnecting from localhost:9090
2: 2021-03-15 20:50:36 INFO: Deregistered handler thread 140248138749696 as 1
2: [       OK ] ClientWriteOpsTest.WriteTest (192 ms)
2: [ RUN      ] ClientWriteOpsTest.AddIndexTest
2: 2021-03-15 20:50:36 INFO: Connecting to 127.0.0.1:9090
2: Thrift: Mon Mar 15 20:50:36 2021 TSocket::open() connect() <Host: 127.0.0.1 Port: 9090>Connection refused
2: 2021-03-15 20:50:36 INFO: monitor task started...
2: 2021-03-15 20:50:36 INFO: Connecting to 127.0.0.1:9090
2: 2021-03-15 20:50:36 INFO: Incoming connection
2: 			SocketInfo: <Host: 127.0.0.1 Port: 56948>
2: 			PeerHost: localhost
2: 			PeerAddress: 127.0.0.1
2: 			PeerPort: 56948
2: 2021-03-15 20:50:36 INFO: Registered handler thread 140248138749696 as 1
2: 2021-03-15 20:50:36 INFO: Disconnecting from localhost:9090
2: 2021-03-15 20:50:36 INFO: Deregistered handler thread 140248138749696 as 1
2: 2021-03-15 20:50:36 INFO: Connecting to 127.0.0.1:9090
2: 2021-03-15 20:50:36 INFO: Incoming connection
2: 			SocketInfo: <Host: 127.0.0.1 Port: 56950>
2: 			PeerHost: localhost
2: 			PeerAddress: 127.0.0.1
2: 			PeerPort: 56950
2: 2021-03-15 20:50:36 INFO: Registered handler thread 140248137697024 as 1
2: 2021-03-15 20:50:36 INFO: Disconnecting from localhost:9090
2: 2021-03-15 20:50:36 INFO: Deregistered handler thread 140248137697024 as 1
2: [       OK ] ClientWriteOpsTest.AddIndexTest (223 ms)
2: [ RUN      ] ClientWriteOpsTest.AddFilterAndTriggerTest
2: 2021-03-15 20:50:36 INFO: Connecting to 127.0.0.1:9090
2: Thrift: Mon Mar 15 20:50:36 2021 TSocket::open() connect() <Host: 127.0.0.1 Port: 9090>Connection refused
2: 2021-03-15 20:50:36 INFO: monitor task started...
2: 2021-03-15 20:50:36 INFO: Connecting to 127.0.0.1:9090
2: 2021-03-15 20:50:36 INFO: Incoming connection
2: 			SocketInfo: <Host: 127.0.0.1 Port: 56954>
2: 			PeerHost: localhost
2: 			PeerAddress: 127.0.0.1
2: 			PeerPort: 56954
2: 2021-03-15 20:50:36 INFO: Registered handler thread 140248137697024 as 1
2: 2021-03-15 20:50:36 INFO: Disconnecting from localhost:9090
2: 2021-03-15 20:50:36 INFO: Deregistered handler thread 140248137697024 as 1
2: 2021-03-15 20:50:36 INFO: Connecting to 127.0.0.1:9090
2: 2021-03-15 20:50:36 INFO: Incoming connection
2: 			SocketInfo: <Host: 127.0.0.1 Port: 56956>
2: 			PeerHost: localhost
2: 			PeerAddress: 127.0.0.1
2: 			PeerPort: 56956
2: 2021-03-15 20:50:36 INFO: Registered handler thread 140248138749696 as 1
2: 2021-03-15 20:50:37 INFO: Alert: { timestamp: 1615866636695, trigger-name: "trigger1", trigger-expression: "agg1 >= double(10.000000)", trigger-value: "double(32.000000)", version: 416 }
2: 2021-03-15 20:50:37 INFO: Alert: { timestamp: 1615866636695, trigger-name: "trigger2", trigger-expression: "agg2 >= double(10.000000)", trigger-value: "double(36.000000)", version: 416 }
2: 2021-03-15 20:50:37 INFO: Alert: { timestamp: 1615866636695, trigger-name: "trigger3", trigger-expression: "agg3 >= double(10.000000)", trigger-value: "double(12.000000)", version: 416 }
2: 2021-03-15 20:50:37 INFO: Alert: { timestamp: 1615866636695, trigger-name: "trigger5", trigger-expression: "agg5 >= double(10.000000)", trigger-value: "double(12.000000)", version: 416 }
2: 2021-03-15 20:50:37 INFO: Alert: { timestamp: 1615866636695, trigger-name: "trigger6", trigger-expression: "agg6 >= double(10.000000)", trigger-value: "double(54.000000)", version: 416 }
2: 2021-03-15 20:50:37 INFO: Alert: { timestamp: 1615866636695, trigger-name: "trigger7", trigger-expression: "agg7 >= double(10.000000)", trigger-value: "double(20.000000)", version: 416 }
2: 2021-03-15 20:50:37 INFO: Alert: { timestamp: 1615866636695, trigger-name: "trigger8", trigger-expression: "agg8 >= double(10.000000)", trigger-value: "double(26.000000)", version: 416 }
2: 2021-03-15 20:50:37 INFO: Disconnecting from localhost:9090
2: 2021-03-15 20:50:37 INFO: Deregistered handler thread 140248138749696 as 1
2: [       OK ] ClientWriteOpsTest.AddFilterAndTriggerTest (1224 ms)
2: [ RUN      ] ClientWriteOpsTest.RemoveIndexTest
2: 2021-03-15 20:50:37 INFO: Connecting to 127.0.0.1:9090
2: Thrift: Mon Mar 15 20:50:37 2021 TSocket::open() connect() <Host: 127.0.0.1 Port: 9090>Connection refused
2: 2021-03-15 20:50:37 INFO: monitor task started...
2: 2021-03-15 20:50:37 INFO: Connecting to 127.0.0.1:9090
2: 2021-03-15 20:50:37 INFO: Incoming connection
2: 			SocketInfo: <Host: 127.0.0.1 Port: 56960>
2: 			PeerHost: localhost
2: 			PeerAddress: 127.0.0.1
2: 			PeerPort: 56960
2: 2021-03-15 20:50:37 INFO: Registered handler thread 140248138749696 as 1
2: 2021-03-15 20:50:37 INFO: Disconnecting from localhost:9090
2: 2021-03-15 20:50:37 INFO: Deregistered handler thread 140248138749696 as 1
2: 2021-03-15 20:50:37 INFO: Connecting to 127.0.0.1:9090
2: 2021-03-15 20:50:37 INFO: Incoming connection
2: 			SocketInfo: <Host: 127.0.0.1 Port: 56962>
2: 			PeerHost: localhost
2: 			PeerAddress: 127.0.0.1
2: 			PeerPort: 56962
2: 2021-03-15 20:50:37 INFO: Registered handler thread 140248137697024 as 1
2: 2021-03-15 20:50:37 INFO: Disconnecting from localhost:9090
2: 2021-03-15 20:50:37 INFO: Deregistered handler thread 140248137697024 as 1
2: [       OK ] ClientWriteOpsTest.RemoveIndexTest (226 ms)
2: [ RUN      ] ClientWriteOpsTest.RemoveFilterTriggerTest
2: 2021-03-15 20:50:38 INFO: Connecting to 127.0.0.1:9090
2: Thrift: Mon Mar 15 20:50:38 2021 TSocket::open() connect() <Host: 127.0.0.1 Port: 9090>Connection refused
2: 2021-03-15 20:50:38 INFO: monitor task started...
2: 2021-03-15 20:50:38 INFO: Connecting to 127.0.0.1:9090
2: 2021-03-15 20:50:38 INFO: Incoming connection
2: 			SocketInfo: <Host: 127.0.0.1 Port: 56966>
2: 			PeerHost: localhost
2: 			PeerAddress: 127.0.0.1
2: 			PeerPort: 56966
2: 2021-03-15 20:50:38 INFO: Registered handler thread 140248137697024 as 1
2: 2021-03-15 20:50:38 INFO: Disconnecting from localhost:9090
2: 2021-03-15 20:50:38 INFO: Deregistered handler thread 140248137697024 as 1
2: 2021-03-15 20:50:38 INFO: Connecting to 127.0.0.1:9090
2: 2021-03-15 20:50:38 INFO: Incoming connection
2: 			SocketInfo: <Host: 127.0.0.1 Port: 56968>
2: 			PeerHost: localhost
2: 			PeerAddress: 127.0.0.1
2: 			PeerPort: 56968
2: 2021-03-15 20:50:38 INFO: Registered handler thread 140248138749696 as 1
2: 2021-03-15 20:50:39 INFO: Disconnecting from localhost:9090
2: 2021-03-15 20:50:39 INFO: Deregistered handler thread 140248138749696 as 1
2: [       OK ] ClientWriteOpsTest.RemoveFilterTriggerTest (1224 ms)
2: [----------] 6 tests from ClientWriteOpsTest (3308 ms total)
2: 
2: [----------] Global test environment tear-down
2: [==========] 14 tests from 3 test cases ran. (8919 ms total)
2: [  PASSED  ] 14 tests.
2/6 Test #2: RpcTest ..........................   Passed    9.26 sec
test 3
    Start 3: PythonClientTest

3: Test command: /usr/bin/cmake "-E" "env" "CONFLUO_SERVER_EXEC=/home/jenkins/workspace/confluo-prb/build/pyclient/../librpc/confluod" "/home/jenkins/anaconda2/bin/python" "setup.py" "test"
3: Test timeout computed to be: 1500
3: running pytest
3: Searching for thrift>=0.11.0
3: Reading https://pypi.org/simple/thrift/
3: Downloading https://files.pythonhosted.org/packages/97/1e/3284d19d7be99305eda145b8aa46b0c33244e4a496ec66440dac19f8274d/thrift-0.13.0.tar.gz#sha256=9af1c86bf73433afc6010ed376a6c6aca2b54099cc0d61895f640870a9ae7d89
3: Best match: thrift 0.13.0
3: Processing thrift-0.13.0.tar.gz
3: Writing /tmp/easy_install-C6LluW/thrift-0.13.0/setup.cfg
3: Running thrift-0.13.0/setup.py -q bdist_egg --dist-dir /tmp/easy_install-C6LluW/thrift-0.13.0/egg-dist-tmp-d52aZS
3: warning: no previously-included files matching '__pycache__' found anywhere in distribution
3: warning: no previously-included files matching '*.py[co]' found anywhere in distribution
3: cc1plus: warning: command line option ‘-Wstrict-prototypes’ is valid for C/ObjC but not for C++
3: cc1plus: warning: command line option ‘-Wstrict-prototypes’ is valid for C/ObjC but not for C++
3: cc1plus: warning: command line option ‘-Wstrict-prototypes’ is valid for C/ObjC but not for C++
3: cc1plus: warning: command line option ‘-Wstrict-prototypes’ is valid for C/ObjC but not for C++
3: creating /home/jenkins/workspace/confluo-prb/build/pyclient/.eggs/thrift-0.13.0-py2.7-linux-x86_64.egg
3: Extracting thrift-0.13.0-py2.7-linux-x86_64.egg to /home/jenkins/workspace/confluo-prb/build/pyclient/.eggs
3: 
3: Installed /home/jenkins/workspace/confluo-prb/build/pyclient/.eggs/thrift-0.13.0-py2.7-linux-x86_64.egg
3: Searching for pytest-cov
3: Reading https://pypi.org/simple/pytest-cov/
3: Downloading https://files.pythonhosted.org/packages/e3/1a/6affecd2344efee7f2487fac82242474cbac09f9e04929da5944907baf11/pytest_cov-2.11.1-py2.py3-none-any.whl#sha256=bdb9fdb0b85a7cc825269a4c56b48ccaa5c7e365054b6038772c32ddcdc969da
3: Best match: pytest-cov 2.11.1
3: Processing pytest_cov-2.11.1-py2.py3-none-any.whl
3: Installing pytest_cov-2.11.1-py2.py3-none-any.whl to /home/jenkins/workspace/confluo-prb/build/pyclient/.eggs
3: writing requirements to /home/jenkins/workspace/confluo-prb/build/pyclient/.eggs/pytest_cov-2.11.1-py2.7.egg/EGG-INFO/requires.txt
3: 
3: Installed /home/jenkins/workspace/confluo-prb/build/pyclient/.eggs/pytest_cov-2.11.1-py2.7.egg
3: Searching for pytest>=4.6
3: Reading https://pypi.org/simple/pytest/
3: Downloading https://files.pythonhosted.org/packages/d1/80/b4f47a1f933699cd531a7b336a6f3d82912e3e5e66e4a3bb1d8f0d1d98b0/pytest-6.2.2.tar.gz#sha256=9d1edf9e7d0b84d72ea3dbcdfd22b35fb543a5e8f2a60092dd578936bf63d7f9
3: Best match: pytest 6.2.2
3: Processing pytest-6.2.2.tar.gz
3: Writing /tmp/easy_install-RGxHGK/pytest-6.2.2/setup.cfg
3: Running pytest-6.2.2/setup.py -q bdist_egg --dist-dir /tmp/easy_install-RGxHGK/pytest-6.2.2/egg-dist-tmp-5PlvG1
3: error: Setup script exited with error: 'egg_base' must be a directory name (got `src`)
3/6 Test #3: PythonClientTest .................***Failed    8.30 sec
test 4
    Start 4: JavaClientTest

4: Test command: /usr/bin/ant "-Dbuild.dir="/home/jenkins/workspace/confluo-prb/build/javaclient"" "-f" "/home/jenkins/workspace/confluo-prb/build/javaclient/build.xml" "test"
4: Test timeout computed to be: 1500
4: Buildfile: /home/jenkins/workspace/confluo-prb/build/javaclient/build.xml
4: 
4: test-offline:
4: 
4: get-deps:
4:       [get] Getting: https://repo.maven.apache.org/maven2/org/apache/thrift/libthrift/0.11.0/libthrift-0.11.0.jar
4:       [get] To: /home/jenkins/.m2/repository/org/apache/thrift/libthrift/0.11.0/libthrift-0.11.0.jar
4:       [get] Getting: https://repo.maven.apache.org/maven2/org/slf4j/slf4j-api/1.7.12/slf4j-api-1.7.12.jar
4:       [get] To: /home/jenkins/.m2/repository/org/slf4j/slf4j-api/1.7.12/slf4j-api-1.7.12.jar
4:       [get] Getting: https://repo.maven.apache.org/maven2/org/apache/httpcomponents/httpclient/4.4.1/httpclient-4.4.1.jar
4:       [get] To: /home/jenkins/.m2/repository/org/apache/httpcomponents/httpclient/4.4.1/httpclient-4.4.1.jar
4:       [get] Getting: https://repo.maven.apache.org/maven2/commons-logging/commons-logging/1.2/commons-logging-1.2.jar
4:       [get] To: /home/jenkins/.m2/repository/commons-logging/commons-logging/1.2/commons-logging-1.2.jar
4:       [get] Getting: https://repo.maven.apache.org/maven2/commons-codec/commons-codec/1.9/commons-codec-1.9.jar
4:       [get] To: /home/jenkins/.m2/repository/commons-codec/commons-codec/1.9/commons-codec-1.9.jar
4:       [get] Getting: https://repo.maven.apache.org/maven2/org/apache/httpcomponents/httpcore/4.4.1/httpcore-4.4.1.jar
4:       [get] To: /home/jenkins/.m2/repository/org/apache/httpcomponents/httpcore/4.4.1/httpcore-4.4.1.jar
4:       [get] Getting: https://repo.maven.apache.org/maven2/junit/junit/4.12/junit-4.12.jar
4:       [get] To: /home/jenkins/.m2/repository/junit/junit/4.12/junit-4.12.jar
4:       [get] Getting: https://repo.maven.apache.org/maven2/org/hamcrest/hamcrest-core/1.3/hamcrest-core-1.3.jar
4:       [get] To: /home/jenkins/.m2/repository/org/hamcrest/hamcrest-core/1.3/hamcrest-core-1.3.jar
4:       [get] Getting: https://repo.maven.apache.org/maven2/com/google/code/gson/gson/2.2.4/gson-2.2.4.jar
4:       [get] To: /home/jenkins/.m2/repository/com/google/code/gson/gson/2.2.4/gson-2.2.4.jar
4: 
4: compile:
4: 
4: compile-tests:
4:     [mkdir] Created dir: /home/jenkins/workspace/confluo-prb/build/javaclient/target/test-classes
4:     [javac] Compiling 2 source files to /home/jenkins/workspace/confluo-prb/build/javaclient/target/test-classes
4:     [javac] Note: /home/jenkins/workspace/confluo-prb/javaclient/src/test/java/TestPubSub.java uses unchecked or unsafe operations.
4:     [javac] Note: Recompile with -Xlint:unchecked for details.
4: 
4: test-junit-present:
4: 
4: test-junit-status:
4: 
4: junit-missing:
4: 
4: test:
4:     [mkdir] Created dir: /home/jenkins/workspace/confluo-prb/build/javaclient/target/test-reports
4:     [junit] Running TestPubSub
4:     [junit] Testsuite: TestPubSub
4:     [junit] Tests run: 1, Failures: 0, Errors: 1, Skipped: 0, Time elapsed: 0.078 sec
4:     [junit] Tests run: 1, Failures: 0, Errors: 1, Skipped: 0, Time elapsed: 0.078 sec
4:     [junit] ------------- Standard Error -----------------
4:     [junit] SLF4J: Failed to load class "org.slf4j.impl.StaticLoggerBinder".
4:     [junit] SLF4J: Defaulting to no-operation (NOP) logger implementation
4:     [junit] SLF4J: See http://www.slf4j.org/codes.html#StaticLoggerBinder for further details.
4:     [junit] ------------- ---------------- ---------------
4:     [junit] 
4:     [junit] Testcase: testConfluoPubSub took 0.024 sec
4:     [junit] 	Caused an ERROR
4:     [junit] java.net.ConnectException: Connection refused (Connection refused)
4:     [junit] org.apache.thrift.transport.TTransportException: java.net.ConnectException: Connection refused (Connection refused)
4:     [junit] 	at org.apache.thrift.transport.TSocket.open(TSocket.java:226)
4:     [junit] 	at confluo.rpc.RpcClient.connect(RpcClient.java:62)
4:     [junit] 	at confluo.rpc.RpcClient.<init>(RpcClient.java:38)
4:     [junit] 	at confluo.streaming.ConfluoProducer.initialize(ConfluoProducer.java:58)
4:     [junit] 	at confluo.streaming.ConfluoProducer.<init>(ConfluoProducer.java:43)
4:     [junit] 	at TestPubSub.testConfluoPubSub(TestPubSub.java:33)
4:     [junit] Caused by: java.net.ConnectException: Connection refused (Connection refused)
4:     [junit] 	at java.net.PlainSocketImpl.socketConnect(Native Method)
4:     [junit] 	at java.net.AbstractPlainSocketImpl.doConnect(AbstractPlainSocketImpl.java:350)
4:     [junit] 	at java.net.AbstractPlainSocketImpl.connectToAddress(AbstractPlainSocketImpl.java:206)
4:     [junit] 	at java.net.AbstractPlainSocketImpl.connect(AbstractPlainSocketImpl.java:188)
4:     [junit] 	at java.net.SocksSocketImpl.connect(SocksSocketImpl.java:392)
4:     [junit] 	at java.net.Socket.connect(Socket.java:589)
4:     [junit] 	at org.apache.thrift.transport.TSocket.open(TSocket.java:221)
4:     [junit] 
4: 
4: BUILD FAILED
4: /home/jenkins/workspace/confluo-prb/build/javaclient/build.xml:243: Test TestPubSub failed
4: 
4: Total time: 2 seconds
4/6 Test #4: JavaClientTest ...................***Failed    2.32 sec
test 5
    Start 5: TimeseriesTest

5: Test command: /home/jenkins/workspace/confluo-prb/build/bin/tstest
5: Test timeout computed to be: 1500
5: [==========] Running 4 tests from 1 test case.
5: [----------] Global test environment set-up.
5: [----------] 4 tests from TimeseriesDBTest
5: [ RUN      ] TimeseriesDBTest.AppendTest
5: 2021-03-15 20:50:50 WARN: Could not find configuration file in any of /etc/conf/confluo.conf, ./conf/confluo.conf
5: 2021-03-15 20:50:50 INFO: monitor task started...
5: [       OK ] TimeseriesDBTest.AppendTest (99 ms)
5: [ RUN      ] TimeseriesDBTest.GetRangeTest
5: 2021-03-15 20:50:50 INFO: monitor task started...
5: [       OK ] TimeseriesDBTest.GetRangeTest (63 ms)
5: [ RUN      ] TimeseriesDBTest.GetNearestTest
5: 2021-03-15 20:50:50 INFO: monitor task started...
5: [       OK ] TimeseriesDBTest.GetNearestTest (61 ms)
5: [ RUN      ] TimeseriesDBTest.ComputeDiffTest
5: 2021-03-15 20:50:50 INFO: monitor task started...
5: [       OK ] TimeseriesDBTest.ComputeDiffTest (62 ms)
5: [----------] 4 tests from TimeseriesDBTest (285 ms total)
5: 
5: [----------] Global test environment tear-down
5: [==========] 4 tests from 1 test case ran. (285 ms total)
5: [  PASSED  ] 4 tests.
5/6 Test #5: TimeseriesTest ...................   Passed    0.44 sec
test 6
    Start 6: StreamTest

6: Test command: /home/jenkins/workspace/confluo-prb/build/bin/stest
6: Test timeout computed to be: 1500
6: [==========] Running 4 tests from 1 test case.
6: [----------] Global test environment set-up.
6: [----------] 4 tests from StreamTest
6: [ RUN      ] StreamTest.WriteTest
6: 2021-03-15 20:50:50 WARN: Could not find configuration file in any of /etc/conf/confluo.conf, ./conf/confluo.conf
6: 2021-03-15 20:50:50 INFO: Connecting to 127.0.0.1:9090
6: Thrift: Mon Mar 15 20:50:50 2021 TSocket::open() connect() <Host: 127.0.0.1 Port: 9090>Connection refused
6: 2021-03-15 20:50:50 INFO: monitor task started...
6: 2021-03-15 20:50:50 INFO: Connecting to 127.0.0.1:9090
6: 2021-03-15 20:50:50 INFO: Incoming connection
6: 			SocketInfo: <Host: 127.0.0.1 Port: 56992>
6: 			PeerHost: localhost
6: 			PeerAddress: 127.0.0.1
6: 			PeerPort: 56992
6: 2021-03-15 20:50:50 INFO: Registered handler thread 140181522913024 as 1
6: 2021-03-15 20:50:50 INFO: Disconnecting from localhost:9090
6: 2021-03-15 20:50:50 INFO: Deregistered handler thread 140181522913024 as 1
6: 2021-03-15 20:50:50 INFO: Connecting to 127.0.0.1:9090
6: 2021-03-15 20:50:50 INFO: Incoming connection
6: 			SocketInfo: <Host: 127.0.0.1 Port: 56994>
6: 			PeerHost: localhost
6: 			PeerAddress: 127.0.0.1
6: 			PeerPort: 56994
6: 2021-03-15 20:50:50 INFO: Registered handler thread 140181326661376 as 1
6: 2021-03-15 20:50:51 INFO: Disconnecting from localhost:9090
6: 2021-03-15 20:50:51 INFO: Deregistered handler thread 140181326661376 as 1
6: [       OK ] StreamTest.WriteTest (600 ms)
6: [ RUN      ] StreamTest.BufferTest
6: 2021-03-15 20:50:51 INFO: Connecting to 127.0.0.1:9090
6: Thrift: Mon Mar 15 20:50:51 2021 TSocket::open() connect() <Host: 127.0.0.1 Port: 9090>Connection refused
6: 2021-03-15 20:50:51 INFO: monitor task started...
6: 2021-03-15 20:50:51 INFO: Connecting to 127.0.0.1:9090
6: 2021-03-15 20:50:51 INFO: Incoming connection
6: 			SocketInfo: <Host: 127.0.0.1 Port: 56998>
6: 			PeerHost: localhost
6: 			PeerAddress: 127.0.0.1
6: 			PeerPort: 56998
6: 2021-03-15 20:50:51 INFO: Registered handler thread 140181326661376 as 1
6: 2021-03-15 20:50:51 INFO: Disconnecting from localhost:9090
6: 2021-03-15 20:50:51 INFO: Deregistered handler thread 140181326661376 as 1
6: 2021-03-15 20:50:51 INFO: Connecting to 127.0.0.1:9090
6: 2021-03-15 20:50:51 INFO: Incoming connection
6: 			SocketInfo: <Host: 127.0.0.1 Port: 57000>
6: 			PeerHost: localhost
6: 			PeerAddress: 127.0.0.1
6: 			PeerPort: 57000
6: 2021-03-15 20:50:51 INFO: Registered handler thread 140181522913024 as 1
6: 2021-03-15 20:50:51 INFO: Disconnecting from localhost:9090
6: 2021-03-15 20:50:51 INFO: Deregistered handler thread 140181522913024 as 1
6: [       OK ] StreamTest.BufferTest (185 ms)
6: [ RUN      ] StreamTest.ReadTest
6: 2021-03-15 20:50:51 INFO: Connecting to 127.0.0.1:9090
6: Thrift: Mon Mar 15 20:50:51 2021 TSocket::open() connect() <Host: 127.0.0.1 Port: 9090>Connection refused
6: 2021-03-15 20:50:51 INFO: monitor task started...
6: 2021-03-15 20:50:51 INFO: Connecting to 127.0.0.1:9090
6: 2021-03-15 20:50:51 INFO: Incoming connection
6: 			SocketInfo: <Host: 127.0.0.1 Port: 57004>
6: 			PeerHost: localhost
6: 			PeerAddress: 127.0.0.1
6: 			PeerPort: 57004
6: 2021-03-15 20:50:51 INFO: Registered handler thread 140181522913024 as 1
6: 2021-03-15 20:50:51 INFO: Disconnecting from localhost:9090
6: 2021-03-15 20:50:51 INFO: Deregistered handler thread 140181522913024 as 1
6: 2021-03-15 20:50:51 INFO: Connecting to 127.0.0.1:9090
6: 2021-03-15 20:50:51 INFO: Incoming connection
6: 			SocketInfo: <Host: 127.0.0.1 Port: 57006>
6: 			PeerHost: localhost
6: 			PeerAddress: 127.0.0.1
6: 			PeerPort: 57006
6: 2021-03-15 20:50:51 INFO: Registered handler thread 140181326661376 as 1
6: 2021-03-15 20:50:51 INFO: Disconnecting from localhost:9090
6: 2021-03-15 20:50:51 INFO: Deregistered handler thread 140181326661376 as 1
6: [       OK ] StreamTest.ReadTest (594 ms)
6: [ RUN      ] StreamTest.ReadWriteTest
6: 2021-03-15 20:50:52 INFO: Connecting to 127.0.0.1:9090
6: Thrift: Mon Mar 15 20:50:52 2021 TSocket::open() connect() <Host: 127.0.0.1 Port: 9090>Connection refused
6: 2021-03-15 20:50:52 INFO: monitor task started...
6: 2021-03-15 20:50:52 INFO: Connecting to 127.0.0.1:9090
6: 2021-03-15 20:50:52 INFO: Incoming connection
6: 			SocketInfo: <Host: 127.0.0.1 Port: 57010>
6: 			PeerHost: localhost
6: 			PeerAddress: 127.0.0.1
6: 			PeerPort: 57010
6: 2021-03-15 20:50:52 INFO: Registered handler thread 140181326661376 as 1
6: 2021-03-15 20:50:52 INFO: Disconnecting from localhost:9090
6: 2021-03-15 20:50:52 INFO: Deregistered handler thread 140181326661376 as 1
6: 2021-03-15 20:50:52 INFO: Connecting to 127.0.0.1:9090
6: 2021-03-15 20:50:52 INFO: Incoming connection
6: 			SocketInfo: <Host: 127.0.0.1 Port: 57012>
6: 			PeerHost: localhost
6: 			PeerAddress: 127.0.0.1
6: 			PeerPort: 57012
6: 2021-03-15 20:50:52 INFO: Registered handler thread 140181522913024 as 1
6: 2021-03-15 20:50:52 INFO: Connecting to 127.0.0.1:9090
6: 2021-03-15 20:50:52 INFO: Incoming connection
6: 			SocketInfo: <Host: 127.0.0.1 Port: 57014>
6: 			PeerHost: localhost
6: 			PeerAddress: 127.0.0.1
6: 			PeerPort: 57014
6: 2021-03-15 20:50:52 INFO: Registered handler thread 140180831303424 as 2
6: 2021-03-15 20:50:52 INFO: Disconnecting from localhost:9090
6: 2021-03-15 20:50:52 INFO: Deregistered handler thread 140180831303424 as 2
6: 2021-03-15 20:50:52 INFO: Disconnecting from localhost:9090
6: 2021-03-15 20:50:52 INFO: Deregistered handler thread 140181522913024 as 1
6: [       OK ] StreamTest.ReadWriteTest (342 ms)
6: [----------] 4 tests from StreamTest (1721 ms total)
6: 
6: [----------] Global test environment tear-down
6: [==========] 4 tests from 1 test case ran. (1721 ms total)
6: [  PASSED  ] 4 tests.
6/6 Test #6: StreamTest .......................   Passed    1.97 sec

67% tests passed, 2 tests failed out of 6

Total Test time (real) =  43.47 sec

The following tests FAILED:
	  3 - PythonClientTest (Failed)
	  4 - JavaClientTest (Failed)
Errors while running CTest
Makefile:149: recipe for target 'test' failed
make: *** [test] Error 8
Build step 'Execute shell' marked build as failure
Setting status of ae737362d59902f9d8d462921941a7ca3484163b to FAILURE with url https://amplab.cs.berkeley.edu/jenkins/job/confluo-prb/387/ and message: 'Build finished. '

Refer to this link for build results (access rights to CI server needed): 
https://amplab.cs.berkeley.edu/jenkins//job/confluo-prb/387/

Finished: FAILURE