FailedConsole Output

Started by upstream project "deca-prb" build number 30
originally caused by:
 GitHub pull request #32 of commit 10f4b63100b565c266f0beecaca75d521bb12907 automatically merged.
[EnvInject] - Loading node environment variables.
Building remotely on amp-jenkins-worker-01 (spark-packaging spark-compile spark-experimental-docker spark-release spark-docs centos) in workspace /home/jenkins/workspace/deca-prb/HADOOP_VERSION/2.3.0/SCALAVER/2.11/SPARK_VERSION/2.0.0/label/centos
 > git rev-parse --is-inside-work-tree # timeout=10
Fetching changes from the remote Git repository
 > git config remote.origin.url https://github.com/bigdatagenomics/deca.git # timeout=10
Fetching upstream changes from https://github.com/bigdatagenomics/deca.git
 > git --version # timeout=10
 > git fetch --tags --progress https://github.com/bigdatagenomics/deca.git +refs/pull/*:refs/remotes/origin/pr/*
Checking out Revision b1c16ba509edc3174a2866e46c7383c7c81852f1 (origin/pr/32/merge)
 > git config core.sparsecheckout # timeout=10
 > git checkout -f b1c16ba509edc3174a2866e46c7383c7c81852f1
 > git rev-list d1a936433be24c570bf6303d31c5099f9595b760 # timeout=10
[centos] $ /bin/bash /tmp/hudson1691454167692012581.sh
+ set -e
+ export JAVA_HOME=/usr/java/jdk1.8.0_60
+ JAVA_HOME=/usr/java/jdk1.8.0_60
+ export CONDA_BIN=/home/anaconda/bin/
+ CONDA_BIN=/home/anaconda/bin/
+ export MVN_BIN=/home/jenkins/tools/hudson.tasks.Maven_MavenInstallation/Maven_3.1.1/bin/
+ MVN_BIN=/home/jenkins/tools/hudson.tasks.Maven_MavenInstallation/Maven_3.1.1/bin/
+ export PATH=/usr/java/jdk1.8.0_60/bin/:/home/jenkins/tools/hudson.tasks.Maven_MavenInstallation/Maven_3.1.1/bin/:/home/anaconda/bin/:/usr/sbin:/home/jenkins/.cargo/bin:/home/anaconda/bin:/home/jenkins/tools/hudson.tasks.Maven_MavenInstallation/Maven_3.1.1/bin/:/home/android-sdk/:/usr/local/bin:/bin:/usr/bin
+ PATH=/usr/java/jdk1.8.0_60/bin/:/home/jenkins/tools/hudson.tasks.Maven_MavenInstallation/Maven_3.1.1/bin/:/home/anaconda/bin/:/usr/sbin:/home/jenkins/.cargo/bin:/home/anaconda/bin:/home/jenkins/tools/hudson.tasks.Maven_MavenInstallation/Maven_3.1.1/bin/:/home/android-sdk/:/usr/local/bin:/bin:/usr/bin
+ set +x
+ /home/jenkins/workspace/deca-prb/HADOOP_VERSION/2.3.0/SCALAVER/2.11/SPARK_VERSION/2.0.0/label/centos/scripts/jenkins-test

# make a tempdir for writing maven cruft to
DECA_MVN_TMP_DIR=$(mktemp -d -t decaTestMvnXXXXXXX)
++ mktemp -d -t decaTestMvnXXXXXXX
+ DECA_MVN_TMP_DIR=/tmp/decaTestMvnmZLoXPJ

# add this tempdir to the poms...
find . -name pom.xml \
    -exec sed -i.bak \
    -e "s:sun.io.serialization.extendedDebugInfo=true:sun.io.serialization.extendedDebugInfo=true -Djava.io.tmpdir=${DECA_MVN_TMP_DIR}:g" \
    {} \;
+ find . -name pom.xml -exec sed -i.bak -e 's:sun.io.serialization.extendedDebugInfo=true:sun.io.serialization.extendedDebugInfo=true -Djava.io.tmpdir=/tmp/decaTestMvnmZLoXPJ:g' '{}' ';'
find . -name "*.bak" -exec rm -f {} \;
+ find . -name '*.bak' -exec rm -f '{}' ';'

# variable declarations
export PATH=${JAVA_HOME}/bin/:${PATH}
+ export PATH=/usr/java/jdk1.8.0_60/bin/:/usr/java/jdk1.8.0_60/bin/:/home/jenkins/tools/hudson.tasks.Maven_MavenInstallation/Maven_3.1.1/bin/:/home/anaconda/bin/:/usr/sbin:/home/jenkins/.cargo/bin:/home/anaconda/bin:/home/jenkins/tools/hudson.tasks.Maven_MavenInstallation/Maven_3.1.1/bin/:/home/android-sdk/:/usr/local/bin:/bin:/usr/bin
+ PATH=/usr/java/jdk1.8.0_60/bin/:/usr/java/jdk1.8.0_60/bin/:/home/jenkins/tools/hudson.tasks.Maven_MavenInstallation/Maven_3.1.1/bin/:/home/anaconda/bin/:/usr/sbin:/home/jenkins/.cargo/bin:/home/anaconda/bin:/home/jenkins/tools/hudson.tasks.Maven_MavenInstallation/Maven_3.1.1/bin/:/home/android-sdk/:/usr/local/bin:/bin:/usr/bin
export MAVEN_OPTS="-Xmx1536m -XX:MaxPermSize=1g -Dfile.encoding=utf-8"
+ export 'MAVEN_OPTS=-Xmx1536m -XX:MaxPermSize=1g -Dfile.encoding=utf-8'
+ MAVEN_OPTS='-Xmx1536m -XX:MaxPermSize=1g -Dfile.encoding=utf-8'
DIR=$( cd $( dirname ${BASH_SOURCE[0]} ) && pwd )
+++ dirname /home/jenkins/workspace/deca-prb/HADOOP_VERSION/2.3.0/SCALAVER/2.11/SPARK_VERSION/2.0.0/label/centos/scripts/jenkins-test
++ cd /home/jenkins/workspace/deca-prb/HADOOP_VERSION/2.3.0/SCALAVER/2.11/SPARK_VERSION/2.0.0/label/centos/scripts
++ pwd
+ DIR=/home/jenkins/workspace/deca-prb/HADOOP_VERSION/2.3.0/SCALAVER/2.11/SPARK_VERSION/2.0.0/label/centos/scripts
PROJECT_ROOT=${DIR}/..
+ PROJECT_ROOT=/home/jenkins/workspace/deca-prb/HADOOP_VERSION/2.3.0/SCALAVER/2.11/SPARK_VERSION/2.0.0/label/centos/scripts/..
VERSION=$(grep "<version>" ${PROJECT_ROOT}/pom.xml  | head -2 | tail -1 | sed 's/ *<version>//g' | sed 's/<\/version>//g')
++ grep '<version>' /home/jenkins/workspace/deca-prb/HADOOP_VERSION/2.3.0/SCALAVER/2.11/SPARK_VERSION/2.0.0/label/centos/scripts/../pom.xml
++ head -2
++ tail -1
++ sed 's/ *<version>//g'
++ sed 's/<\/version>//g'
+ VERSION=0.2.1-SNAPSHOT

# is the hadoop version set?
if ! [[ ${HADOOP_VERSION} ]];
then
    echo "HADOOP_VERSION environment variable is not set."
    echo "Please set this variable before running."
    
    exit 1
fi
+ [[ -n 2.3.0 ]]

# is the spark version set?
if ! [[ ${SPARK_VERSION} ]];
then
    echo "SPARK_VERSION environment variable is not set."
    echo "Please set this variable before running."
    
    exit 1
fi
+ [[ -n 2.0.0 ]]

# print versions
echo "Testing DECA version ${VERSION} on Spark ${SPARK_VERSION} and Hadoop ${HADOOP_VERSION}"
+ echo 'Testing DECA version 0.2.1-SNAPSHOT on Spark 2.0.0 and Hadoop 2.3.0'
Testing DECA version 0.2.1-SNAPSHOT on Spark 2.0.0 and Hadoop 2.3.0

# first, build the sources, run the unit tests, and generate a coverage report
mvn clean \
    -Dhadoop.version=${HADOOP_VERSION} \
    -Dspark.version=${SPARK_VERSION} 
+ mvn clean -Dhadoop.version=2.3.0 -Dspark.version=2.0.0
Java HotSpot(TM) 64-Bit Server VM warning: ignoring option MaxPermSize=1g; support was removed in 8.0
[INFO] Scanning for projects...
[WARNING] 
[WARNING] Some problems were encountered while building the effective model for org.bdgenomics.deca:deca-core_2.11:jar:0.2.1-SNAPSHOT
[WARNING] 'build.plugins.plugin.version' for org.apache.maven.plugins:maven-jar-plugin is missing. @ line 66, column 15
[WARNING] 'dependencies.dependency.exclusions.exclusion.artifactId' for org.apache.hadoop:hadoop-client:jar with value '*' does not match a valid id pattern. @ line 134, column 23
[WARNING] 'dependencyManagement.dependencies.dependency.exclusions.exclusion.artifactId' for org.apache.hadoop:hadoop-client:jar with value '*' does not match a valid id pattern. @ org.bdgenomics.deca:deca-parent_2.11:0.2.1-SNAPSHOT, /home/jenkins/workspace/deca-prb/HADOOP_VERSION/2.3.0/SCALAVER/2.11/SPARK_VERSION/2.0.0/label/centos/pom.xml, line 357, column 25
[WARNING] 'dependencyManagement.dependencies.dependency.exclusions.exclusion.artifactId' for org.apache.hadoop:hadoop-client:jar with value '*' does not match a valid id pattern. @ org.bdgenomics.deca:deca-parent_2.11:0.2.1-SNAPSHOT, /home/jenkins/workspace/deca-prb/HADOOP_VERSION/2.3.0/SCALAVER/2.11/SPARK_VERSION/2.0.0/label/centos/pom.xml, line 361, column 25
[WARNING] 'dependencyManagement.dependencies.dependency.exclusions.exclusion.artifactId' for org.apache.hadoop:hadoop-client:jar with value '*' does not match a valid id pattern. @ org.bdgenomics.deca:deca-parent_2.11:0.2.1-SNAPSHOT, /home/jenkins/workspace/deca-prb/HADOOP_VERSION/2.3.0/SCALAVER/2.11/SPARK_VERSION/2.0.0/label/centos/pom.xml, line 365, column 25
[WARNING] 
[WARNING] Some problems were encountered while building the effective model for org.bdgenomics.deca:deca-cli_2.11:jar:0.2.1-SNAPSHOT
[WARNING] 'dependencies.dependency.exclusions.exclusion.artifactId' for org.apache.hadoop:hadoop-client:jar with value '*' does not match a valid id pattern. @ line 180, column 23
[WARNING] 'dependencyManagement.dependencies.dependency.exclusions.exclusion.artifactId' for org.apache.hadoop:hadoop-client:jar with value '*' does not match a valid id pattern. @ org.bdgenomics.deca:deca-parent_2.11:0.2.1-SNAPSHOT, /home/jenkins/workspace/deca-prb/HADOOP_VERSION/2.3.0/SCALAVER/2.11/SPARK_VERSION/2.0.0/label/centos/pom.xml, line 357, column 25
[WARNING] 'dependencyManagement.dependencies.dependency.exclusions.exclusion.artifactId' for org.apache.hadoop:hadoop-client:jar with value '*' does not match a valid id pattern. @ org.bdgenomics.deca:deca-parent_2.11:0.2.1-SNAPSHOT, /home/jenkins/workspace/deca-prb/HADOOP_VERSION/2.3.0/SCALAVER/2.11/SPARK_VERSION/2.0.0/label/centos/pom.xml, line 361, column 25
[WARNING] 'dependencyManagement.dependencies.dependency.exclusions.exclusion.artifactId' for org.apache.hadoop:hadoop-client:jar with value '*' does not match a valid id pattern. @ org.bdgenomics.deca:deca-parent_2.11:0.2.1-SNAPSHOT, /home/jenkins/workspace/deca-prb/HADOOP_VERSION/2.3.0/SCALAVER/2.11/SPARK_VERSION/2.0.0/label/centos/pom.xml, line 365, column 25
[WARNING] 
[WARNING] Some problems were encountered while building the effective model for org.bdgenomics.deca:deca-parent_2.11:pom:0.2.1-SNAPSHOT
[WARNING] 'dependencyManagement.dependencies.dependency.exclusions.exclusion.artifactId' for org.apache.hadoop:hadoop-client:jar with value '*' does not match a valid id pattern. @ line 357, column 25
[WARNING] 'dependencyManagement.dependencies.dependency.exclusions.exclusion.artifactId' for org.apache.hadoop:hadoop-client:jar with value '*' does not match a valid id pattern. @ line 361, column 25
[WARNING] 'dependencyManagement.dependencies.dependency.exclusions.exclusion.artifactId' for org.apache.hadoop:hadoop-client:jar with value '*' does not match a valid id pattern. @ line 365, column 25
[WARNING] 
[WARNING] It is highly recommended to fix these problems because they threaten the stability of your build.
[WARNING] 
[WARNING] For this reason, future Maven versions might no longer support building such malformed projects.
[WARNING] 
[INFO] ------------------------------------------------------------------------
[INFO] Reactor Build Order:
[INFO] 
[INFO] deca: Distributed Exome CNV Analyzer
[INFO] deca-core: Core variant calling algorithms
[INFO] deca-cli: Command line interface for a distributed variant caller
[INFO]                                                                         
[INFO] ------------------------------------------------------------------------
[INFO] Building deca: Distributed Exome CNV Analyzer 0.2.1-SNAPSHOT
[INFO] ------------------------------------------------------------------------
[INFO] 
[INFO] --- maven-clean-plugin:2.5:clean (default-clean) @ deca-parent_2.11 ---
[INFO]                                                                         
[INFO] ------------------------------------------------------------------------
[INFO] Building deca-core: Core variant calling algorithms 0.2.1-SNAPSHOT
[INFO] ------------------------------------------------------------------------
[INFO] 
[INFO] --- maven-clean-plugin:2.5:clean (default-clean) @ deca-core_2.11 ---
[INFO]                                                                         
[INFO] ------------------------------------------------------------------------
[INFO] Building deca-cli: Command line interface for a distributed variant caller 0.2.1-SNAPSHOT
[INFO] ------------------------------------------------------------------------
[INFO] 
[INFO] --- maven-clean-plugin:2.5:clean (default-clean) @ deca-cli_2.11 ---
[INFO] ------------------------------------------------------------------------
[INFO] Reactor Summary:
[INFO] 
[INFO] deca: Distributed Exome CNV Analyzer .............. SUCCESS [0.116s]
[INFO] deca-core: Core variant calling algorithms ........ SUCCESS [0.017s]
[INFO] deca-cli: Command line interface for a distributed variant caller  SUCCESS [0.021s]
[INFO] ------------------------------------------------------------------------
[INFO] BUILD SUCCESS
[INFO] ------------------------------------------------------------------------
[INFO] Total time: 0.281s
[INFO] Finished at: Thu May 09 09:58:30 PDT 2019
[INFO] Final Memory: 19M/1472M
[INFO] ------------------------------------------------------------------------
    
# make sure we can build the native code
mvn -U \
    -P native-lgpl \
    package \
    -DskipTests \
    -Dhadoop.version=${HADOOP_VERSION} \
    -Dspark.version=${SPARK_VERSION} \
    -DargLine=${DECA_MVN_TMP_DIR}
+ mvn -U -P native-lgpl package -DskipTests -Dhadoop.version=2.3.0 -Dspark.version=2.0.0 -DargLine=/tmp/decaTestMvnmZLoXPJ
Java HotSpot(TM) 64-Bit Server VM warning: ignoring option MaxPermSize=1g; support was removed in 8.0
[INFO] Scanning for projects...
[WARNING] 
[WARNING] Some problems were encountered while building the effective model for org.bdgenomics.deca:deca-core_2.11:jar:0.2.1-SNAPSHOT
[WARNING] 'build.plugins.plugin.version' for org.apache.maven.plugins:maven-jar-plugin is missing. @ line 66, column 15
[WARNING] 'dependencies.dependency.exclusions.exclusion.artifactId' for org.apache.hadoop:hadoop-client:jar with value '*' does not match a valid id pattern. @ line 134, column 23
[WARNING] 'dependencyManagement.dependencies.dependency.exclusions.exclusion.artifactId' for org.apache.hadoop:hadoop-client:jar with value '*' does not match a valid id pattern. @ org.bdgenomics.deca:deca-parent_2.11:0.2.1-SNAPSHOT, /home/jenkins/workspace/deca-prb/HADOOP_VERSION/2.3.0/SCALAVER/2.11/SPARK_VERSION/2.0.0/label/centos/pom.xml, line 357, column 25
[WARNING] 'dependencyManagement.dependencies.dependency.exclusions.exclusion.artifactId' for org.apache.hadoop:hadoop-client:jar with value '*' does not match a valid id pattern. @ org.bdgenomics.deca:deca-parent_2.11:0.2.1-SNAPSHOT, /home/jenkins/workspace/deca-prb/HADOOP_VERSION/2.3.0/SCALAVER/2.11/SPARK_VERSION/2.0.0/label/centos/pom.xml, line 361, column 25
[WARNING] 'dependencyManagement.dependencies.dependency.exclusions.exclusion.artifactId' for org.apache.hadoop:hadoop-client:jar with value '*' does not match a valid id pattern. @ org.bdgenomics.deca:deca-parent_2.11:0.2.1-SNAPSHOT, /home/jenkins/workspace/deca-prb/HADOOP_VERSION/2.3.0/SCALAVER/2.11/SPARK_VERSION/2.0.0/label/centos/pom.xml, line 365, column 25
[WARNING] 
[WARNING] Some problems were encountered while building the effective model for org.bdgenomics.deca:deca-cli_2.11:jar:0.2.1-SNAPSHOT
[WARNING] 'dependencies.dependency.exclusions.exclusion.artifactId' for org.apache.hadoop:hadoop-client:jar with value '*' does not match a valid id pattern. @ line 180, column 23
[WARNING] 'dependencyManagement.dependencies.dependency.exclusions.exclusion.artifactId' for org.apache.hadoop:hadoop-client:jar with value '*' does not match a valid id pattern. @ org.bdgenomics.deca:deca-parent_2.11:0.2.1-SNAPSHOT, /home/jenkins/workspace/deca-prb/HADOOP_VERSION/2.3.0/SCALAVER/2.11/SPARK_VERSION/2.0.0/label/centos/pom.xml, line 357, column 25
[WARNING] 'dependencyManagement.dependencies.dependency.exclusions.exclusion.artifactId' for org.apache.hadoop:hadoop-client:jar with value '*' does not match a valid id pattern. @ org.bdgenomics.deca:deca-parent_2.11:0.2.1-SNAPSHOT, /home/jenkins/workspace/deca-prb/HADOOP_VERSION/2.3.0/SCALAVER/2.11/SPARK_VERSION/2.0.0/label/centos/pom.xml, line 361, column 25
[WARNING] 'dependencyManagement.dependencies.dependency.exclusions.exclusion.artifactId' for org.apache.hadoop:hadoop-client:jar with value '*' does not match a valid id pattern. @ org.bdgenomics.deca:deca-parent_2.11:0.2.1-SNAPSHOT, /home/jenkins/workspace/deca-prb/HADOOP_VERSION/2.3.0/SCALAVER/2.11/SPARK_VERSION/2.0.0/label/centos/pom.xml, line 365, column 25
[WARNING] 
[WARNING] Some problems were encountered while building the effective model for org.bdgenomics.deca:deca-parent_2.11:pom:0.2.1-SNAPSHOT
[WARNING] 'dependencyManagement.dependencies.dependency.exclusions.exclusion.artifactId' for org.apache.hadoop:hadoop-client:jar with value '*' does not match a valid id pattern. @ line 357, column 25
[WARNING] 'dependencyManagement.dependencies.dependency.exclusions.exclusion.artifactId' for org.apache.hadoop:hadoop-client:jar with value '*' does not match a valid id pattern. @ line 361, column 25
[WARNING] 'dependencyManagement.dependencies.dependency.exclusions.exclusion.artifactId' for org.apache.hadoop:hadoop-client:jar with value '*' does not match a valid id pattern. @ line 365, column 25
[WARNING] 
[WARNING] It is highly recommended to fix these problems because they threaten the stability of your build.
[WARNING] 
[WARNING] For this reason, future Maven versions might no longer support building such malformed projects.
[WARNING] 
[INFO] ------------------------------------------------------------------------
[INFO] Reactor Build Order:
[INFO] 
[INFO] deca: Distributed Exome CNV Analyzer
[INFO] deca-core: Core variant calling algorithms
[INFO] deca-cli: Command line interface for a distributed variant caller
[INFO]                                                                         
[INFO] ------------------------------------------------------------------------
[INFO] Building deca: Distributed Exome CNV Analyzer 0.2.1-SNAPSHOT
[INFO] ------------------------------------------------------------------------
[INFO] 
[INFO] --- maven-enforcer-plugin:1.0:enforce (enforce-maven) @ deca-parent_2.11 ---
[INFO] 
[INFO] --- build-helper-maven-plugin:1.10:add-source (add-source) @ deca-parent_2.11 ---
[INFO] Source directory: /home/jenkins/workspace/deca-prb/HADOOP_VERSION/2.3.0/SCALAVER/2.11/SPARK_VERSION/2.0.0/label/centos/src/main/scala added.
[INFO] 
[INFO] --- scalariform-maven-plugin:0.1.4:format (default-cli) @ deca-parent_2.11 ---
[INFO] Modified 0 of 32 .scala files
[INFO] 
[INFO] --- scala-maven-plugin:3.2.2:compile (scala-compile-first) @ deca-parent_2.11 ---
[INFO] No sources to compile
[INFO] 
[INFO] --- build-helper-maven-plugin:1.10:add-test-source (add-test-source) @ deca-parent_2.11 ---
[INFO] Test Source directory: /home/jenkins/workspace/deca-prb/HADOOP_VERSION/2.3.0/SCALAVER/2.11/SPARK_VERSION/2.0.0/label/centos/src/test/scala added.
[INFO] 
[INFO] --- scala-maven-plugin:3.2.2:testCompile (scala-test-compile-first) @ deca-parent_2.11 ---
[INFO] No sources to compile
[INFO]                                                                         
[INFO] ------------------------------------------------------------------------
[INFO] Building deca-core: Core variant calling algorithms 0.2.1-SNAPSHOT
[INFO] ------------------------------------------------------------------------
Downloading: http://oss.sonatype.org/content/repositories/snapshots/org/xerial/snappy/snappy-java/1.1.2.4/snappy-java-1.1.2.4.jar

Downloading: http://people.apache.org/repo/m2-snapshot-repository/org/xerial/snappy/snappy-java/1.1.2.4/snappy-java-1.1.2.4.jar

Downloading: http://repo.maven.apache.org/maven2/org/xerial/snappy/snappy-java/1.1.2.4/snappy-java-1.1.2.4.jar
4/1032 KB   
8/1032 KB   
12/1032 KB   
14/1032 KB   
18/1032 KB   
22/1032 KB   
26/1032 KB   
30/1032 KB   
34/1032 KB   
37/1032 KB   
40/1032 KB   
44/1032 KB   
48/1032 KB   
52/1032 KB   
56/1032 KB   
60/1032 KB   
64/1032 KB   
68/1032 KB   
72/1032 KB   
76/1032 KB   
77/1032 KB   
78/1032 KB   
79/1032 KB   
83/1032 KB   
87/1032 KB   
91/1032 KB   
95/1032 KB   
99/1032 KB   
103/1032 KB   
107/1032 KB   
111/1032 KB   
115/1032 KB   
119/1032 KB   
123/1032 KB   
127/1032 KB   
131/1032 KB   
133/1032 KB   
137/1032 KB   
141/1032 KB   
145/1032 KB   
149/1032 KB   
153/1032 KB   
157/1032 KB   
161/1032 KB   
165/1032 KB   
169/1032 KB   
170/1032 KB   
174/1032 KB   
178/1032 KB   
182/1032 KB   
186/1032 KB   
190/1032 KB   
194/1032 KB   
198/1032 KB   
202/1032 KB   
206/1032 KB   
210/1032 KB   
214/1032 KB   
218/1032 KB   
222/1032 KB   
226/1032 KB   
230/1032 KB   
234/1032 KB   
238/1032 KB   
242/1032 KB   
243/1032 KB   
247/1032 KB   
251/1032 KB   
255/1032 KB   
259/1032 KB   
263/1032 KB   
267/1032 KB   
271/1032 KB   
275/1032 KB   
279/1032 KB   
283/1032 KB   
287/1032 KB   
291/1032 KB   
294/1032 KB   
298/1032 KB   
302/1032 KB   
306/1032 KB   
310/1032 KB   
314/1032 KB   
318/1032 KB   
322/1032 KB   
326/1032 KB   
330/1032 KB   
334/1032 KB   
338/1032 KB   
342/1032 KB   
346/1032 KB   
350/1032 KB   
354/1032 KB   
358/1032 KB   
362/1032 KB   
366/1032 KB   
370/1032 KB   
374/1032 KB   
378/1032 KB   
382/1032 KB   
386/1032 KB   
387/1032 KB   
389/1032 KB   
392/1032 KB   
393/1032 KB   
397/1032 KB   
399/1032 KB   
402/1032 KB   
406/1032 KB   
410/1032 KB   
414/1032 KB   
418/1032 KB   
422/1032 KB   
426/1032 KB   
430/1032 KB   
434/1032 KB   
438/1032 KB   
442/1032 KB   
446/1032 KB   
450/1032 KB   
454/1032 KB   
458/1032 KB   
462/1032 KB   
466/1032 KB   
470/1032 KB   
474/1032 KB   
478/1032 KB   
482/1032 KB   
486/1032 KB   
490/1032 KB   
493/1032 KB   
496/1032 KB   
499/1032 KB   
503/1032 KB   
507/1032 KB   
510/1032 KB   
513/1032 KB   
517/1032 KB   
521/1032 KB   
525/1032 KB   
529/1032 KB   
531/1032 KB   
535/1032 KB   
539/1032 KB   
543/1032 KB   
547/1032 KB   
551/1032 KB   
555/1032 KB   
559/1032 KB   
563/1032 KB   
567/1032 KB   
571/1032 KB   
575/1032 KB   
575/1032 KB   
579/1032 KB   
583/1032 KB   
587/1032 KB   
591/1032 KB   
595/1032 KB   
599/1032 KB   
603/1032 KB   
607/1032 KB   
611/1032 KB   
615/1032 KB   
619/1032 KB   
623/1032 KB   
627/1032 KB   
631/1032 KB   
635/1032 KB   
639/1032 KB   
643/1032 KB   
647/1032 KB   
651/1032 KB   
655/1032 KB   
659/1032 KB   
663/1032 KB   
666/1032 KB   
670/1032 KB   
674/1032 KB   
678/1032 KB   
682/1032 KB   
686/1032 KB   
690/1032 KB   
694/1032 KB   
698/1032 KB   
702/1032 KB   
706/1032 KB   
710/1032 KB   
714/1032 KB   
718/1032 KB   
722/1032 KB   
726/1032 KB   
730/1032 KB   
734/1032 KB   
738/1032 KB   
742/1032 KB   
746/1032 KB   
750/1032 KB   
754/1032 KB   
758/1032 KB   
761/1032 KB   
762/1032 KB   
766/1032 KB   
768/1032 KB   
772/1032 KB   
775/1032 KB   
779/1032 KB   
783/1032 KB   
787/1032 KB   
791/1032 KB   
795/1032 KB   
799/1032 KB   
803/1032 KB   
807/1032 KB   
811/1032 KB   
815/1032 KB   
819/1032 KB   
823/1032 KB   
827/1032 KB   
831/1032 KB   
835/1032 KB   
839/1032 KB   
843/1032 KB   
847/1032 KB   
851/1032 KB   
855/1032 KB   
859/1032 KB   
863/1032 KB   
867/1032 KB   
868/1032 KB   
871/1032 KB   
874/1032 KB   
877/1032 KB   
881/1032 KB   
885/1032 KB   
885/1032 KB   
889/1032 KB   
893/1032 KB   
897/1032 KB   
901/1032 KB   
905/1032 KB   
908/1032 KB   
              
[INFO] ------------------------------------------------------------------------
[INFO] Reactor Summary:
[INFO] 
[INFO] deca: Distributed Exome CNV Analyzer .............. SUCCESS [2.160s]
[INFO] deca-core: Core variant calling algorithms ........ FAILURE [30:05.658s]
[INFO] deca-cli: Command line interface for a distributed variant caller  SKIPPED
[INFO] ------------------------------------------------------------------------
[INFO] BUILD FAILURE
[INFO] ------------------------------------------------------------------------
[INFO] Total time: 30:07.938s
[INFO] Finished at: Thu May 09 10:28:39 PDT 2019
[INFO] Final Memory: 26M/1124M
[INFO] ------------------------------------------------------------------------
[ERROR] Failed to execute goal on project deca-core_2.11: Could not resolve dependencies for project org.bdgenomics.deca:deca-core_2.11:jar:0.2.1-SNAPSHOT: Could not transfer artifact org.xerial.snappy:snappy-java:jar:1.1.2.4 from/to central (http://repo.maven.apache.org/maven2): GET request of: org/xerial/snappy/snappy-java/1.1.2.4/snappy-java-1.1.2.4.jar from central failed: Read timed out -> [Help 1]
[ERROR] 
[ERROR] To see the full stack trace of the errors, re-run Maven with the -e switch.
[ERROR] Re-run Maven using the -X switch to enable full debug logging.
[ERROR] 
[ERROR] For more information about the errors and possible solutions, please read the following articles:
[ERROR] [Help 1] http://cwiki.apache.org/confluence/display/MAVEN/DependencyResolutionException
[ERROR] 
[ERROR] After correcting the problems, you can resume the build with the command
[ERROR]   mvn <goals> -rf :deca-core_2.11
Build step 'Execute shell' marked build as failure
Recording test results
ERROR: Step ?Publish JUnit test result report? failed: No test report files were found. Configuration error?
Publishing Scoverage XML and HTML report...
ERROR: cannot find scoverage report
Finished: FAILURE