FailedConsole Output

Started by upstream project "gnocchi-prb" build number 8
originally caused by:
 GitHub pull request #12 of commit 2451ba26b67b77aa4a4b3a4d02e576ee2483daec automatically merged.
[EnvInject] - Loading node environment variables.
Building remotely on amp-jenkins-worker-08 (centos spark-test) in workspace /home/jenkins/workspace/gnocchi-prb/HADOOP_VERSION/2.3.0/SCALAVER/2.10/SPARK_VERSION/2.0.0/label/centos
Cloning the remote Git repository
Cloning repository https://github.com/bigdatagenomics/gnocchi.git
 > git init /home/jenkins/workspace/gnocchi-prb/HADOOP_VERSION/2.3.0/SCALAVER/2.10/SPARK_VERSION/2.0.0/label/centos # timeout=10
Fetching upstream changes from https://github.com/bigdatagenomics/gnocchi.git
 > git --version # timeout=10
 > git fetch --tags --progress https://github.com/bigdatagenomics/gnocchi.git +refs/heads/*:refs/remotes/origin/*
 > git config remote.origin.url https://github.com/bigdatagenomics/gnocchi.git # timeout=10
 > git config --add remote.origin.fetch +refs/heads/*:refs/remotes/origin/* # timeout=10
 > git config remote.origin.url https://github.com/bigdatagenomics/gnocchi.git # timeout=10
Fetching upstream changes from https://github.com/bigdatagenomics/gnocchi.git
 > git fetch --tags --progress https://github.com/bigdatagenomics/gnocchi.git +refs/pull/*:refs/remotes/origin/pr/*
Checking out Revision 529ea812d26e613b4292e3186abf8a2b8157bf8d (origin/pr/12/merge)
 > git config core.sparsecheckout # timeout=10
 > git checkout -f 529ea812d26e613b4292e3186abf8a2b8157bf8d
 > git rev-list f6408f09807326466868dc15ec0c0ad0561bf7d7 # timeout=10
First time build. Skipping changelog.
[centos] $ /bin/bash /tmp/hudson7580633657603298425.sh
+ set -e
+ export JAVA_HOME=/usr/java/jdk1.8.0_60
+ JAVA_HOME=/usr/java/jdk1.8.0_60
+ export PATH=/usr/java/jdk1.8.0_60/bin/:/home/jenkins/tools/hudson.model.JDK/JDK_7u60/bin:/home/jenkins/.cargo/bin:/home/anaconda/bin:/home/jenkins/tools/hudson.tasks.Maven_MavenInstallation/Maven_3.1.1/bin/:/home/android-sdk/:/usr/local/bin:/bin:/usr/bin
+ PATH=/usr/java/jdk1.8.0_60/bin/:/home/jenkins/tools/hudson.model.JDK/JDK_7u60/bin:/home/jenkins/.cargo/bin:/home/anaconda/bin:/home/jenkins/tools/hudson.tasks.Maven_MavenInstallation/Maven_3.1.1/bin/:/home/android-sdk/:/usr/local/bin:/bin:/usr/bin
+ set +x
+ /home/jenkins/workspace/gnocchi-prb/HADOOP_VERSION/2.3.0/SCALAVER/2.10/SPARK_VERSION/2.0.0/label/centos/scripts/jenkins-test

# make a tempdir for writing maven cruft to
GNOCCHI_MVN_TMP_DIR=$(mktemp -d -t gnocchiTestMvnXXXXXXX)
++ mktemp -d -t gnocchiTestMvnXXXXXXX
+ GNOCCHI_MVN_TMP_DIR=/tmp/gnocchiTestMvnQhfxdXR

# add this tempdir to the poms...
find . -name pom.xml \
    -exec sed -i.bak \
    -e "s:sun.io.serialization.extendedDebugInfo=true:sun.io.serialization.extendedDebugInfo=true -Djava.io.tmpdir=${GNOCCHI_MVN_TMP_DIR}:g" \
    {} \;
+ find . -name pom.xml -exec sed -i.bak -e 's:sun.io.serialization.extendedDebugInfo=true:sun.io.serialization.extendedDebugInfo=true -Djava.io.tmpdir=/tmp/gnocchiTestMvnQhfxdXR:g' '{}' ';'
find . -name "*.bak" -exec rm -f {} \;
+ find . -name '*.bak' -exec rm -f '{}' ';'

# variable declarations
export PATH=${JAVA_HOME}/bin/:${PATH}
+ export PATH=/usr/java/jdk1.8.0_60/bin/:/usr/java/jdk1.8.0_60/bin/:/home/jenkins/tools/hudson.model.JDK/JDK_7u60/bin:/home/jenkins/.cargo/bin:/home/anaconda/bin:/home/jenkins/tools/hudson.tasks.Maven_MavenInstallation/Maven_3.1.1/bin/:/home/android-sdk/:/usr/local/bin:/bin:/usr/bin
+ PATH=/usr/java/jdk1.8.0_60/bin/:/usr/java/jdk1.8.0_60/bin/:/home/jenkins/tools/hudson.model.JDK/JDK_7u60/bin:/home/jenkins/.cargo/bin:/home/anaconda/bin:/home/jenkins/tools/hudson.tasks.Maven_MavenInstallation/Maven_3.1.1/bin/:/home/android-sdk/:/usr/local/bin:/bin:/usr/bin
export MAVEN_OPTS="-Xmx1536m -XX:MaxPermSize=1g -Dfile.encoding=utf-8"
+ export 'MAVEN_OPTS=-Xmx1536m -XX:MaxPermSize=1g -Dfile.encoding=utf-8'
+ MAVEN_OPTS='-Xmx1536m -XX:MaxPermSize=1g -Dfile.encoding=utf-8'
DIR=$( cd $( dirname ${BASH_SOURCE[0]} ) && pwd )
+++ dirname /home/jenkins/workspace/gnocchi-prb/HADOOP_VERSION/2.3.0/SCALAVER/2.10/SPARK_VERSION/2.0.0/label/centos/scripts/jenkins-test
++ cd /home/jenkins/workspace/gnocchi-prb/HADOOP_VERSION/2.3.0/SCALAVER/2.10/SPARK_VERSION/2.0.0/label/centos/scripts
++ pwd
+ DIR=/home/jenkins/workspace/gnocchi-prb/HADOOP_VERSION/2.3.0/SCALAVER/2.10/SPARK_VERSION/2.0.0/label/centos/scripts
PROJECT_ROOT=${DIR}/..
+ PROJECT_ROOT=/home/jenkins/workspace/gnocchi-prb/HADOOP_VERSION/2.3.0/SCALAVER/2.10/SPARK_VERSION/2.0.0/label/centos/scripts/..
VERSION=$(grep "<version>" ${PROJECT_ROOT}/pom.xml  | head -2 | tail -1 | sed 's/ *<version>//g' | sed 's/<\/version>//g')
++ grep '<version>' /home/jenkins/workspace/gnocchi-prb/HADOOP_VERSION/2.3.0/SCALAVER/2.10/SPARK_VERSION/2.0.0/label/centos/scripts/../pom.xml
++ head -2
++ tail -1
++ sed 's/ *<version>//g'
++ sed 's/<\/version>//g'
+ VERSION=0.0.1-SNAPSHOT

# is the hadoop version set?
if ! [[ ${HADOOP_VERSION} ]];
then
    echo "HADOOP_VERSION environment variable is not set."
    echo "Please set this variable before running."
    
    exit 1
fi
+ [[ -n 2.3.0 ]]

# is the spark version set?
if ! [[ ${SPARK_VERSION} ]];
then
    echo "SPARK_VERSION environment variable is not set."
    echo "Please set this variable before running."
    
    exit 1
fi
+ [[ -n 2.0.0 ]]

# this next line is supposed to fail
set +e
+ set +e

echo "Rewriting POM.xml files to Scala 2.10 and Spark 1 should error..."
+ echo 'Rewriting POM.xml files to Scala 2.10 and Spark 1 should error...'
Rewriting POM.xml files to Scala 2.10 and Spark 1 should error...
./scripts/move_to_spark_1.sh
+ ./scripts/move_to_spark_1.sh
POM is already set up for Spark 1 (Spark 1/2 artifacts are missing -spark2 suffix in artifact names).
Cowardly refusing to move to Spark 1 a second time...
if [[ $? == 0 ]];
then
    echo "Running move_to_spark_1.sh when POMs are set up for Spark 1 should fail, but error code was 0 (success)."
    exit 1
fi
+ [[ 1 == 0 ]]

./scripts/move_to_scala_2.10.sh
+ ./scripts/move_to_scala_2.10.sh
Scala version is already set to 2.10 (Scala artifacts have _2.10 version suffix in artifact name).
Cowardly refusing to move to Scala 2.10 a second time...
if [[ $? == 0 ]];
then
    echo "Running move_to_scala_2.10.sh when POMs are set up for Scala 2.10 should fail, but error code was 0 (success)."
    exit 1
fi
+ [[ 1 == 0 ]]

set -e
+ set -e

# are we testing for spark 2.0.0? if so, we need to rewrite our poms first
if [ ${SPARK_VERSION} == 2.0.0 ];
then
    
    echo "Rewriting POM.xml files for Spark 2."
    ./scripts/move_to_spark_2.sh

    # shouldn't be able to move to spark 2 twice
    set +e
    ./scripts/move_to_spark_2.sh
    if [[ $? == 0 ]];
    then
        echo "We have already moved to Spark 2, so running move_to_spark_2.sh a second time should fail, but error code was 0 (success)."
        exit 1
    fi
    set -e
fi
+ '[' 2.0.0 == 2.0.0 ']'
+ echo 'Rewriting POM.xml files for Spark 2.'
Rewriting POM.xml files for Spark 2.
+ ./scripts/move_to_spark_2.sh
+ set +e
+ ./scripts/move_to_spark_2.sh
POM is already set up for Spark 2 (Spark 1/2 artifacts have -spark2 suffix in artifact names).
Cowardly refusing to move to Spark 2 a second time...
+ [[ 1 == 0 ]]
+ set -e

# are we testing for scala 2.11? if so, we need to rewrite our poms to 2.11 first
if [ ${SCALAVER} == 2.11 ];
then
    echo "Rewriting POM.xml files for Scala 2.11."
    ./scripts/move_to_scala_2.11.sh

    # shouldn't be able to move to scala 2.11 twice
    set +e
    ./scripts/move_to_scala_2.11.sh
    if [[ $? == 0 ]];
    then
        echo "We have already moved to Scala 2.11, so running move_to_scala_2.11.sh a second time should fail, but error code was 0 (success)."
        exit 1
    fi
    set -e
fi
+ '[' 2.10 == 2.11 ']'

# print versions
echo "Testing GNOCCHI version ${VERSION} on Spark ${SPARK_VERSION} and Hadoop ${HADOOP_VERSION}"
+ echo 'Testing GNOCCHI version 0.0.1-SNAPSHOT on Spark 2.0.0 and Hadoop 2.3.0'
Testing GNOCCHI version 0.0.1-SNAPSHOT on Spark 2.0.0 and Hadoop 2.3.0

# first, build the sources, run the unit tests, and generate a coverage report
mvn clean \
    -Dhadoop.version=${HADOOP_VERSION} \
    -Dspark.version=${SPARK_VERSION} 
+ mvn clean -Dhadoop.version=2.3.0 -Dspark.version=2.0.0
Java HotSpot(TM) 64-Bit Server VM warning: ignoring option MaxPermSize=1g; support was removed in 8.0
[INFO] Scanning for projects...
[WARNING] 
[WARNING] Some problems were encountered while building the effective model for net.fnothaft:gnocchi-core_2.10:jar:0.0.1-SNAPSHOT
[WARNING] 'dependencies.dependency.(groupId:artifactId:type:classifier)' must be unique: org.apache.commons:commons-math3:jar -> version (?) vs 3.6.1 @ line 96, column 17
[WARNING] 'dependencies.dependency.exclusions.exclusion.artifactId' for org.apache.hadoop:hadoop-client:jar with value '*' does not match a valid id pattern. @ net.fnothaft:gnocchi-parent_2.10:0.0.1-SNAPSHOT, /home/jenkins/workspace/gnocchi-prb/HADOOP_VERSION/2.3.0/SCALAVER/2.10/SPARK_VERSION/2.0.0/label/centos/pom.xml, line 336, column 25
[WARNING] 'dependencies.dependency.exclusions.exclusion.artifactId' for org.apache.hadoop:hadoop-client:jar with value '*' does not match a valid id pattern. @ net.fnothaft:gnocchi-parent_2.10:0.0.1-SNAPSHOT, /home/jenkins/workspace/gnocchi-prb/HADOOP_VERSION/2.3.0/SCALAVER/2.10/SPARK_VERSION/2.0.0/label/centos/pom.xml, line 348, column 25
[WARNING] 'dependencies.dependency.exclusions.exclusion.artifactId' for org.apache.hadoop:hadoop-client:jar with value '*' does not match a valid id pattern. @ net.fnothaft:gnocchi-parent_2.10:0.0.1-SNAPSHOT, /home/jenkins/workspace/gnocchi-prb/HADOOP_VERSION/2.3.0/SCALAVER/2.10/SPARK_VERSION/2.0.0/label/centos/pom.xml, line 352, column 25
[WARNING] 'dependencyManagement.dependencies.dependency.exclusions.exclusion.artifactId' for org.apache.hadoop:hadoop-client:jar with value '*' does not match a valid id pattern. @ net.fnothaft:gnocchi-parent_2.10:0.0.1-SNAPSHOT, /home/jenkins/workspace/gnocchi-prb/HADOOP_VERSION/2.3.0/SCALAVER/2.10/SPARK_VERSION/2.0.0/label/centos/pom.xml, line 336, column 25
[WARNING] 'dependencyManagement.dependencies.dependency.exclusions.exclusion.artifactId' for org.apache.hadoop:hadoop-client:jar with value '*' does not match a valid id pattern. @ net.fnothaft:gnocchi-parent_2.10:0.0.1-SNAPSHOT, /home/jenkins/workspace/gnocchi-prb/HADOOP_VERSION/2.3.0/SCALAVER/2.10/SPARK_VERSION/2.0.0/label/centos/pom.xml, line 348, column 25
[WARNING] 'dependencyManagement.dependencies.dependency.exclusions.exclusion.artifactId' for org.apache.hadoop:hadoop-client:jar with value '*' does not match a valid id pattern. @ net.fnothaft:gnocchi-parent_2.10:0.0.1-SNAPSHOT, /home/jenkins/workspace/gnocchi-prb/HADOOP_VERSION/2.3.0/SCALAVER/2.10/SPARK_VERSION/2.0.0/label/centos/pom.xml, line 352, column 25
[WARNING] 
[WARNING] Some problems were encountered while building the effective model for net.fnothaft:gnocchi-cli_2.10:jar:0.0.1-SNAPSHOT
[WARNING] 'dependencies.dependency.exclusions.exclusion.artifactId' for org.apache.hadoop:hadoop-client:jar with value '*' does not match a valid id pattern. @ net.fnothaft:gnocchi-parent_2.10:0.0.1-SNAPSHOT, /home/jenkins/workspace/gnocchi-prb/HADOOP_VERSION/2.3.0/SCALAVER/2.10/SPARK_VERSION/2.0.0/label/centos/pom.xml, line 336, column 25
[WARNING] 'dependencies.dependency.exclusions.exclusion.artifactId' for org.apache.hadoop:hadoop-client:jar with value '*' does not match a valid id pattern. @ net.fnothaft:gnocchi-parent_2.10:0.0.1-SNAPSHOT, /home/jenkins/workspace/gnocchi-prb/HADOOP_VERSION/2.3.0/SCALAVER/2.10/SPARK_VERSION/2.0.0/label/centos/pom.xml, line 348, column 25
[WARNING] 'dependencies.dependency.exclusions.exclusion.artifactId' for org.apache.hadoop:hadoop-client:jar with value '*' does not match a valid id pattern. @ net.fnothaft:gnocchi-parent_2.10:0.0.1-SNAPSHOT, /home/jenkins/workspace/gnocchi-prb/HADOOP_VERSION/2.3.0/SCALAVER/2.10/SPARK_VERSION/2.0.0/label/centos/pom.xml, line 352, column 25
[WARNING] 'dependencyManagement.dependencies.dependency.exclusions.exclusion.artifactId' for org.apache.hadoop:hadoop-client:jar with value '*' does not match a valid id pattern. @ net.fnothaft:gnocchi-parent_2.10:0.0.1-SNAPSHOT, /home/jenkins/workspace/gnocchi-prb/HADOOP_VERSION/2.3.0/SCALAVER/2.10/SPARK_VERSION/2.0.0/label/centos/pom.xml, line 336, column 25
[WARNING] 'dependencyManagement.dependencies.dependency.exclusions.exclusion.artifactId' for org.apache.hadoop:hadoop-client:jar with value '*' does not match a valid id pattern. @ net.fnothaft:gnocchi-parent_2.10:0.0.1-SNAPSHOT, /home/jenkins/workspace/gnocchi-prb/HADOOP_VERSION/2.3.0/SCALAVER/2.10/SPARK_VERSION/2.0.0/label/centos/pom.xml, line 348, column 25
[WARNING] 'dependencyManagement.dependencies.dependency.exclusions.exclusion.artifactId' for org.apache.hadoop:hadoop-client:jar with value '*' does not match a valid id pattern. @ net.fnothaft:gnocchi-parent_2.10:0.0.1-SNAPSHOT, /home/jenkins/workspace/gnocchi-prb/HADOOP_VERSION/2.3.0/SCALAVER/2.10/SPARK_VERSION/2.0.0/label/centos/pom.xml, line 352, column 25
[WARNING] 
[WARNING] Some problems were encountered while building the effective model for net.fnothaft:gnocchi-parent_2.10:pom:0.0.1-SNAPSHOT
[WARNING] 'dependencyManagement.dependencies.dependency.exclusions.exclusion.artifactId' for org.apache.hadoop:hadoop-client:jar with value '*' does not match a valid id pattern. @ line 336, column 25
[WARNING] 'dependencyManagement.dependencies.dependency.exclusions.exclusion.artifactId' for org.apache.hadoop:hadoop-client:jar with value '*' does not match a valid id pattern. @ line 348, column 25
[WARNING] 'dependencyManagement.dependencies.dependency.exclusions.exclusion.artifactId' for org.apache.hadoop:hadoop-client:jar with value '*' does not match a valid id pattern. @ line 352, column 25
[WARNING] 
[WARNING] It is highly recommended to fix these problems because they threaten the stability of your build.
[WARNING] 
[WARNING] For this reason, future Maven versions might no longer support building such malformed projects.
[WARNING] 
[INFO] ------------------------------------------------------------------------
[INFO] Reactor Build Order:
[INFO] 
[INFO] gnocchi: Genotype store and query engine
[INFO] gnocchi-core: Core APIs and queries
[INFO] gnocchi-cli: Command line interface for managing and querying variant store
[INFO]                                                                         
[INFO] ------------------------------------------------------------------------
[INFO] Building gnocchi: Genotype store and query engine 0.0.1-SNAPSHOT
[INFO] ------------------------------------------------------------------------
[INFO] 
[INFO] --- maven-clean-plugin:2.5:clean (default-clean) @ gnocchi-parent_2.10 ---
[INFO]                                                                         
[INFO] ------------------------------------------------------------------------
[INFO] Building gnocchi-core: Core APIs and queries 0.0.1-SNAPSHOT
[INFO] ------------------------------------------------------------------------
[INFO] 
[INFO] --- maven-clean-plugin:2.5:clean (default-clean) @ gnocchi-core_2.10 ---
[INFO]                                                                         
[INFO] ------------------------------------------------------------------------
[INFO] Building gnocchi-cli: Command line interface for managing and querying variant store 0.0.1-SNAPSHOT
[INFO] ------------------------------------------------------------------------
[INFO] 
[INFO] --- maven-clean-plugin:2.5:clean (default-clean) @ gnocchi-cli_2.10 ---
[INFO] ------------------------------------------------------------------------
[INFO] Reactor Summary:
[INFO] 
[INFO] gnocchi: Genotype store and query engine .......... SUCCESS [0.141s]
[INFO] gnocchi-core: Core APIs and queries ............... SUCCESS [0.010s]
[INFO] gnocchi-cli: Command line interface for managing and querying variant store  SUCCESS [0.008s]
[INFO] ------------------------------------------------------------------------
[INFO] BUILD SUCCESS
[INFO] ------------------------------------------------------------------------
[INFO] Total time: 0.305s
[INFO] Finished at: Tue Feb 28 17:35:23 PST 2017
[INFO] Final Memory: 19M/1472M
[INFO] ------------------------------------------------------------------------
    
# if this is a pull request, we need to set the coveralls pr id
if [[ ! -z $ghprbPullId ]];
then
    COVERALLS_PRB_OPTION="-DpullRequest=${ghprbPullId}"
fi
+ [[ ! -z 12 ]]
+ COVERALLS_PRB_OPTION=-DpullRequest=12

# coveralls token should not be visible
set +x +v
+ set +x +v
Java HotSpot(TM) 64-Bit Server VM warning: ignoring option MaxPermSize=1g; support was removed in 8.0
[INFO] Scanning for projects...
[WARNING] 
[WARNING] Some problems were encountered while building the effective model for net.fnothaft:gnocchi-core_2.10:jar:0.0.1-SNAPSHOT
[WARNING] 'dependencies.dependency.(groupId:artifactId:type:classifier)' must be unique: org.apache.commons:commons-math3:jar -> version (?) vs 3.6.1 @ line 96, column 17
[WARNING] 'dependencies.dependency.exclusions.exclusion.artifactId' for org.apache.hadoop:hadoop-client:jar with value '*' does not match a valid id pattern. @ net.fnothaft:gnocchi-parent_2.10:0.0.1-SNAPSHOT, /home/jenkins/workspace/gnocchi-prb/HADOOP_VERSION/2.3.0/SCALAVER/2.10/SPARK_VERSION/2.0.0/label/centos/pom.xml, line 336, column 25
[WARNING] 'dependencies.dependency.exclusions.exclusion.artifactId' for org.apache.hadoop:hadoop-client:jar with value '*' does not match a valid id pattern. @ net.fnothaft:gnocchi-parent_2.10:0.0.1-SNAPSHOT, /home/jenkins/workspace/gnocchi-prb/HADOOP_VERSION/2.3.0/SCALAVER/2.10/SPARK_VERSION/2.0.0/label/centos/pom.xml, line 348, column 25
[WARNING] 'dependencies.dependency.exclusions.exclusion.artifactId' for org.apache.hadoop:hadoop-client:jar with value '*' does not match a valid id pattern. @ net.fnothaft:gnocchi-parent_2.10:0.0.1-SNAPSHOT, /home/jenkins/workspace/gnocchi-prb/HADOOP_VERSION/2.3.0/SCALAVER/2.10/SPARK_VERSION/2.0.0/label/centos/pom.xml, line 352, column 25
[WARNING] 'dependencyManagement.dependencies.dependency.exclusions.exclusion.artifactId' for org.apache.hadoop:hadoop-client:jar with value '*' does not match a valid id pattern. @ net.fnothaft:gnocchi-parent_2.10:0.0.1-SNAPSHOT, /home/jenkins/workspace/gnocchi-prb/HADOOP_VERSION/2.3.0/SCALAVER/2.10/SPARK_VERSION/2.0.0/label/centos/pom.xml, line 336, column 25
[WARNING] 'dependencyManagement.dependencies.dependency.exclusions.exclusion.artifactId' for org.apache.hadoop:hadoop-client:jar with value '*' does not match a valid id pattern. @ net.fnothaft:gnocchi-parent_2.10:0.0.1-SNAPSHOT, /home/jenkins/workspace/gnocchi-prb/HADOOP_VERSION/2.3.0/SCALAVER/2.10/SPARK_VERSION/2.0.0/label/centos/pom.xml, line 348, column 25
[WARNING] 'dependencyManagement.dependencies.dependency.exclusions.exclusion.artifactId' for org.apache.hadoop:hadoop-client:jar with value '*' does not match a valid id pattern. @ net.fnothaft:gnocchi-parent_2.10:0.0.1-SNAPSHOT, /home/jenkins/workspace/gnocchi-prb/HADOOP_VERSION/2.3.0/SCALAVER/2.10/SPARK_VERSION/2.0.0/label/centos/pom.xml, line 352, column 25
[WARNING] 
[WARNING] Some problems were encountered while building the effective model for net.fnothaft:gnocchi-cli_2.10:jar:0.0.1-SNAPSHOT
[WARNING] 'dependencies.dependency.exclusions.exclusion.artifactId' for org.apache.hadoop:hadoop-client:jar with value '*' does not match a valid id pattern. @ net.fnothaft:gnocchi-parent_2.10:0.0.1-SNAPSHOT, /home/jenkins/workspace/gnocchi-prb/HADOOP_VERSION/2.3.0/SCALAVER/2.10/SPARK_VERSION/2.0.0/label/centos/pom.xml, line 336, column 25
[WARNING] 'dependencies.dependency.exclusions.exclusion.artifactId' for org.apache.hadoop:hadoop-client:jar with value '*' does not match a valid id pattern. @ net.fnothaft:gnocchi-parent_2.10:0.0.1-SNAPSHOT, /home/jenkins/workspace/gnocchi-prb/HADOOP_VERSION/2.3.0/SCALAVER/2.10/SPARK_VERSION/2.0.0/label/centos/pom.xml, line 348, column 25
[WARNING] 'dependencies.dependency.exclusions.exclusion.artifactId' for org.apache.hadoop:hadoop-client:jar with value '*' does not match a valid id pattern. @ net.fnothaft:gnocchi-parent_2.10:0.0.1-SNAPSHOT, /home/jenkins/workspace/gnocchi-prb/HADOOP_VERSION/2.3.0/SCALAVER/2.10/SPARK_VERSION/2.0.0/label/centos/pom.xml, line 352, column 25
[WARNING] 'dependencyManagement.dependencies.dependency.exclusions.exclusion.artifactId' for org.apache.hadoop:hadoop-client:jar with value '*' does not match a valid id pattern. @ net.fnothaft:gnocchi-parent_2.10:0.0.1-SNAPSHOT, /home/jenkins/workspace/gnocchi-prb/HADOOP_VERSION/2.3.0/SCALAVER/2.10/SPARK_VERSION/2.0.0/label/centos/pom.xml, line 336, column 25
[WARNING] 'dependencyManagement.dependencies.dependency.exclusions.exclusion.artifactId' for org.apache.hadoop:hadoop-client:jar with value '*' does not match a valid id pattern. @ net.fnothaft:gnocchi-parent_2.10:0.0.1-SNAPSHOT, /home/jenkins/workspace/gnocchi-prb/HADOOP_VERSION/2.3.0/SCALAVER/2.10/SPARK_VERSION/2.0.0/label/centos/pom.xml, line 348, column 25
[WARNING] 'dependencyManagement.dependencies.dependency.exclusions.exclusion.artifactId' for org.apache.hadoop:hadoop-client:jar with value '*' does not match a valid id pattern. @ net.fnothaft:gnocchi-parent_2.10:0.0.1-SNAPSHOT, /home/jenkins/workspace/gnocchi-prb/HADOOP_VERSION/2.3.0/SCALAVER/2.10/SPARK_VERSION/2.0.0/label/centos/pom.xml, line 352, column 25
[WARNING] 
[WARNING] Some problems were encountered while building the effective model for net.fnothaft:gnocchi-parent_2.10:pom:0.0.1-SNAPSHOT
[WARNING] 'dependencyManagement.dependencies.dependency.exclusions.exclusion.artifactId' for org.apache.hadoop:hadoop-client:jar with value '*' does not match a valid id pattern. @ line 336, column 25
[WARNING] 'dependencyManagement.dependencies.dependency.exclusions.exclusion.artifactId' for org.apache.hadoop:hadoop-client:jar with value '*' does not match a valid id pattern. @ line 348, column 25
[WARNING] 'dependencyManagement.dependencies.dependency.exclusions.exclusion.artifactId' for org.apache.hadoop:hadoop-client:jar with value '*' does not match a valid id pattern. @ line 352, column 25
[WARNING] 
[WARNING] It is highly recommended to fix these problems because they threaten the stability of your build.
[WARNING] 
[WARNING] For this reason, future Maven versions might no longer support building such malformed projects.
[WARNING] 
[INFO] ------------------------------------------------------------------------
[INFO] Reactor Build Order:
[INFO] 
[INFO] gnocchi: Genotype store and query engine
[INFO] gnocchi-core: Core APIs and queries
[INFO] gnocchi-cli: Command line interface for managing and querying variant store
[INFO]                                                                         
[INFO] ------------------------------------------------------------------------
[INFO] Building gnocchi: Genotype store and query engine 0.0.1-SNAPSHOT
[INFO] ------------------------------------------------------------------------
[INFO] 
[INFO] --- maven-enforcer-plugin:1.0:enforce (enforce-maven) @ gnocchi-parent_2.10 ---
[INFO] 
[INFO] --- build-helper-maven-plugin:1.10:add-source (add-source) @ gnocchi-parent_2.10 ---
[INFO] Source directory: /home/jenkins/workspace/gnocchi-prb/HADOOP_VERSION/2.3.0/SCALAVER/2.10/SPARK_VERSION/2.0.0/label/centos/src/main/scala added.
[INFO] 
[INFO] --- scalariform-maven-plugin:0.1.4:format (default-cli) @ gnocchi-parent_2.10 ---
[INFO] Modified 0 of 84 .scala files
[INFO] 
[INFO] --- scala-maven-plugin:3.1.5:compile (scala-compile-first) @ gnocchi-parent_2.10 ---
[INFO] No sources to compile
[INFO] 
[INFO] --- build-helper-maven-plugin:1.10:add-test-source (add-test-source) @ gnocchi-parent_2.10 ---
[INFO] Test Source directory: /home/jenkins/workspace/gnocchi-prb/HADOOP_VERSION/2.3.0/SCALAVER/2.10/SPARK_VERSION/2.0.0/label/centos/src/test/scala added.
[INFO] 
[INFO] --- scala-maven-plugin:3.1.5:testCompile (scala-test-compile-first) @ gnocchi-parent_2.10 ---
[INFO] No sources to compile
[INFO] 
[INFO] >>> scoverage-maven-plugin:1.1.1:report (default-cli) @ gnocchi-parent_2.10 >>>
[INFO] 
[INFO] --- maven-enforcer-plugin:1.0:enforce (enforce-maven) @ gnocchi-parent_2.10 ---
[INFO] 
[INFO] --- build-helper-maven-plugin:1.10:add-source (add-source) @ gnocchi-parent_2.10 ---
[INFO] Source directory: /home/jenkins/workspace/gnocchi-prb/HADOOP_VERSION/2.3.0/SCALAVER/2.10/SPARK_VERSION/2.0.0/label/centos/src/main/scala added.
[INFO] 
[INFO] --- scalariform-maven-plugin:0.1.4:format (default-cli) @ gnocchi-parent_2.10 ---
[INFO] Modified 0 of 84 .scala files
[INFO] 
[INFO] --- scoverage-maven-plugin:1.1.1:pre-compile (default-cli) @ gnocchi-parent_2.10 ---
[INFO] Skipping SCoverage execution for project with packaging type 'pom'
[INFO] 
[INFO] --- scala-maven-plugin:3.1.5:compile (scala-compile-first) @ gnocchi-parent_2.10 ---
[INFO] No sources to compile
[INFO] 
[INFO] --- scoverage-maven-plugin:1.1.1:post-compile (default-cli) @ gnocchi-parent_2.10 ---
[INFO] 
[INFO] --- build-helper-maven-plugin:1.10:add-test-source (add-test-source) @ gnocchi-parent_2.10 ---
[INFO] Test Source directory: /home/jenkins/workspace/gnocchi-prb/HADOOP_VERSION/2.3.0/SCALAVER/2.10/SPARK_VERSION/2.0.0/label/centos/src/test/scala added.
[INFO] 
[INFO] --- scala-maven-plugin:3.1.5:testCompile (scala-test-compile-first) @ gnocchi-parent_2.10 ---
[INFO] No sources to compile
[INFO] 
[INFO] <<< scoverage-maven-plugin:1.1.1:report (default-cli) @ gnocchi-parent_2.10 <<<
[INFO] 
[INFO] --- scoverage-maven-plugin:1.1.1:report (default-cli) @ gnocchi-parent_2.10 ---
[INFO]                                                                         
[INFO] ------------------------------------------------------------------------
[INFO] Building gnocchi-core: Core APIs and queries 0.0.1-SNAPSHOT
[INFO] ------------------------------------------------------------------------
Downloading: http://repo.maven.apache.org/maven2/org/bdgenomics/adam/adam-core-spark2_2.10/0.19.0/adam-core-spark2_2.10-0.19.0.pom

[WARNING] The POM for org.bdgenomics.adam:adam-core-spark2_2.10:jar:0.19.0 is missing, no dependency information available
[WARNING] The POM for org.bdgenomics.adam:adam-core-spark2_2.10:jar:tests:0.19.0 is missing, no dependency information available
Downloading: http://repo.maven.apache.org/maven2/org/bdgenomics/adam/adam-core-spark2_2.10/0.19.0/adam-core-spark2_2.10-0.19.0.jar
Downloading: http://repo.maven.apache.org/maven2/org/bdgenomics/adam/adam-core-spark2_2.10/0.19.0/adam-core-spark2_2.10-0.19.0-tests.jar


[INFO]                                                                         
[INFO] ------------------------------------------------------------------------
[INFO] Skipping gnocchi: Genotype store and query engine
[INFO] This project has been banned from the build due to previous failures.
[INFO] ------------------------------------------------------------------------
[INFO] ------------------------------------------------------------------------
[INFO] Reactor Summary:
[INFO] 
[INFO] gnocchi: Genotype store and query engine .......... SUCCESS [4.036s]
[INFO] gnocchi-core: Core APIs and queries ............... FAILURE [1.452s]
[INFO] gnocchi-cli: Command line interface for managing and querying variant store  SKIPPED
[INFO] ------------------------------------------------------------------------
[INFO] BUILD FAILURE
[INFO] ------------------------------------------------------------------------
[INFO] Total time: 5.740s
[INFO] Finished at: Tue Feb 28 17:35:30 PST 2017
[INFO] Final Memory: 25M/1124M
[INFO] ------------------------------------------------------------------------
[ERROR] Failed to execute goal on project gnocchi-core_2.10: Could not resolve dependencies for project net.fnothaft:gnocchi-core_2.10:jar:0.0.1-SNAPSHOT: The following artifacts could not be resolved: org.bdgenomics.adam:adam-core-spark2_2.10:jar:0.19.0, org.bdgenomics.adam:adam-core-spark2_2.10:jar:tests:0.19.0: Could not find artifact org.bdgenomics.adam:adam-core-spark2_2.10:jar:0.19.0 in central (http://repo.maven.apache.org/maven2) -> [Help 1]
[ERROR] 
[ERROR] To see the full stack trace of the errors, re-run Maven with the -e switch.
[ERROR] Re-run Maven using the -X switch to enable full debug logging.
[ERROR] 
[ERROR] For more information about the errors and possible solutions, please read the following articles:
[ERROR] [Help 1] http://cwiki.apache.org/confluence/display/MAVEN/DependencyResolutionException
[ERROR] 
[ERROR] After correcting the problems, you can resume the build with the command
[ERROR]   mvn <goals> -rf :gnocchi-core_2.10
Build step 'Execute shell' marked build as failure
Recording test results
ERROR: Step ?Publish JUnit test result report? failed: No test report files were found. Configuration error?
Finished: FAILURE