FailedConsole Output

Skipping 5,786 KB.. Full Log
[INFO] Including org.bdgenomics.convert:convert:jar:0.9.0 in the shaded jar.
[WARNING] WORKAROUND:  refusing to add class org/apache/parquet/avro/AvroSchemaConverter$2.class from jar /home/jenkins/.m2/repository/org/apache/parquet/parquet-avro/1.10.1/parquet-avro-1.10.1.jar
[WARNING] WORKAROUND:  refusing to add class org/apache/parquet/avro/AvroSchemaConverter.class from jar /home/jenkins/.m2/repository/org/apache/parquet/parquet-avro/1.10.1/parquet-avro-1.10.1.jar
[WARNING] WORKAROUND:  refusing to add class org/apache/parquet/avro/AvroSchemaConverter$1.class from jar /home/jenkins/.m2/repository/org/apache/parquet/parquet-avro/1.10.1/parquet-avro-1.10.1.jar
[WARNING] guava-27.0-jre.jar, failureaccess-1.0.jar define 2 overlapping classes: 
[WARNING]   - com.google.common.util.concurrent.internal.InternalFutureFailureAccess
[WARNING]   - com.google.common.util.concurrent.internal.InternalFutures
[WARNING] mango-cli-spark3_2.12-0.0.6-SNAPSHOT.jar, adam-cli-spark2_2.12-0.32.0.jar define 3 overlapping classes: 
[WARNING]   - org.bdgenomics.adam.cli.CommandGroup
[WARNING]   - org.bdgenomics.adam.cli.InitArgs
[WARNING]   - org.bdgenomics.adam.cli.CommandGroup$
[WARNING] maven-shade-plugin has detected that some class files are
[WARNING] present in two or more JARs. When this happens, only one
[WARNING] single version of the class is copied to the uber jar.
[WARNING] Usually this is not harmful and you can skip these warnings,
[WARNING] otherwise try to manually exclude artifacts based on
[WARNING] mvn dependency:tree -Ddetail=true and the above output.
[WARNING] See http://maven.apache.org/plugins/maven-shade-plugin/
[INFO] Replacing original artifact with shaded artifact.
[INFO] Replacing /tmp/mangoTestD0h5221/deleteMePleaseThisIsNoLongerNeeded/mango-assembly/target/mango-assembly-spark3_2.12-0.0.6-SNAPSHOT.jar with /tmp/mangoTestD0h5221/deleteMePleaseThisIsNoLongerNeeded/mango-assembly/target/mango-assembly-spark3_2.12-0.0.6-SNAPSHOT-shaded.jar
[INFO] 
[INFO] --------< org.bdgenomics.mango:mango-distribution-spark3_2.12 >---------
[INFO] Building mango_2.12: Distribution 0.0.6-SNAPSHOT                   [4/5]
[INFO] --------------------------------[ pom ]---------------------------------
Downloading from central: https://repo.maven.apache.org/maven2/org/apache/maven/plugins/maven-assembly-plugin/2.2-beta-5/maven-assembly-plugin-2.2-beta-5.pom
Progress (1): 4.1/15 kB
Progress (1): 8.2/15 kB
Progress (1): 12/15 kB 
Progress (1): 15 kB   
                   
Downloaded from central: https://repo.maven.apache.org/maven2/org/apache/maven/plugins/maven-assembly-plugin/2.2-beta-5/maven-assembly-plugin-2.2-beta-5.pom (15 kB at 1.4 MB/s)
Downloading from central: https://repo.maven.apache.org/maven2/org/apache/maven/plugins/maven-plugins/16/maven-plugins-16.pom
Progress (1): 4.1/13 kB
Progress (1): 8.2/13 kB
Progress (1): 12/13 kB 
Progress (1): 13 kB   
                   
Downloaded from central: https://repo.maven.apache.org/maven2/org/apache/maven/plugins/maven-plugins/16/maven-plugins-16.pom (13 kB at 1.4 MB/s)
Downloading from central: https://repo.maven.apache.org/maven2/org/apache/maven/plugins/maven-assembly-plugin/2.2-beta-5/maven-assembly-plugin-2.2-beta-5.jar
Progress (1): 4.1/209 kB
Progress (1): 8.2/209 kB
Progress (1): 12/209 kB 
Progress (1): 16/209 kB
Progress (1): 20/209 kB
Progress (1): 25/209 kB
Progress (1): 29/209 kB
Progress (1): 33/209 kB
Progress (1): 37/209 kB
Progress (1): 41/209 kB
Progress (1): 45/209 kB
Progress (1): 49/209 kB
Progress (1): 53/209 kB
Progress (1): 57/209 kB
Progress (1): 61/209 kB
Progress (1): 66/209 kB
Progress (1): 70/209 kB
Progress (1): 74/209 kB
Progress (1): 78/209 kB
Progress (1): 82/209 kB
Progress (1): 86/209 kB
Progress (1): 90/209 kB
Progress (1): 94/209 kB
Progress (1): 98/209 kB
Progress (1): 102/209 kB
Progress (1): 106/209 kB
Progress (1): 111/209 kB
Progress (1): 115/209 kB
Progress (1): 119/209 kB
Progress (1): 123/209 kB
Progress (1): 127/209 kB
Progress (1): 131/209 kB
Progress (1): 135/209 kB
Progress (1): 139/209 kB
Progress (1): 143/209 kB
Progress (1): 147/209 kB
Progress (1): 152/209 kB
Progress (1): 156/209 kB
Progress (1): 160/209 kB
Progress (1): 164/209 kB
Progress (1): 168/209 kB
Progress (1): 172/209 kB
Progress (1): 176/209 kB
Progress (1): 180/209 kB
Progress (1): 184/209 kB
Progress (1): 188/209 kB
Progress (1): 193/209 kB
Progress (1): 197/209 kB
Progress (1): 201/209 kB
Progress (1): 205/209 kB
Progress (1): 209 kB    
                    
Downloaded from central: https://repo.maven.apache.org/maven2/org/apache/maven/plugins/maven-assembly-plugin/2.2-beta-5/maven-assembly-plugin-2.2-beta-5.jar (209 kB at 9.1 MB/s)
[INFO] 
[INFO] --- maven-enforcer-plugin:1.0:enforce (enforce-versions) @ mango-distribution-spark3_2.12 ---
[INFO] 
[INFO] --- maven-enforcer-plugin:1.0:enforce (enforce-maven) @ mango-distribution-spark3_2.12 ---
[INFO] 
[INFO] --- scalariform-maven-plugin:0.1.4:format (default) @ mango-distribution-spark3_2.12 ---
[INFO] Modified 0 of 0 .scala files
[INFO] 
[INFO] --- scala-maven-plugin:3.2.2:compile (scala-compile-first) @ mango-distribution-spark3_2.12 ---
[INFO] No sources to compile
[INFO] 
[INFO] --- scala-maven-plugin:3.2.2:testCompile (scala-test-compile-first) @ mango-distribution-spark3_2.12 ---
[INFO] No sources to compile
[INFO] 
[INFO] --- maven-source-plugin:3.0.1:jar-no-fork (attach-sources) @ mango-distribution-spark3_2.12 ---
[INFO] 
[INFO] --- maven-javadoc-plugin:3.1.0:jar (attach-javadocs) @ mango-distribution-spark3_2.12 ---
[INFO] 
[INFO] >>> scala-maven-plugin:3.2.2:doc-jar (attach-scaladocs) > generate-sources @ mango-distribution-spark3_2.12 >>>
[INFO] 
[INFO] --- maven-enforcer-plugin:1.0:enforce (enforce-versions) @ mango-distribution-spark3_2.12 ---
[INFO] 
[INFO] --- maven-enforcer-plugin:1.0:enforce (enforce-maven) @ mango-distribution-spark3_2.12 ---
[INFO] 
[INFO] <<< scala-maven-plugin:3.2.2:doc-jar (attach-scaladocs) < generate-sources @ mango-distribution-spark3_2.12 <<<
[INFO] 
[INFO] 
[INFO] --- scala-maven-plugin:3.2.2:doc-jar (attach-scaladocs) @ mango-distribution-spark3_2.12 ---
[INFO] No source files found
[INFO] 
[INFO] --- maven-assembly-plugin:2.2-beta-5:single (default) @ mango-distribution-spark3_2.12 ---
Downloading from central: https://repo.maven.apache.org/maven2/org/apache/maven/shared/maven-common-artifact-filters/1.1/maven-common-artifact-filters-1.1.pom
Progress (1): 2.8 kB
                    
Downloaded from central: https://repo.maven.apache.org/maven2/org/apache/maven/shared/maven-common-artifact-filters/1.1/maven-common-artifact-filters-1.1.pom (2.8 kB at 277 kB/s)
Downloading from central: https://repo.maven.apache.org/maven2/org/apache/maven/shared/maven-shared-components/10/maven-shared-components-10.pom
Progress (1): 4.1/8.4 kB
Progress (1): 8.2/8.4 kB
Progress (1): 8.4 kB    
                    
Downloaded from central: https://repo.maven.apache.org/maven2/org/apache/maven/shared/maven-shared-components/10/maven-shared-components-10.pom (8.4 kB at 1.2 MB/s)
Downloading from central: https://repo.maven.apache.org/maven2/org/apache/maven/maven-parent/9/maven-parent-9.pom
Progress (1): 4.1/33 kB
Progress (1): 8.2/33 kB
Progress (1): 12/33 kB 
Progress (1): 16/33 kB
Progress (1): 20/33 kB
Progress (1): 25/33 kB
Progress (1): 29/33 kB
Progress (1): 33/33 kB
Progress (1): 33 kB   
                   
Downloaded from central: https://repo.maven.apache.org/maven2/org/apache/maven/maven-parent/9/maven-parent-9.pom (33 kB at 4.1 MB/s)
Downloading from central: https://repo.maven.apache.org/maven2/org/apache/maven/maven-project/2.0/maven-project-2.0.pom
Progress (1): 1.6 kB
                    
Downloaded from central: https://repo.maven.apache.org/maven2/org/apache/maven/maven-project/2.0/maven-project-2.0.pom (1.6 kB at 164 kB/s)
Downloading from central: https://repo.maven.apache.org/maven2/org/apache/maven/maven/2.0/maven-2.0.pom
Progress (1): 4.1/8.8 kB
Progress (1): 8.2/8.8 kB
Progress (1): 8.8 kB    
                    
Downloaded from central: https://repo.maven.apache.org/maven2/org/apache/maven/maven/2.0/maven-2.0.pom (8.8 kB at 731 kB/s)
Downloading from central: https://repo.maven.apache.org/maven2/org/apache/maven/maven-profile/2.0/maven-profile-2.0.pom
Progress (1): 1.4 kB
                    
Downloaded from central: https://repo.maven.apache.org/maven2/org/apache/maven/maven-profile/2.0/maven-profile-2.0.pom (1.4 kB at 106 kB/s)
Downloading from central: https://repo.maven.apache.org/maven2/org/apache/maven/maven-model/2.0/maven-model-2.0.pom
Progress (1): 2.4 kB
                    
Downloaded from central: https://repo.maven.apache.org/maven2/org/apache/maven/maven-model/2.0/maven-model-2.0.pom (2.4 kB at 267 kB/s)
Downloading from central: https://repo.maven.apache.org/maven2/org/apache/maven/maven-artifact-manager/2.0/maven-artifact-manager-2.0.pom
Progress (1): 1.3 kB
                    
Downloaded from central: https://repo.maven.apache.org/maven2/org/apache/maven/maven-artifact-manager/2.0/maven-artifact-manager-2.0.pom (1.3 kB at 135 kB/s)
Downloading from central: https://repo.maven.apache.org/maven2/org/apache/maven/maven-repository-metadata/2.0/maven-repository-metadata-2.0.pom
Progress (1): 1.2 kB
                    
Downloaded from central: https://repo.maven.apache.org/maven2/org/apache/maven/maven-repository-metadata/2.0/maven-repository-metadata-2.0.pom (1.2 kB at 136 kB/s)
Downloading from central: https://repo.maven.apache.org/maven2/org/apache/maven/maven-artifact/2.0/maven-artifact-2.0.pom
Progress (1): 723 B
                   
Downloaded from central: https://repo.maven.apache.org/maven2/org/apache/maven/maven-artifact/2.0/maven-artifact-2.0.pom (723 B at 80 kB/s)
Downloading from central: https://repo.maven.apache.org/maven2/org/apache/maven/maven-core/2.0/maven-core-2.0.pom
Progress (1): 4.1/5.6 kB
Progress (1): 5.6 kB    
                    
Downloaded from central: https://repo.maven.apache.org/maven2/org/apache/maven/maven-core/2.0/maven-core-2.0.pom (5.6 kB at 560 kB/s)
Downloading from central: https://repo.maven.apache.org/maven2/org/apache/maven/maven-settings/2.0/maven-settings-2.0.pom
Progress (1): 1.4 kB
                    
Downloaded from central: https://repo.maven.apache.org/maven2/org/apache/maven/maven-settings/2.0/maven-settings-2.0.pom (1.4 kB at 153 kB/s)
Downloading from central: https://repo.maven.apache.org/maven2/org/apache/maven/maven-plugin-parameter-documenter/2.0/maven-plugin-parameter-documenter-2.0.pom
Progress (1): 1.5 kB
                    
Downloaded from central: https://repo.maven.apache.org/maven2/org/apache/maven/maven-plugin-parameter-documenter/2.0/maven-plugin-parameter-documenter-2.0.pom (1.5 kB at 170 kB/s)
Downloading from central: https://repo.maven.apache.org/maven2/org/apache/maven/reporting/maven-reporting-api/2.0/maven-reporting-api-2.0.pom
Progress (1): 1.1 kB
                    
Downloaded from central: https://repo.maven.apache.org/maven2/org/apache/maven/reporting/maven-reporting-api/2.0/maven-reporting-api-2.0.pom (1.1 kB at 123 kB/s)
Downloading from central: https://repo.maven.apache.org/maven2/org/apache/maven/reporting/maven-reporting/2.0/maven-reporting-2.0.pom
Progress (1): 504 B
                   
Downloaded from central: https://repo.maven.apache.org/maven2/org/apache/maven/reporting/maven-reporting/2.0/maven-reporting-2.0.pom (504 B at 56 kB/s)
Downloading from central: https://repo.maven.apache.org/maven2/doxia/doxia-sink-api/1.0-alpha-4/doxia-sink-api-1.0-alpha-4.pom
Progress (1): 1.1 kB
                    
Downloaded from central: https://repo.maven.apache.org/maven2/doxia/doxia-sink-api/1.0-alpha-4/doxia-sink-api-1.0-alpha-4.pom (1.1 kB at 109 kB/s)
Downloading from central: https://repo.maven.apache.org/maven2/org/apache/maven/maven-error-diagnostics/2.0/maven-error-diagnostics-2.0.pom
Progress (1): 812 B
                   
Downloaded from central: https://repo.maven.apache.org/maven2/org/apache/maven/maven-error-diagnostics/2.0/maven-error-diagnostics-2.0.pom (812 B at 62 kB/s)
Downloading from central: https://repo.maven.apache.org/maven2/org/apache/maven/maven-plugin-registry/2.0/maven-plugin-registry-2.0.pom
Progress (1): 1.3 kB
                    
Downloaded from central: https://repo.maven.apache.org/maven2/org/apache/maven/maven-plugin-registry/2.0/maven-plugin-registry-2.0.pom (1.3 kB at 107 kB/s)
Downloading from central: https://repo.maven.apache.org/maven2/org/apache/maven/maven-plugin-api/2.0/maven-plugin-api-2.0.pom
Progress (1): 601 B
                   
Downloaded from central: https://repo.maven.apache.org/maven2/org/apache/maven/maven-plugin-api/2.0/maven-plugin-api-2.0.pom (601 B at 75 kB/s)
Downloading from central: https://repo.maven.apache.org/maven2/org/apache/maven/maven-plugin-descriptor/2.0/maven-plugin-descriptor-2.0.pom
Progress (1): 1.5 kB
                    
Downloaded from central: https://repo.maven.apache.org/maven2/org/apache/maven/maven-plugin-descriptor/2.0/maven-plugin-descriptor-2.0.pom (1.5 kB at 183 kB/s)
Downloading from central: https://repo.maven.apache.org/maven2/org/apache/maven/maven-monitor/2.0/maven-monitor-2.0.pom
Progress (1): 400 B
                   
Downloaded from central: https://repo.maven.apache.org/maven2/org/apache/maven/maven-monitor/2.0/maven-monitor-2.0.pom (400 B at 33 kB/s)
Downloading from central: https://repo.maven.apache.org/maven2/org/codehaus/plexus/plexus-utils/1.2/plexus-utils-1.2.pom
Progress (1): 767 B
                   
Downloaded from central: https://repo.maven.apache.org/maven2/org/codehaus/plexus/plexus-utils/1.2/plexus-utils-1.2.pom (767 B at 110 kB/s)
Downloading from central: https://repo.maven.apache.org/maven2/org/codehaus/plexus/plexus/1.0.5/plexus-1.0.5.pom
Progress (1): 4.1/5.9 kB
Progress (1): 5.9 kB    
                    
Downloaded from central: https://repo.maven.apache.org/maven2/org/codehaus/plexus/plexus/1.0.5/plexus-1.0.5.pom (5.9 kB at 594 kB/s)
Downloading from central: https://repo.maven.apache.org/maven2/org/codehaus/plexus/plexus-interpolation/1.7/plexus-interpolation-1.7.pom
Progress (1): 2.9 kB
                    
Downloaded from central: https://repo.maven.apache.org/maven2/org/codehaus/plexus/plexus-interpolation/1.7/plexus-interpolation-1.7.pom (2.9 kB at 291 kB/s)
Downloading from central: https://repo.maven.apache.org/maven2/org/codehaus/plexus/plexus-archiver/1.0-alpha-12/plexus-archiver-1.0-alpha-12.pom
Progress (1): 1.6 kB
                    
Downloaded from central: https://repo.maven.apache.org/maven2/org/codehaus/plexus/plexus-archiver/1.0-alpha-12/plexus-archiver-1.0-alpha-12.pom (1.6 kB at 158 kB/s)
Downloading from central: https://repo.maven.apache.org/maven2/org/codehaus/plexus/plexus-io/1.0-alpha-4/plexus-io-1.0-alpha-4.pom
Progress (1): 1.2 kB
                    
Downloaded from central: https://repo.maven.apache.org/maven2/org/codehaus/plexus/plexus-io/1.0-alpha-4/plexus-io-1.0-alpha-4.pom (1.2 kB at 133 kB/s)
Downloading from central: https://repo.maven.apache.org/maven2/org/apache/maven/shared/file-management/1.1/file-management-1.1.pom
Progress (1): 2.7 kB
                    
Downloaded from central: https://repo.maven.apache.org/maven2/org/apache/maven/shared/file-management/1.1/file-management-1.1.pom (2.7 kB at 242 kB/s)
Downloading from central: https://repo.maven.apache.org/maven2/org/apache/maven/shared/maven-shared-components/4/maven-shared-components-4.pom
Progress (1): 2.2 kB
                    
Downloaded from central: https://repo.maven.apache.org/maven2/org/apache/maven/shared/maven-shared-components/4/maven-shared-components-4.pom (2.2 kB at 276 kB/s)
Downloading from central: https://repo.maven.apache.org/maven2/org/apache/maven/maven-parent/4/maven-parent-4.pom
Progress (1): 4.1/10.0 kB
Progress (1): 8.2/10.0 kB
Progress (1): 10.0 kB    
                     
Downloaded from central: https://repo.maven.apache.org/maven2/org/apache/maven/maven-parent/4/maven-parent-4.pom (10.0 kB at 1000 kB/s)
Downloading from central: https://repo.maven.apache.org/maven2/org/apache/maven/shared/maven-shared-io/1.0/maven-shared-io-1.0.pom
Progress (1): 3.0 kB
                    
Downloaded from central: https://repo.maven.apache.org/maven2/org/apache/maven/shared/maven-shared-io/1.0/maven-shared-io-1.0.pom (3.0 kB at 275 kB/s)
Downloading from central: https://repo.maven.apache.org/maven2/org/apache/maven/maven-artifact/2.0.2/maven-artifact-2.0.2.pom
Progress (1): 765 B
                   
Downloaded from central: https://repo.maven.apache.org/maven2/org/apache/maven/maven-artifact/2.0.2/maven-artifact-2.0.2.pom (765 B at 85 kB/s)
Downloading from central: https://repo.maven.apache.org/maven2/org/apache/maven/maven/2.0.2/maven-2.0.2.pom
Progress (1): 4.1/13 kB
Progress (1): 8.2/13 kB
Progress (1): 12/13 kB 
Progress (1): 13 kB   
                   
Downloaded from central: https://repo.maven.apache.org/maven2/org/apache/maven/maven/2.0.2/maven-2.0.2.pom (13 kB at 1.3 MB/s)
Downloading from central: https://repo.maven.apache.org/maven2/org/codehaus/plexus/plexus-utils/1.1/plexus-utils-1.1.pom
Progress (1): 767 B
                   
Downloaded from central: https://repo.maven.apache.org/maven2/org/codehaus/plexus/plexus-utils/1.1/plexus-utils-1.1.pom (767 B at 110 kB/s)
Downloading from central: https://repo.maven.apache.org/maven2/org/apache/maven/maven-artifact-manager/2.0.2/maven-artifact-manager-2.0.2.pom
Progress (1): 1.4 kB
                    
Downloaded from central: https://repo.maven.apache.org/maven2/org/apache/maven/maven-artifact-manager/2.0.2/maven-artifact-manager-2.0.2.pom (1.4 kB at 199 kB/s)
Downloading from central: https://repo.maven.apache.org/maven2/org/apache/maven/maven-repository-metadata/2.0.2/maven-repository-metadata-2.0.2.pom
Progress (1): 1.3 kB
                    
Downloaded from central: https://repo.maven.apache.org/maven2/org/apache/maven/maven-repository-metadata/2.0.2/maven-repository-metadata-2.0.2.pom (1.3 kB at 145 kB/s)
Downloading from central: https://repo.maven.apache.org/maven2/org/apache/maven/wagon/wagon-provider-api/1.0-alpha-6/wagon-provider-api-1.0-alpha-6.pom
Progress (1): 588 B
                   
Downloaded from central: https://repo.maven.apache.org/maven2/org/apache/maven/wagon/wagon-provider-api/1.0-alpha-6/wagon-provider-api-1.0-alpha-6.pom (588 B at 59 kB/s)
Downloading from central: https://repo.maven.apache.org/maven2/org/apache/maven/wagon/wagon/1.0-alpha-6/wagon-1.0-alpha-6.pom
Progress (1): 4.1/6.4 kB
Progress (1): 6.4 kB    
                    
Downloaded from central: https://repo.maven.apache.org/maven2/org/apache/maven/wagon/wagon/1.0-alpha-6/wagon-1.0-alpha-6.pom (6.4 kB at 800 kB/s)
Downloading from central: https://repo.maven.apache.org/maven2/org/apache/maven/shared/maven-shared-io/1.1/maven-shared-io-1.1.pom
Progress (1): 4.1 kB
                    
Downloaded from central: https://repo.maven.apache.org/maven2/org/apache/maven/shared/maven-shared-io/1.1/maven-shared-io-1.1.pom (4.1 kB at 580 kB/s)
Downloading from central: https://repo.maven.apache.org/maven2/org/apache/maven/shared/maven-shared-components/8/maven-shared-components-8.pom
Progress (1): 2.7 kB
                    
Downloaded from central: https://repo.maven.apache.org/maven2/org/apache/maven/shared/maven-shared-components/8/maven-shared-components-8.pom (2.7 kB at 382 kB/s)
Downloading from central: https://repo.maven.apache.org/maven2/org/apache/maven/maven-parent/7/maven-parent-7.pom
Progress (1): 4.1/21 kB
Progress (1): 8.2/21 kB
Progress (1): 12/21 kB 
Progress (1): 16/21 kB
Progress (1): 20/21 kB
Progress (1): 21 kB   
                   
Downloaded from central: https://repo.maven.apache.org/maven2/org/apache/maven/maven-parent/7/maven-parent-7.pom (21 kB at 1.9 MB/s)
Downloading from central: https://repo.maven.apache.org/maven2/org/apache/maven/shared/maven-filtering/1.0-beta-2/maven-filtering-1.0-beta-2.pom
Progress (1): 4.0 kB
                    
Downloaded from central: https://repo.maven.apache.org/maven2/org/apache/maven/shared/maven-filtering/1.0-beta-2/maven-filtering-1.0-beta-2.pom (4.0 kB at 403 kB/s)
Downloading from central: https://repo.maven.apache.org/maven2/org/codehaus/plexus/plexus-interpolation/1.6/plexus-interpolation-1.6.pom
Progress (1): 2.9 kB
                    
Downloaded from central: https://repo.maven.apache.org/maven2/org/codehaus/plexus/plexus-interpolation/1.6/plexus-interpolation-1.6.pom (2.9 kB at 363 kB/s)
Downloading from central: https://repo.maven.apache.org/maven2/org/codehaus/plexus/plexus-active-collections/1.0-beta-2/plexus-active-collections-1.0-beta-2.pom
Progress (1): 2.8 kB
                    
Downloaded from central: https://repo.maven.apache.org/maven2/org/codehaus/plexus/plexus-active-collections/1.0-beta-2/plexus-active-collections-1.0-beta-2.pom (2.8 kB at 278 kB/s)
Downloading from central: https://repo.maven.apache.org/maven2/org/codehaus/plexus/plexus-container-default/1.0-alpha-22/plexus-container-default-1.0-alpha-22.pom
Progress (1): 3.0 kB
                    
Downloaded from central: https://repo.maven.apache.org/maven2/org/codehaus/plexus/plexus-container-default/1.0-alpha-22/plexus-container-default-1.0-alpha-22.pom (3.0 kB at 332 kB/s)
Downloading from central: https://repo.maven.apache.org/maven2/org/codehaus/plexus/plexus-containers/1.0-alpha-22/plexus-containers-1.0-alpha-22.pom
Progress (1): 1.9 kB
                    
Downloaded from central: https://repo.maven.apache.org/maven2/org/codehaus/plexus/plexus-containers/1.0-alpha-22/plexus-containers-1.0-alpha-22.pom (1.9 kB at 210 kB/s)
Downloading from central: https://repo.maven.apache.org/maven2/org/apache/maven/maven-plugin-api/2.0.4/maven-plugin-api-2.0.4.pom
Progress (1): 643 B
                   
Downloaded from central: https://repo.maven.apache.org/maven2/org/apache/maven/maven-plugin-api/2.0.4/maven-plugin-api-2.0.4.pom (643 B at 64 kB/s)
Downloading from central: https://repo.maven.apache.org/maven2/org/apache/maven/maven/2.0.4/maven-2.0.4.pom
Progress (1): 4.1/12 kB
Progress (1): 8.2/12 kB
Progress (1): 12 kB    
                   
Downloaded from central: https://repo.maven.apache.org/maven2/org/apache/maven/maven/2.0.4/maven-2.0.4.pom (12 kB at 1.2 MB/s)
Downloading from central: https://repo.maven.apache.org/maven2/org/apache/maven/maven-project/2.0.4/maven-project-2.0.4.pom
Progress (1): 1.8 kB
                    
Downloaded from central: https://repo.maven.apache.org/maven2/org/apache/maven/maven-project/2.0.4/maven-project-2.0.4.pom (1.8 kB at 184 kB/s)
Downloading from central: https://repo.maven.apache.org/maven2/org/apache/maven/maven-settings/2.0.4/maven-settings-2.0.4.pom
Progress (1): 1.6 kB
                    
Downloaded from central: https://repo.maven.apache.org/maven2/org/apache/maven/maven-settings/2.0.4/maven-settings-2.0.4.pom (1.6 kB at 148 kB/s)
Downloading from central: https://repo.maven.apache.org/maven2/org/apache/maven/maven-model/2.0.4/maven-model-2.0.4.pom
Progress (1): 2.7 kB
                    
Downloaded from central: https://repo.maven.apache.org/maven2/org/apache/maven/maven-model/2.0.4/maven-model-2.0.4.pom (2.7 kB at 339 kB/s)
Downloading from central: https://repo.maven.apache.org/maven2/org/apache/maven/maven-profile/2.0.4/maven-profile-2.0.4.pom
Progress (1): 1.6 kB
                    
Downloaded from central: https://repo.maven.apache.org/maven2/org/apache/maven/maven-profile/2.0.4/maven-profile-2.0.4.pom (1.6 kB at 147 kB/s)
Downloading from central: https://repo.maven.apache.org/maven2/org/apache/maven/maven-artifact-manager/2.0.4/maven-artifact-manager-2.0.4.pom
Progress (1): 1.4 kB
                    
Downloaded from central: https://repo.maven.apache.org/maven2/org/apache/maven/maven-artifact-manager/2.0.4/maven-artifact-manager-2.0.4.pom (1.4 kB at 151 kB/s)
Downloading from central: https://repo.maven.apache.org/maven2/org/apache/maven/maven-repository-metadata/2.0.4/maven-repository-metadata-2.0.4.pom
Progress (1): 1.5 kB
                    
Downloaded from central: https://repo.maven.apache.org/maven2/org/apache/maven/maven-repository-metadata/2.0.4/maven-repository-metadata-2.0.4.pom (1.5 kB at 149 kB/s)
Downloading from central: https://repo.maven.apache.org/maven2/org/apache/maven/maven-artifact/2.0.4/maven-artifact-2.0.4.pom
Progress (1): 765 B
                   
Downloaded from central: https://repo.maven.apache.org/maven2/org/apache/maven/maven-artifact/2.0.4/maven-artifact-2.0.4.pom (765 B at 96 kB/s)
Downloading from central: https://repo.maven.apache.org/maven2/org/apache/maven/maven-archiver/2.4/maven-archiver-2.4.pom
Progress (1): 3.4 kB
                    
Downloaded from central: https://repo.maven.apache.org/maven2/org/apache/maven/maven-archiver/2.4/maven-archiver-2.4.pom (3.4 kB at 429 kB/s)
Downloading from central: https://repo.maven.apache.org/maven2/org/codehaus/plexus/plexus-archiver/1.0-alpha-11/plexus-archiver-1.0-alpha-11.pom
Progress (1): 1.8 kB
                    
Downloaded from central: https://repo.maven.apache.org/maven2/org/codehaus/plexus/plexus-archiver/1.0-alpha-11/plexus-archiver-1.0-alpha-11.pom (1.8 kB at 258 kB/s)
Downloading from central: https://repo.maven.apache.org/maven2/org/codehaus/plexus/plexus-container-default/1.0-alpha-15/plexus-container-default-1.0-alpha-15.pom
Progress (1): 1.7 kB
                    
Downloaded from central: https://repo.maven.apache.org/maven2/org/codehaus/plexus/plexus-container-default/1.0-alpha-15/plexus-container-default-1.0-alpha-15.pom (1.7 kB at 214 kB/s)
Downloading from central: https://repo.maven.apache.org/maven2/org/codehaus/plexus/plexus-containers/1.0-alpha-15/plexus-containers-1.0-alpha-15.pom
Progress (1): 1.9 kB
                    
Downloaded from central: https://repo.maven.apache.org/maven2/org/codehaus/plexus/plexus-containers/1.0-alpha-15/plexus-containers-1.0-alpha-15.pom (1.9 kB at 189 kB/s)
Downloading from central: https://repo.maven.apache.org/maven2/org/codehaus/plexus/plexus-component-api/1.0-alpha-15/plexus-component-api-1.0-alpha-15.pom
Progress (1): 948 B
                   
Downloaded from central: https://repo.maven.apache.org/maven2/org/codehaus/plexus/plexus-component-api/1.0-alpha-15/plexus-component-api-1.0-alpha-15.pom (948 B at 118 kB/s)
Downloading from central: https://repo.maven.apache.org/maven2/org/codehaus/plexus/plexus-classworlds/1.2-alpha-6/plexus-classworlds-1.2-alpha-6.pom
Progress (1): 2.4 kB
                    
Downloaded from central: https://repo.maven.apache.org/maven2/org/codehaus/plexus/plexus-classworlds/1.2-alpha-6/plexus-classworlds-1.2-alpha-6.pom (2.4 kB at 339 kB/s)
Downloading from central: https://repo.maven.apache.org/maven2/org/codehaus/plexus/plexus-io/1.0-alpha-3/plexus-io-1.0-alpha-3.pom
Progress (1): 1.4 kB
                    
Downloaded from central: https://repo.maven.apache.org/maven2/org/codehaus/plexus/plexus-io/1.0-alpha-3/plexus-io-1.0-alpha-3.pom (1.4 kB at 176 kB/s)
Downloading from central: https://repo.maven.apache.org/maven2/org/codehaus/plexus/plexus-component-api/1.0-alpha-16/plexus-component-api-1.0-alpha-16.pom
Progress (1): 2.2 kB
                    
Downloaded from central: https://repo.maven.apache.org/maven2/org/codehaus/plexus/plexus-component-api/1.0-alpha-16/plexus-component-api-1.0-alpha-16.pom (2.2 kB at 277 kB/s)
Downloading from central: https://repo.maven.apache.org/maven2/org/codehaus/plexus/plexus-containers/1.0-alpha-16/plexus-containers-1.0-alpha-16.pom
Progress (1): 1.9 kB
                    
Downloaded from central: https://repo.maven.apache.org/maven2/org/codehaus/plexus/plexus-containers/1.0-alpha-16/plexus-containers-1.0-alpha-16.pom (1.9 kB at 236 kB/s)
Downloading from central: https://repo.maven.apache.org/maven2/org/codehaus/plexus/plexus-utils/1.4.9/plexus-utils-1.4.9.pom
Progress (1): 2.3 kB
                    
Downloaded from central: https://repo.maven.apache.org/maven2/org/codehaus/plexus/plexus-utils/1.4.9/plexus-utils-1.4.9.pom (2.3 kB at 255 kB/s)
Downloading from central: https://repo.maven.apache.org/maven2/org/codehaus/plexus/plexus-utils/2.0.1/plexus-utils-2.0.1.pom
Progress (1): 3.3 kB
                    
Downloaded from central: https://repo.maven.apache.org/maven2/org/codehaus/plexus/plexus-utils/2.0.1/plexus-utils-2.0.1.pom (3.3 kB at 371 kB/s)
Downloading from central: https://repo.maven.apache.org/maven2/org/codehaus/plexus/plexus/2.0.3/plexus-2.0.3.pom
Progress (1): 4.1/15 kB
Progress (1): 8.2/15 kB
Progress (1): 12/15 kB 
Progress (1): 15 kB   
                   
Downloaded from central: https://repo.maven.apache.org/maven2/org/codehaus/plexus/plexus/2.0.3/plexus-2.0.3.pom (15 kB at 1.7 MB/s)
Downloading from central: https://repo.maven.apache.org/maven2/org/apache/maven/shared/maven-repository-builder/1.0-alpha-2/maven-repository-builder-1.0-alpha-2.pom
Progress (1): 3.2 kB
                    
Downloaded from central: https://repo.maven.apache.org/maven2/org/apache/maven/shared/maven-repository-builder/1.0-alpha-2/maven-repository-builder-1.0-alpha-2.pom (3.2 kB at 323 kB/s)
Downloading from central: https://repo.maven.apache.org/maven2/org/apache/maven/shared/maven-common-artifact-filters/1.0-alpha-1/maven-common-artifact-filters-1.0-alpha-1.pom
Progress (1): 1.8 kB
                    
Downloaded from central: https://repo.maven.apache.org/maven2/org/apache/maven/shared/maven-common-artifact-filters/1.0-alpha-1/maven-common-artifact-filters-1.0-alpha-1.pom (1.8 kB at 200 kB/s)
Downloading from central: https://repo.maven.apache.org/maven2/org/apache/maven/shared/maven-shared-components/6/maven-shared-components-6.pom
Progress (1): 3.1 kB
                    
Downloaded from central: https://repo.maven.apache.org/maven2/org/apache/maven/shared/maven-shared-components/6/maven-shared-components-6.pom (3.1 kB at 282 kB/s)
Downloading from central: https://repo.maven.apache.org/maven2/org/apache/maven/shared/maven-common-artifact-filters/1.1/maven-common-artifact-filters-1.1.jar
Downloading from central: https://repo.maven.apache.org/maven2/org/codehaus/plexus/plexus-archiver/1.0-alpha-12/plexus-archiver-1.0-alpha-12.jar
Downloading from central: https://repo.maven.apache.org/maven2/org/apache/maven/shared/file-management/1.1/file-management-1.1.jar
Downloading from central: https://repo.maven.apache.org/maven2/org/codehaus/plexus/plexus-interpolation/1.7/plexus-interpolation-1.7.jar
Downloading from central: https://repo.maven.apache.org/maven2/org/apache/maven/shared/maven-plugin-testing-harness/1.1/maven-plugin-testing-harness-1.1.jar
Progress (1): 4.1/177 kB
Progress (1): 8.2/177 kB
Progress (1): 12/177 kB 
Progress (1): 16/177 kB
Progress (2): 16/177 kB | 4.1/31 kB
Progress (2): 16/177 kB | 8.2/31 kB
Progress (3): 16/177 kB | 8.2/31 kB | 4.1/51 kB
Progress (4): 16/177 kB | 8.2/31 kB | 4.1/51 kB | 4.1/30 kB
Progress (4): 16/177 kB | 12/31 kB | 4.1/51 kB | 4.1/30 kB 
Progress (4): 16/177 kB | 12/31 kB | 4.1/51 kB | 8.2/30 kB
Progress (4): 16/177 kB | 12/31 kB | 4.1/51 kB | 12/30 kB 
Progress (4): 20/177 kB | 12/31 kB | 4.1/51 kB | 12/30 kB
Progress (4): 20/177 kB | 12/31 kB | 8.2/51 kB | 12/30 kB
Progress (4): 25/177 kB | 12/31 kB | 8.2/51 kB | 12/30 kB
Progress (4): 25/177 kB | 12/31 kB | 8.2/51 kB | 16/30 kB
Progress (5): 25/177 kB | 12/31 kB | 8.2/51 kB | 16/30 kB | 4.1/32 kB
Progress (5): 25/177 kB | 16/31 kB | 8.2/51 kB | 16/30 kB | 4.1/32 kB
Progress (5): 25/177 kB | 16/31 kB | 8.2/51 kB | 16/30 kB | 8.2/32 kB
Progress (5): 25/177 kB | 16/31 kB | 8.2/51 kB | 20/30 kB | 8.2/32 kB
Progress (5): 29/177 kB | 16/31 kB | 8.2/51 kB | 20/30 kB | 8.2/32 kB
Progress (5): 29/177 kB | 20/31 kB | 8.2/51 kB | 20/30 kB | 8.2/32 kB
Progress (5): 29/177 kB | 20/31 kB | 12/51 kB | 20/30 kB | 8.2/32 kB 
Progress (5): 29/177 kB | 25/31 kB | 12/51 kB | 20/30 kB | 8.2/32 kB
Progress (5): 33/177 kB | 25/31 kB | 12/51 kB | 20/30 kB | 8.2/32 kB
Progress (5): 33/177 kB | 25/31 kB | 12/51 kB | 25/30 kB | 8.2/32 kB
Progress (5): 33/177 kB | 25/31 kB | 12/51 kB | 25/30 kB | 12/32 kB 
Progress (5): 33/177 kB | 25/31 kB | 12/51 kB | 29/30 kB | 12/32 kB
Progress (5): 33/177 kB | 29/31 kB | 12/51 kB | 29/30 kB | 12/32 kB
Progress (5): 33/177 kB | 29/31 kB | 16/51 kB | 29/30 kB | 12/32 kB
Progress (5): 33/177 kB | 31 kB | 16/51 kB | 29/30 kB | 12/32 kB   
Progress (5): 33/177 kB | 31 kB | 16/51 kB | 30 kB | 12/32 kB   
Progress (5): 37/177 kB | 31 kB | 16/51 kB | 30 kB | 12/32 kB
Progress (5): 37/177 kB | 31 kB | 16/51 kB | 30 kB | 16/32 kB
Progress (5): 37/177 kB | 31 kB | 20/51 kB | 30 kB | 16/32 kB
Progress (5): 41/177 kB | 31 kB | 20/51 kB | 30 kB | 16/32 kB
Progress (5): 41/177 kB | 31 kB | 25/51 kB | 30 kB | 16/32 kB
Progress (5): 45/177 kB | 31 kB | 25/51 kB | 30 kB | 16/32 kB
Progress (5): 45/177 kB | 31 kB | 29/51 kB | 30 kB | 16/32 kB
Progress (5): 49/177 kB | 31 kB | 29/51 kB | 30 kB | 16/32 kB
Progress (5): 49/177 kB | 31 kB | 29/51 kB | 30 kB | 20/32 kB
Progress (5): 49/177 kB | 31 kB | 33/51 kB | 30 kB | 20/32 kB
Progress (5): 49/177 kB | 31 kB | 33/51 kB | 30 kB | 25/32 kB
Progress (5): 49/177 kB | 31 kB | 33/51 kB | 30 kB | 29/32 kB
Progress (5): 53/177 kB | 31 kB | 33/51 kB | 30 kB | 29/32 kB
Progress (5): 53/177 kB | 31 kB | 33/51 kB | 30 kB | 32 kB   
Progress (5): 57/177 kB | 31 kB | 33/51 kB | 30 kB | 32 kB
Progress (5): 57/177 kB | 31 kB | 37/51 kB | 30 kB | 32 kB
Progress (5): 61/177 kB | 31 kB | 37/51 kB | 30 kB | 32 kB
Progress (5): 61/177 kB | 31 kB | 41/51 kB | 30 kB | 32 kB
Progress (5): 66/177 kB | 31 kB | 41/51 kB | 30 kB | 32 kB
Progress (5): 66/177 kB | 31 kB | 45/51 kB | 30 kB | 32 kB
Progress (5): 66/177 kB | 31 kB | 49/51 kB | 30 kB | 32 kB
                                                          
Downloaded from central: https://repo.maven.apache.org/maven2/org/apache/maven/shared/file-management/1.1/file-management-1.1.jar (31 kB at 1.7 MB/s)
Progress (4): 70/177 kB | 49/51 kB | 30 kB | 32 kB
Progress (4): 70/177 kB | 51 kB | 30 kB | 32 kB   
                                               
Downloaded from central: https://repo.maven.apache.org/maven2/org/apache/maven/shared/maven-common-artifact-filters/1.1/maven-common-artifact-filters-1.1.jar (30 kB at 1.5 MB/s)
Progress (3): 74/177 kB | 51 kB | 32 kB
                                       
Downloading from central: https://repo.maven.apache.org/maven2/org/apache/maven/shared/maven-shared-io/1.1/maven-shared-io-1.1.jar
Progress (3): 78/177 kB | 51 kB | 32 kB
                                       
Downloading from central: https://repo.maven.apache.org/maven2/org/apache/maven/maven-artifact-manager/2.0.2/maven-artifact-manager-2.0.2.jar
Downloaded from central: https://repo.maven.apache.org/maven2/org/apache/maven/shared/maven-plugin-testing-harness/1.1/maven-plugin-testing-harness-1.1.jar (32 kB at 1.5 MB/s)
Progress (2): 82/177 kB | 51 kB
                               
Downloading from central: https://repo.maven.apache.org/maven2/org/apache/maven/maven-repository-metadata/2.0.2/maven-repository-metadata-2.0.2.jar
Progress (2): 86/177 kB | 51 kB
Progress (2): 90/177 kB | 51 kB
Progress (2): 94/177 kB | 51 kB
Progress (2): 98/177 kB | 51 kB
                               
Downloaded from central: https://repo.maven.apache.org/maven2/org/codehaus/plexus/plexus-interpolation/1.7/plexus-interpolation-1.7.jar (51 kB at 2.1 MB/s)
Progress (1): 102/177 kB
                        
Downloading from central: https://repo.maven.apache.org/maven2/org/apache/maven/wagon/wagon-provider-api/1.0-alpha-6/wagon-provider-api-1.0-alpha-6.jar
Progress (2): 102/177 kB | 4.1/39 kB
Progress (2): 106/177 kB | 4.1/39 kB
Progress (2): 106/177 kB | 8.2/39 kB
Progress (2): 111/177 kB | 8.2/39 kB
Progress (3): 111/177 kB | 8.2/39 kB | 4.1/49 kB
Progress (3): 111/177 kB | 12/39 kB | 4.1/49 kB 
Progress (3): 111/177 kB | 12/39 kB | 8.2/49 kB
Progress (3): 115/177 kB | 12/39 kB | 8.2/49 kB
Progress (3): 115/177 kB | 12/39 kB | 12/49 kB 
Progress (3): 115/177 kB | 16/39 kB | 12/49 kB
Progress (4): 115/177 kB | 16/39 kB | 12/49 kB | 4.1/20 kB
Progress (4): 115/177 kB | 16/39 kB | 16/49 kB | 4.1/20 kB
Progress (4): 115/177 kB | 16/39 kB | 16/49 kB | 8.2/20 kB
Progress (4): 119/177 kB | 16/39 kB | 16/49 kB | 8.2/20 kB
Progress (4): 119/177 kB | 20/39 kB | 16/49 kB | 8.2/20 kB
Progress (4): 119/177 kB | 20/39 kB | 16/49 kB | 12/20 kB 
Progress (4): 119/177 kB | 25/39 kB | 16/49 kB | 12/20 kB
Progress (4): 123/177 kB | 25/39 kB | 16/49 kB | 12/20 kB
Progress (4): 123/177 kB | 25/39 kB | 20/49 kB | 12/20 kB
Progress (4): 123/177 kB | 29/39 kB | 20/49 kB | 12/20 kB
Progress (4): 123/177 kB | 29/39 kB | 20/49 kB | 16/20 kB
Progress (4): 123/177 kB | 33/39 kB | 20/49 kB | 16/20 kB
Progress (4): 123/177 kB | 33/39 kB | 25/49 kB | 16/20 kB
Progress (4): 127/177 kB | 33/39 kB | 25/49 kB | 16/20 kB
Progress (4): 127/177 kB | 33/39 kB | 29/49 kB | 16/20 kB
Progress (4): 127/177 kB | 37/39 kB | 29/49 kB | 16/20 kB
Progress (5): 127/177 kB | 37/39 kB | 29/49 kB | 16/20 kB | 4.1/43 kB
Progress (5): 127/177 kB | 37/39 kB | 29/49 kB | 20 kB | 4.1/43 kB   
Progress (5): 127/177 kB | 37/39 kB | 29/49 kB | 20 kB | 8.2/43 kB
Progress (5): 127/177 kB | 39 kB | 29/49 kB | 20 kB | 8.2/43 kB   
Progress (5): 127/177 kB | 39 kB | 33/49 kB | 20 kB | 8.2/43 kB
Progress (5): 131/177 kB | 39 kB | 33/49 kB | 20 kB | 8.2/43 kB
Progress (5): 131/177 kB | 39 kB | 33/49 kB | 20 kB | 12/43 kB 
Progress (5): 131/177 kB | 39 kB | 33/49 kB | 20 kB | 16/43 kB
Progress (5): 131/177 kB | 39 kB | 37/49 kB | 20 kB | 16/43 kB
Progress (5): 135/177 kB | 39 kB | 37/49 kB | 20 kB | 16/43 kB
Progress (5): 135/177 kB | 39 kB | 41/49 kB | 20 kB | 16/43 kB
Progress (5): 135/177 kB | 39 kB | 41/49 kB | 20 kB | 20/43 kB
Progress (5): 139/177 kB | 39 kB | 41/49 kB | 20 kB | 20/43 kB
Progress (5): 139/177 kB | 39 kB | 41/49 kB | 20 kB | 25/43 kB
Progress (5): 139/177 kB | 39 kB | 45/49 kB | 20 kB | 25/43 kB
Progress (5): 139/177 kB | 39 kB | 45/49 kB | 20 kB | 29/43 kB
Progress (5): 143/177 kB | 39 kB | 45/49 kB | 20 kB | 29/43 kB
Progress (5): 143/177 kB | 39 kB | 45/49 kB | 20 kB | 33/43 kB
Progress (5): 143/177 kB | 39 kB | 49/49 kB | 20 kB | 33/43 kB
                                                              
Downloaded from central: https://repo.maven.apache.org/maven2/org/apache/maven/maven-repository-metadata/2.0.2/maven-repository-metadata-2.0.2.jar (20 kB at 563 kB/s)
Progress (4): 147/177 kB | 39 kB | 49/49 kB | 33/43 kB
                                                      
Downloading from central: https://repo.maven.apache.org/maven2/org/apache/maven/shared/maven-filtering/1.0-beta-2/maven-filtering-1.0-beta-2.jar
Progress (4): 147/177 kB | 39 kB | 49/49 kB | 37/43 kB
Progress (4): 152/177 kB | 39 kB | 49/49 kB | 37/43 kB
                                                      
Downloaded from central: https://repo.maven.apache.org/maven2/org/apache/maven/shared/maven-shared-io/1.1/maven-shared-io-1.1.jar (39 kB at 1.1 MB/s)
Progress (3): 152/177 kB | 49 kB | 37/43 kB
                                           
Downloading from central: https://repo.maven.apache.org/maven2/org/apache/maven/maven-core/2.0.6/maven-core-2.0.6.jar
Progress (3): 156/177 kB | 49 kB | 37/43 kB
Progress (3): 156/177 kB | 49 kB | 41/43 kB
Progress (3): 160/177 kB | 49 kB | 41/43 kB
Progress (3): 160/177 kB | 49 kB | 43 kB   
Progress (3): 164/177 kB | 49 kB | 43 kB
Progress (3): 168/177 kB | 49 kB | 43 kB
Progress (3): 172/177 kB | 49 kB | 43 kB
Progress (3): 176/177 kB | 49 kB | 43 kB
Progress (3): 177 kB | 49 kB | 43 kB    
Progress (4): 177 kB | 49 kB | 43 kB | 4.1/33 kB
Progress (4): 177 kB | 49 kB | 43 kB | 8.2/33 kB
Progress (4): 177 kB | 49 kB | 43 kB | 12/33 kB 
Progress (4): 177 kB | 49 kB | 43 kB | 16/33 kB
Progress (4): 177 kB | 49 kB | 43 kB | 20/33 kB
Progress (4): 177 kB | 49 kB | 43 kB | 25/33 kB
                                               
Downloaded from central: https://repo.maven.apache.org/maven2/org/apache/maven/maven-artifact-manager/2.0.2/maven-artifact-manager-2.0.2.jar (49 kB at 1.2 MB/s)
Progress (3): 177 kB | 43 kB | 29/33 kB
                                       
Downloading from central: https://repo.maven.apache.org/maven2/org/apache/maven/maven-plugin-parameter-documenter/2.0.6/maven-plugin-parameter-documenter-2.0.6.jar
Progress (4): 177 kB | 43 kB | 29/33 kB | 4.1/152 kB
Progress (4): 177 kB | 43 kB | 33/33 kB | 4.1/152 kB
Progress (4): 177 kB | 43 kB | 33/33 kB | 8.2/152 kB
                                                    
Downloaded from central: https://repo.maven.apache.org/maven2/org/apache/maven/wagon/wagon-provider-api/1.0-alpha-6/wagon-provider-api-1.0-alpha-6.jar (43 kB at 1.0 MB/s)
Progress (3): 177 kB | 33/33 kB | 12/152 kB
Progress (3): 177 kB | 33 kB | 12/152 kB   
Progress (3): 177 kB | 33 kB | 16/152 kB
                                        
Downloading from central: https://repo.maven.apache.org/maven2/org/apache/maven/reporting/maven-reporting-api/2.0.6/maven-reporting-api-2.0.6.jar
Progress (3): 177 kB | 33 kB | 20/152 kB
Progress (3): 177 kB | 33 kB | 25/152 kB
                                        
Downloaded from central: https://repo.maven.apache.org/maven2/org/codehaus/plexus/plexus-archiver/1.0-alpha-12/plexus-archiver-1.0-alpha-12.jar (177 kB at 4.0 MB/s)
Progress (2): 33 kB | 29/152 kB
                               
Downloading from central: https://repo.maven.apache.org/maven2/org/apache/maven/doxia/doxia-sink-api/1.0-alpha-7/doxia-sink-api-1.0-alpha-7.jar
Progress (2): 33 kB | 33/152 kB
Progress (3): 33 kB | 33/152 kB | 4.1/21 kB
Progress (3): 33 kB | 33/152 kB | 8.2/21 kB
Progress (3): 33 kB | 37/152 kB | 8.2/21 kB
Progress (3): 33 kB | 37/152 kB | 12/21 kB 
Progress (3): 33 kB | 41/152 kB | 12/21 kB
Progress (3): 33 kB | 41/152 kB | 16/21 kB
                                          
Downloaded from central: https://repo.maven.apache.org/maven2/org/apache/maven/shared/maven-filtering/1.0-beta-2/maven-filtering-1.0-beta-2.jar (33 kB at 721 kB/s)
Progress (2): 41/152 kB | 20/21 kB
Progress (2): 45/152 kB | 20/21 kB
Progress (2): 45/152 kB | 21 kB   
                               
Downloading from central: https://repo.maven.apache.org/maven2/org/apache/maven/maven-error-diagnostics/2.0.6/maven-error-diagnostics-2.0.6.jar
Progress (2): 49/152 kB | 21 kB
Progress (2): 53/152 kB | 21 kB
Progress (2): 57/152 kB | 21 kB
Progress (2): 61/152 kB | 21 kB
Progress (2): 66/152 kB | 21 kB
Progress (3): 66/152 kB | 21 kB | 4.1/5.9 kB
Progress (3): 66/152 kB | 21 kB | 5.9 kB    
Progress (3): 70/152 kB | 21 kB | 5.9 kB
Progress (4): 70/152 kB | 21 kB | 5.9 kB | 4.1/9.9 kB
Progress (4): 74/152 kB | 21 kB | 5.9 kB | 4.1/9.9 kB
Progress (4): 74/152 kB | 21 kB | 5.9 kB | 8.2/9.9 kB
Progress (4): 78/152 kB | 21 kB | 5.9 kB | 8.2/9.9 kB
Progress (4): 78/152 kB | 21 kB | 5.9 kB | 9.9 kB    
Progress (4): 82/152 kB | 21 kB | 5.9 kB | 9.9 kB
                                                 
Downloaded from central: https://repo.maven.apache.org/maven2/org/apache/maven/maven-plugin-parameter-documenter/2.0.6/maven-plugin-parameter-documenter-2.0.6.jar (21 kB at 415 kB/s)
Progress (4): 82/152 kB | 5.9 kB | 9.9 kB | 4.1/14 kB
Progress (4): 86/152 kB | 5.9 kB | 9.9 kB | 4.1/14 kB
Progress (4): 86/152 kB | 5.9 kB | 9.9 kB | 8.2/14 kB
                                                     
Downloading from central: https://repo.maven.apache.org/maven2/org/apache/maven/maven-plugin-descriptor/2.0.6/maven-plugin-descriptor-2.0.6.jar
Progress (4): 86/152 kB | 5.9 kB | 9.9 kB | 12/14 kB
Progress (4): 90/152 kB | 5.9 kB | 9.9 kB | 12/14 kB
Progress (4): 90/152 kB | 5.9 kB | 9.9 kB | 14 kB   
Progress (4): 94/152 kB | 5.9 kB | 9.9 kB | 14 kB
Progress (4): 98/152 kB | 5.9 kB | 9.9 kB | 14 kB
                                                 
Downloaded from central: https://repo.maven.apache.org/maven2/org/apache/maven/doxia/doxia-sink-api/1.0-alpha-7/doxia-sink-api-1.0-alpha-7.jar (5.9 kB at 116 kB/s)
Progress (3): 102/152 kB | 9.9 kB | 14 kB
                                         
Downloaded from central: https://repo.maven.apache.org/maven2/org/apache/maven/reporting/maven-reporting-api/2.0.6/maven-reporting-api-2.0.6.jar (9.9 kB at 191 kB/s)
Progress (2): 106/152 kB | 14 kB
                                
Downloading from central: https://repo.maven.apache.org/maven2/org/apache/maven/maven-monitor/2.0.6/maven-monitor-2.0.6.jar
Progress (2): 111/152 kB | 14 kB
                                
Downloading from central: https://repo.maven.apache.org/maven2/org/apache/maven/maven-settings/2.0.6/maven-settings-2.0.6.jar
Progress (2): 115/152 kB | 14 kB
Progress (2): 119/152 kB | 14 kB
Progress (2): 123/152 kB | 14 kB
Progress (2): 127/152 kB | 14 kB
Progress (2): 131/152 kB | 14 kB
Progress (3): 131/152 kB | 14 kB | 4.1/37 kB
                                            
Downloaded from central: https://repo.maven.apache.org/maven2/org/apache/maven/maven-error-diagnostics/2.0.6/maven-error-diagnostics-2.0.6.jar (14 kB at 247 kB/s)
Progress (2): 135/152 kB | 4.1/37 kB
                                    
Downloading from central: https://repo.maven.apache.org/maven2/org/codehaus/plexus/plexus-active-collections/1.0-beta-2/plexus-active-collections-1.0-beta-2.jar
Progress (2): 135/152 kB | 8.2/37 kB
Progress (3): 135/152 kB | 8.2/37 kB | 4.1/10 kB
Progress (3): 139/152 kB | 8.2/37 kB | 4.1/10 kB
Progress (3): 139/152 kB | 12/37 kB | 4.1/10 kB 
Progress (3): 143/152 kB | 12/37 kB | 4.1/10 kB
Progress (3): 143/152 kB | 12/37 kB | 8.2/10 kB
Progress (4): 143/152 kB | 12/37 kB | 8.2/10 kB | 4.1/49 kB
Progress (4): 143/152 kB | 12/37 kB | 10 kB | 4.1/49 kB    
Progress (4): 147/152 kB | 12/37 kB | 10 kB | 4.1/49 kB
Progress (4): 147/152 kB | 16/37 kB | 10 kB | 4.1/49 kB
Progress (4): 147/152 kB | 16/37 kB | 10 kB | 8.2/49 kB
Progress (4): 152/152 kB | 16/37 kB | 10 kB | 8.2/49 kB
Progress (4): 152/152 kB | 16/37 kB | 10 kB | 12/49 kB 
Progress (4): 152 kB | 16/37 kB | 10 kB | 12/49 kB    
Progress (4): 152 kB | 16/37 kB | 10 kB | 16/49 kB
Progress (4): 152 kB | 20/37 kB | 10 kB | 16/49 kB
Progress (4): 152 kB | 25/37 kB | 10 kB | 16/49 kB
Progress (4): 152 kB | 29/37 kB | 10 kB | 16/49 kB
Progress (4): 152 kB | 33/37 kB | 10 kB | 16/49 kB
Progress (4): 152 kB | 33/37 kB | 10 kB | 20/49 kB
Progress (4): 152 kB | 33/37 kB | 10 kB | 25/49 kB
Progress (4): 152 kB | 37/37 kB | 10 kB | 25/49 kB
Progress (4): 152 kB | 37/37 kB | 10 kB | 29/49 kB
Progress (4): 152 kB | 37 kB | 10 kB | 29/49 kB   
Progress (4): 152 kB | 37 kB | 10 kB | 33/49 kB
Progress (4): 152 kB | 37 kB | 10 kB | 37/49 kB
Progress (4): 152 kB | 37 kB | 10 kB | 41/49 kB
Progress (4): 152 kB | 37 kB | 10 kB | 45/49 kB
                                               
Downloaded from central: https://repo.maven.apache.org/maven2/org/apache/maven/maven-monitor/2.0.6/maven-monitor-2.0.6.jar (10 kB at 168 kB/s)
Progress (4): 152 kB | 37 kB | 45/49 kB | 4.1/21 kB
Progress (4): 152 kB | 37 kB | 49 kB | 4.1/21 kB   
Progress (4): 152 kB | 37 kB | 49 kB | 8.2/21 kB
                                                
Downloaded from central: https://repo.maven.apache.org/maven2/org/apache/maven/maven-core/2.0.6/maven-core-2.0.6.jar (152 kB at 2.4 MB/s)
Downloading from central: https://repo.maven.apache.org/maven2/org/codehaus/plexus/plexus-io/1.0-alpha-4/plexus-io-1.0-alpha-4.jar
Downloading from central: https://repo.maven.apache.org/maven2/org/apache/maven/maven-plugin-api/2.0.4/maven-plugin-api-2.0.4.jar
Progress (3): 37 kB | 49 kB | 12/21 kB
Progress (3): 37 kB | 49 kB | 16/21 kB
Progress (3): 37 kB | 49 kB | 20/21 kB
Progress (3): 37 kB | 49 kB | 21 kB   
                                   
Downloaded from central: https://repo.maven.apache.org/maven2/org/apache/maven/maven-plugin-descriptor/2.0.6/maven-plugin-descriptor-2.0.6.jar (37 kB at 567 kB/s)
Downloading from central: https://repo.maven.apache.org/maven2/org/apache/maven/maven-project/2.0.4/maven-project-2.0.4.jar
Downloaded from central: https://repo.maven.apache.org/maven2/org/apache/maven/maven-settings/2.0.6/maven-settings-2.0.6.jar (49 kB at 755 kB/s)
Downloading from central: https://repo.maven.apache.org/maven2/org/apache/maven/maven-profile/2.0.4/maven-profile-2.0.4.jar
Downloaded from central: https://repo.maven.apache.org/maven2/org/codehaus/plexus/plexus-active-collections/1.0-beta-2/plexus-active-collections-1.0-beta-2.jar (21 kB at 314 kB/s)
Progress (1): 4.1/8.3 kB
Progress (2): 4.1/8.3 kB | 4.1/48 kB
Progress (2): 8.2/8.3 kB | 4.1/48 kB
                                    
Downloading from central: https://repo.maven.apache.org/maven2/org/apache/maven/maven-archiver/2.4/maven-archiver-2.4.jar
Progress (2): 8.2/8.3 kB | 8.2/48 kB
Progress (2): 8.3 kB | 8.2/48 kB    
Progress (2): 8.3 kB | 12/48 kB 
Progress (2): 8.3 kB | 16/48 kB
Progress (2): 8.3 kB | 20/48 kB
Progress (2): 8.3 kB | 25/48 kB
Progress (2): 8.3 kB | 29/48 kB
Progress (2): 8.3 kB | 33/48 kB
Progress (2): 8.3 kB | 37/48 kB
Progress (2): 8.3 kB | 41/48 kB
Progress (2): 8.3 kB | 45/48 kB
Progress (3): 8.3 kB | 45/48 kB | 4.1/109 kB
Progress (3): 8.3 kB | 48 kB | 4.1/109 kB   
Progress (3): 8.3 kB | 48 kB | 8.2/109 kB
Progress (3): 8.3 kB | 48 kB | 12/109 kB 
Progress (3): 8.3 kB | 48 kB | 16/109 kB
Progress (3): 8.3 kB | 48 kB | 20/109 kB
Progress (3): 8.3 kB | 48 kB | 25/109 kB
Progress (3): 8.3 kB | 48 kB | 29/109 kB
Progress (3): 8.3 kB | 48 kB | 33/109 kB
Progress (4): 8.3 kB | 48 kB | 33/109 kB | 4.1/20 kB
Progress (5): 8.3 kB | 48 kB | 33/109 kB | 4.1/20 kB | 4.1/30 kB
Progress (5): 8.3 kB | 48 kB | 33/109 kB | 8.2/20 kB | 4.1/30 kB
Progress (5): 8.3 kB | 48 kB | 33/109 kB | 8.2/20 kB | 8.2/30 kB
Progress (5): 8.3 kB | 48 kB | 37/109 kB | 8.2/20 kB | 8.2/30 kB
Progress (5): 8.3 kB | 48 kB | 37/109 kB | 12/20 kB | 8.2/30 kB 
Progress (5): 8.3 kB | 48 kB | 41/109 kB | 12/20 kB | 8.2/30 kB
Progress (5): 8.3 kB | 48 kB | 41/109 kB | 12/20 kB | 12/30 kB 
Progress (5): 8.3 kB | 48 kB | 45/109 kB | 12/20 kB | 12/30 kB
Progress (5): 8.3 kB | 48 kB | 45/109 kB | 16/20 kB | 12/30 kB
Progress (5): 8.3 kB | 48 kB | 49/109 kB | 16/20 kB | 12/30 kB
Progress (5): 8.3 kB | 48 kB | 49/109 kB | 16/20 kB | 16/30 kB
Progress (5): 8.3 kB | 48 kB | 49/109 kB | 20 kB | 16/30 kB   
                                                           
Downloaded from central: https://repo.maven.apache.org/maven2/org/codehaus/plexus/plexus-io/1.0-alpha-4/plexus-io-1.0-alpha-4.jar (48 kB at 645 kB/s)
Progress (4): 8.3 kB | 49/109 kB | 20 kB | 20/30 kB
Progress (4): 8.3 kB | 53/109 kB | 20 kB | 20/30 kB
Progress (4): 8.3 kB | 53/109 kB | 20 kB | 25/30 kB
                                                   
Downloading from central: https://repo.maven.apache.org/maven2/org/codehaus/plexus/plexus-utils/2.0.1/plexus-utils-2.0.1.jar
Progress (4): 8.3 kB | 53/109 kB | 20 kB | 29/30 kB
Progress (4): 8.3 kB | 57/109 kB | 20 kB | 29/30 kB
Progress (4): 8.3 kB | 57/109 kB | 20 kB | 30 kB   
Progress (4): 8.3 kB | 61/109 kB | 20 kB | 30 kB
                                                
Downloaded from central: https://repo.maven.apache.org/maven2/org/apache/maven/maven-plugin-api/2.0.4/maven-plugin-api-2.0.4.jar (8.3 kB at 108 kB/s)
Progress (3): 66/109 kB | 20 kB | 30 kB
                                       
Downloading from central: https://repo.maven.apache.org/maven2/org/apache/maven/maven-artifact/2.0.4/maven-artifact-2.0.4.jar
Progress (3): 70/109 kB | 20 kB | 30 kB
                                       
Downloaded from central: https://repo.maven.apache.org/maven2/org/apache/maven/maven-archiver/2.4/maven-archiver-2.4.jar (20 kB at 252 kB/s)
Progress (2): 74/109 kB | 30 kB
                               
Downloading from central: https://repo.maven.apache.org/maven2/org/apache/maven/maven-model/2.0.4/maven-model-2.0.4.jar
Progress (2): 78/109 kB | 30 kB
Progress (2): 82/109 kB | 30 kB
Progress (2): 86/109 kB | 30 kB
Progress (2): 90/109 kB | 30 kB
Progress (2): 94/109 kB | 30 kB
Progress (2): 98/109 kB | 30 kB
Progress (2): 102/109 kB | 30 kB
Progress (2): 106/109 kB | 30 kB
Progress (2): 109 kB | 30 kB    
                            
Downloaded from central: https://repo.maven.apache.org/maven2/org/apache/maven/maven-profile/2.0.4/maven-profile-2.0.4.jar (30 kB at 373 kB/s)
Downloading from central: https://repo.maven.apache.org/maven2/org/apache/maven/shared/maven-repository-builder/1.0-alpha-2/maven-repository-builder-1.0-alpha-2.jar
Progress (2): 109 kB | 4.1/80 kB
Progress (2): 109 kB | 8.2/80 kB
Progress (2): 109 kB | 12/80 kB 
Progress (2): 109 kB | 16/80 kB
Progress (3): 109 kB | 16/80 kB | 4.1/222 kB
Progress (3): 109 kB | 16/80 kB | 8.2/222 kB
Progress (3): 109 kB | 16/80 kB | 12/222 kB 
Progress (3): 109 kB | 16/80 kB | 16/222 kB
Progress (3): 109 kB | 20/80 kB | 16/222 kB
Progress (3): 109 kB | 25/80 kB | 16/222 kB
Progress (3): 109 kB | 29/80 kB | 16/222 kB
Progress (3): 109 kB | 29/80 kB | 20/222 kB
Progress (3): 109 kB | 33/80 kB | 20/222 kB
                                           
Downloaded from central: https://repo.maven.apache.org/maven2/org/apache/maven/maven-project/2.0.4/maven-project-2.0.4.jar (109 kB at 1.3 MB/s)
Progress (3): 33/80 kB | 20/222 kB | 4.1/80 kB
Progress (3): 33/80 kB | 25/222 kB | 4.1/80 kB
Progress (3): 33/80 kB | 25/222 kB | 8.2/80 kB
Progress (3): 33/80 kB | 29/222 kB | 8.2/80 kB
Progress (3): 37/80 kB | 29/222 kB | 8.2/80 kB
Progress (3): 37/80 kB | 29/222 kB | 12/80 kB 
Progress (3): 41/80 kB | 29/222 kB | 12/80 kB
Progress (3): 41/80 kB | 33/222 kB | 12/80 kB
Progress (3): 45/80 kB | 33/222 kB | 12/80 kB
Progress (3): 45/80 kB | 33/222 kB | 16/80 kB
Progress (3): 49/80 kB | 33/222 kB | 16/80 kB
Progress (3): 49/80 kB | 37/222 kB | 16/80 kB
Progress (3): 49/80 kB | 41/222 kB | 16/80 kB
Progress (3): 49/80 kB | 41/222 kB | 20/80 kB
Progress (3): 49/80 kB | 45/222 kB | 20/80 kB
Progress (3): 53/80 kB | 45/222 kB | 20/80 kB
Progress (3): 53/80 kB | 45/222 kB | 25/80 kB
Progress (3): 57/80 kB | 45/222 kB | 25/80 kB
Progress (4): 57/80 kB | 45/222 kB | 25/80 kB | 4.1/23 kB
Progress (4): 57/80 kB | 49/222 kB | 25/80 kB | 4.1/23 kB
Progress (4): 57/80 kB | 49/222 kB | 25/80 kB | 8.2/23 kB
Progress (4): 61/80 kB | 49/222 kB | 25/80 kB | 8.2/23 kB
Progress (4): 61/80 kB | 49/222 kB | 29/80 kB | 8.2/23 kB
Progress (4): 66/80 kB | 49/222 kB | 29/80 kB | 8.2/23 kB
Progress (4): 66/80 kB | 49/222 kB | 29/80 kB | 12/23 kB 
Progress (4): 66/80 kB | 53/222 kB | 29/80 kB | 12/23 kB
Progress (4): 66/80 kB | 53/222 kB | 33/80 kB | 12/23 kB
Progress (4): 66/80 kB | 57/222 kB | 33/80 kB | 12/23 kB
Progress (4): 66/80 kB | 57/222 kB | 33/80 kB | 16/23 kB
Progress (4): 70/80 kB | 57/222 kB | 33/80 kB | 16/23 kB
Progress (4): 70/80 kB | 61/222 kB | 33/80 kB | 16/23 kB
Progress (4): 70/80 kB | 61/222 kB | 33/80 kB | 20/23 kB
Progress (4): 74/80 kB | 61/222 kB | 33/80 kB | 20/23 kB
Progress (4): 74/80 kB | 61/222 kB | 33/80 kB | 23 kB   
Progress (4): 74/80 kB | 66/222 kB | 33/80 kB | 23 kB
Progress (4): 74/80 kB | 66/222 kB | 37/80 kB | 23 kB
Progress (4): 78/80 kB | 66/222 kB | 37/80 kB | 23 kB
Progress (4): 78/80 kB | 66/222 kB | 41/80 kB | 23 kB
Progress (4): 80 kB | 66/222 kB | 41/80 kB | 23 kB   
Progress (4): 80 kB | 70/222 kB | 41/80 kB | 23 kB
Progress (4): 80 kB | 70/222 kB | 45/80 kB | 23 kB
Progress (4): 80 kB | 74/222 kB | 45/80 kB | 23 kB
Progress (4): 80 kB | 74/222 kB | 49/80 kB | 23 kB
Progress (4): 80 kB | 78/222 kB | 49/80 kB | 23 kB
Progress (4): 80 kB | 82/222 kB | 49/80 kB | 23 kB
Progress (4): 80 kB | 82/222 kB | 53/80 kB | 23 kB
Progress (4): 80 kB | 82/222 kB | 57/80 kB | 23 kB
Progress (4): 80 kB | 86/222 kB | 57/80 kB | 23 kB
Progress (4): 80 kB | 86/222 kB | 61/80 kB | 23 kB
Progress (4): 80 kB | 90/222 kB | 61/80 kB | 23 kB
Progress (4): 80 kB | 90/222 kB | 66/80 kB | 23 kB
Progress (4): 80 kB | 94/222 kB | 66/80 kB | 23 kB
Progress (4): 80 kB | 98/222 kB | 66/80 kB | 23 kB
Progress (4): 80 kB | 98/222 kB | 70/80 kB | 23 kB
                                                  
Downloaded from central: https://repo.maven.apache.org/maven2/org/apache/maven/shared/maven-repository-builder/1.0-alpha-2/maven-repository-builder-1.0-alpha-2.jar (23 kB at 246 kB/s)
Progress (3): 80 kB | 102/222 kB | 70/80 kB
Progress (3): 80 kB | 102/222 kB | 74/80 kB
Progress (3): 80 kB | 106/222 kB | 74/80 kB
Progress (3): 80 kB | 106/222 kB | 78/80 kB
Progress (3): 80 kB | 111/222 kB | 78/80 kB
Progress (3): 80 kB | 111/222 kB | 80 kB   
Progress (3): 80 kB | 115/222 kB | 80 kB
                                        
Downloaded from central: https://repo.maven.apache.org/maven2/org/apache/maven/maven-artifact/2.0.4/maven-artifact-2.0.4.jar (80 kB at 845 kB/s)
Progress (2): 119/222 kB | 80 kB
Progress (2): 123/222 kB | 80 kB
Progress (2): 127/222 kB | 80 kB
Progress (2): 131/222 kB | 80 kB
Progress (2): 135/222 kB | 80 kB
Progress (2): 139/222 kB | 80 kB
Progress (2): 143/222 kB | 80 kB
Progress (2): 147/222 kB | 80 kB
Progress (2): 152/222 kB | 80 kB
Progress (2): 156/222 kB | 80 kB
Progress (2): 160/222 kB | 80 kB
Progress (2): 164/222 kB | 80 kB
                                
Downloaded from central: https://repo.maven.apache.org/maven2/org/apache/maven/maven-model/2.0.4/maven-model-2.0.4.jar (80 kB at 810 kB/s)
Progress (1): 168/222 kB
Progress (1): 172/222 kB
Progress (1): 176/222 kB
Progress (1): 180/222 kB
Progress (1): 184/222 kB
Progress (1): 188/222 kB
Progress (1): 193/222 kB
Progress (1): 197/222 kB
Progress (1): 201/222 kB
Progress (1): 205/222 kB
Progress (1): 209/222 kB
Progress (1): 213/222 kB
Progress (1): 217/222 kB
Progress (1): 221/222 kB
Progress (1): 222 kB    
                    
Downloaded from central: https://repo.maven.apache.org/maven2/org/codehaus/plexus/plexus-utils/2.0.1/plexus-utils-2.0.1.jar (222 kB at 2.1 MB/s)
[INFO] Reading assembly descriptor: src/main/assembly/assembly.xml
[INFO] Building tar : /tmp/mangoTestD0h5221/deleteMePleaseThisIsNoLongerNeeded/mango-distribution/target/mango-distribution-spark3_2.12-0.0.6-SNAPSHOT-bin.tar.gz
[WARNING] Entry: mango-distribution-spark3_2.12-0.0.6-SNAPSHOT/repo/mango-assembly-spark3_2.12-0.0.6-SNAPSHOT-sources.jar longer than 100 characters.
[WARNING] Resulting tar file can only be processed successfully by GNU compatible tar commands
[WARNING] Entry: mango-distribution-spark3_2.12-0.0.6-SNAPSHOT/repo/mango-assembly-spark3_2.12-0.0.6-SNAPSHOT-javadoc.jar longer than 100 characters.
[INFO] Building tar : /tmp/mangoTestD0h5221/deleteMePleaseThisIsNoLongerNeeded/mango-distribution/target/mango-distribution-spark3_2.12-0.0.6-SNAPSHOT-bin.tar.bz2
[WARNING] Entry: mango-distribution-spark3_2.12-0.0.6-SNAPSHOT/repo/mango-assembly-spark3_2.12-0.0.6-SNAPSHOT-sources.jar longer than 100 characters.
[WARNING] Resulting tar file can only be processed successfully by GNU compatible tar commands
[WARNING] Entry: mango-distribution-spark3_2.12-0.0.6-SNAPSHOT/repo/mango-assembly-spark3_2.12-0.0.6-SNAPSHOT-javadoc.jar longer than 100 characters.
[INFO] Building zip: /tmp/mangoTestD0h5221/deleteMePleaseThisIsNoLongerNeeded/mango-distribution/target/mango-distribution-spark3_2.12-0.0.6-SNAPSHOT-bin.zip
[INFO] 
[INFO] -----------< org.bdgenomics.mango:mango-parent-spark3_2.12 >------------
[INFO] Building mango_2.12 0.0.6-SNAPSHOT                                 [5/5]
[INFO] --------------------------------[ pom ]---------------------------------
[INFO] 
[INFO] --- maven-enforcer-plugin:1.0:enforce (enforce-versions) @ mango-parent-spark3_2.12 ---
[INFO] 
[INFO] --- maven-enforcer-plugin:1.0:enforce (enforce-maven) @ mango-parent-spark3_2.12 ---
[INFO] 
[INFO] --- scalariform-maven-plugin:0.1.4:format (default) @ mango-parent-spark3_2.12 ---
[INFO] Modified 0 of 41 .scala files
[INFO] 
[INFO] --- scala-maven-plugin:3.2.2:compile (scala-compile-first) @ mango-parent-spark3_2.12 ---
[INFO] No sources to compile
[INFO] 
[INFO] --- scala-maven-plugin:3.2.2:testCompile (scala-test-compile-first) @ mango-parent-spark3_2.12 ---
[INFO] No sources to compile
[INFO] 
[INFO] --- maven-source-plugin:3.0.1:jar-no-fork (attach-sources) @ mango-parent-spark3_2.12 ---
[INFO] 
[INFO] --- maven-javadoc-plugin:3.1.0:jar (attach-javadocs) @ mango-parent-spark3_2.12 ---
[INFO] 
[INFO] >>> scala-maven-plugin:3.2.2:doc-jar (attach-scaladocs) > generate-sources @ mango-parent-spark3_2.12 >>>
[INFO] 
[INFO] --- maven-enforcer-plugin:1.0:enforce (enforce-versions) @ mango-parent-spark3_2.12 ---
[INFO] 
[INFO] --- maven-enforcer-plugin:1.0:enforce (enforce-maven) @ mango-parent-spark3_2.12 ---
[INFO] 
[INFO] <<< scala-maven-plugin:3.2.2:doc-jar (attach-scaladocs) < generate-sources @ mango-parent-spark3_2.12 <<<
[INFO] 
[INFO] 
[INFO] --- scala-maven-plugin:3.2.2:doc-jar (attach-scaladocs) @ mango-parent-spark3_2.12 ---
[INFO] No source files found
[INFO] ------------------------------------------------------------------------
[INFO] Reactor Summary for mango_2.12 0.0.6-SNAPSHOT:
[INFO] 
[INFO] mango_2.12: CORE ................................... SUCCESS [ 22.654 s]
[INFO] mango_2.12: CLI .................................... SUCCESS [ 28.486 s]
[INFO] Mango_2.12: Assembly ............................... SUCCESS [ 21.358 s]
[INFO] mango_2.12: Distribution ........................... SUCCESS [ 45.734 s]
[INFO] mango_2.12 ......................................... SUCCESS [  0.908 s]
[INFO] ------------------------------------------------------------------------
[INFO] BUILD SUCCESS
[INFO] ------------------------------------------------------------------------
[INFO] Total time:  01:59 min
[INFO] Finished at: 2020-08-19T03:16:53Z
[INFO] ------------------------------------------------------------------------

# make sure that the distribution package contains an assembly jar
# if no assembly jar is found, this will exit with code 1 and fail the build
tar tzf mango-distribution/target/mango-distribution*-bin.tar.gz | \
    grep mango-assembly | \
    grep jar | \
    grep -v -e sources -e javadoc
+ grep mango-assembly
+ tar tzf mango-distribution/target/mango-distribution-spark3_2.12-0.0.6-SNAPSHOT-bin.tar.gz
+ grep jar
+ grep -v -e sources -e javadoc
mango-distribution-spark3_2.12-0.0.6-SNAPSHOT/repo/mango-assembly-spark3_2.12-0.0.6-SNAPSHOT.jar

# we are done with maven, so clean up the maven temp dir
find ${MANGO_MVN_TMP_DIR}
+ find /tmp/mangoTestMvn2Zakolx
/tmp/mangoTestMvn2Zakolx
/tmp/mangoTestMvn2Zakolx/7735527179336229362
/tmp/mangoTestMvn2Zakolx/7735527179336229362/anoGam1.genome
/tmp/mangoTestMvn2Zakolx/fake-633868526457297270.sh
/tmp/mangoTestMvn2Zakolx/genomes6627617892422212255
/tmp/mangoTestMvn2Zakolx/genomes6627617892422212255/hg19.genome
/tmp/mangoTestMvn2Zakolx/mmbroken8634114747656644265.genome
/tmp/mangoTestMvn2Zakolx/snappy-1.0.5-libsnappyjava.so
/tmp/mangoTestMvn2Zakolx/invalidBuild.genome8538339430562403469
/tmp/mangoTestMvn2Zakolx/invalidBuild.genome8538339430562403469/properties.txt
/tmp/mangoTestMvn2Zakolx/TempSuite3122040104287688178.adam
/tmp/mangoTestMvn2Zakolx/TempSuite3122040104287688178.adam/._SUCCESS.crc
/tmp/mangoTestMvn2Zakolx/TempSuite3122040104287688178.adam/._references.avro.crc
/tmp/mangoTestMvn2Zakolx/TempSuite3122040104287688178.adam/_partitionedByStartPos
/tmp/mangoTestMvn2Zakolx/TempSuite3122040104287688178.adam/referenceName=1
/tmp/mangoTestMvn2Zakolx/TempSuite3122040104287688178.adam/referenceName=1/positionBin=240
/tmp/mangoTestMvn2Zakolx/TempSuite3122040104287688178.adam/referenceName=1/positionBin=240/.part-00000-5c12502f-fd24-4fcf-8e7c-c20c4c3951a7.c000.snappy.parquet.crc
/tmp/mangoTestMvn2Zakolx/TempSuite3122040104287688178.adam/referenceName=1/positionBin=240/part-00000-5c12502f-fd24-4fcf-8e7c-c20c4c3951a7.c000.snappy.parquet
/tmp/mangoTestMvn2Zakolx/TempSuite3122040104287688178.adam/referenceName=1/positionBin=26
/tmp/mangoTestMvn2Zakolx/TempSuite3122040104287688178.adam/referenceName=1/positionBin=26/.part-00000-5c12502f-fd24-4fcf-8e7c-c20c4c3951a7.c000.snappy.parquet.crc
/tmp/mangoTestMvn2Zakolx/TempSuite3122040104287688178.adam/referenceName=1/positionBin=26/part-00000-5c12502f-fd24-4fcf-8e7c-c20c4c3951a7.c000.snappy.parquet
/tmp/mangoTestMvn2Zakolx/TempSuite3122040104287688178.adam/_readGroups.avro
/tmp/mangoTestMvn2Zakolx/TempSuite3122040104287688178.adam/._processingSteps.avro.crc
/tmp/mangoTestMvn2Zakolx/TempSuite3122040104287688178.adam/_processingSteps.avro
/tmp/mangoTestMvn2Zakolx/TempSuite3122040104287688178.adam/referenceName=2
/tmp/mangoTestMvn2Zakolx/TempSuite3122040104287688178.adam/referenceName=2/positionBin=189
/tmp/mangoTestMvn2Zakolx/TempSuite3122040104287688178.adam/referenceName=2/positionBin=189/.part-00000-5c12502f-fd24-4fcf-8e7c-c20c4c3951a7.c000.snappy.parquet.crc
/tmp/mangoTestMvn2Zakolx/TempSuite3122040104287688178.adam/referenceName=2/positionBin=189/part-00000-5c12502f-fd24-4fcf-8e7c-c20c4c3951a7.c000.snappy.parquet
/tmp/mangoTestMvn2Zakolx/TempSuite3122040104287688178.adam/._readGroups.avro.crc
/tmp/mangoTestMvn2Zakolx/TempSuite3122040104287688178.adam/._partitionedByStartPos.crc
/tmp/mangoTestMvn2Zakolx/TempSuite3122040104287688178.adam/_SUCCESS
/tmp/mangoTestMvn2Zakolx/TempSuite3122040104287688178.adam/_references.avro
/tmp/mangoTestMvn2Zakolx/TempSuite4892809485329140850
/tmp/mangoTestMvn2Zakolx/TempSuite3991671049610830636.adam
/tmp/mangoTestMvn2Zakolx/TempSuite3991671049610830636.adam/._SUCCESS.crc
/tmp/mangoTestMvn2Zakolx/TempSuite3991671049610830636.adam/._references.avro.crc
/tmp/mangoTestMvn2Zakolx/TempSuite3991671049610830636.adam/_partitionedByStartPos
/tmp/mangoTestMvn2Zakolx/TempSuite3991671049610830636.adam/referenceName=1
/tmp/mangoTestMvn2Zakolx/TempSuite3991671049610830636.adam/referenceName=1/positionBin=0
/tmp/mangoTestMvn2Zakolx/TempSuite3991671049610830636.adam/referenceName=1/positionBin=0/part-00000-ec206010-8e53-489d-a5cf-1c5a8d2a1007.c000.snappy.parquet
/tmp/mangoTestMvn2Zakolx/TempSuite3991671049610830636.adam/referenceName=1/positionBin=0/.part-00000-ec206010-8e53-489d-a5cf-1c5a8d2a1007.c000.snappy.parquet.crc
/tmp/mangoTestMvn2Zakolx/TempSuite3991671049610830636.adam/_header
/tmp/mangoTestMvn2Zakolx/TempSuite3991671049610830636.adam/._header.crc
/tmp/mangoTestMvn2Zakolx/TempSuite3991671049610830636.adam/._partitionedByStartPos.crc
/tmp/mangoTestMvn2Zakolx/TempSuite3991671049610830636.adam/_SUCCESS
/tmp/mangoTestMvn2Zakolx/TempSuite3991671049610830636.adam/_references.avro
/tmp/mangoTestMvn2Zakolx/TempSuite3991671049610830636.adam/_samples.avro
/tmp/mangoTestMvn2Zakolx/TempSuite3991671049610830636.adam/._samples.avro.crc
/tmp/mangoTestMvn2Zakolx/TempSuite3586849095685378216.adam
/tmp/mangoTestMvn2Zakolx/TempSuite3586849095685378216.adam/._SUCCESS.crc
/tmp/mangoTestMvn2Zakolx/TempSuite3586849095685378216.adam/._references.avro.crc
/tmp/mangoTestMvn2Zakolx/TempSuite3586849095685378216.adam/_partitionedByStartPos
/tmp/mangoTestMvn2Zakolx/TempSuite3586849095685378216.adam/referenceName=1
/tmp/mangoTestMvn2Zakolx/TempSuite3586849095685378216.adam/referenceName=1/positionBin=240
/tmp/mangoTestMvn2Zakolx/TempSuite3586849095685378216.adam/referenceName=1/positionBin=240/part-00000-310ee72f-4b12-4edd-99fc-58a36d269936.c000.snappy.parquet
/tmp/mangoTestMvn2Zakolx/TempSuite3586849095685378216.adam/referenceName=1/positionBin=240/.part-00000-310ee72f-4b12-4edd-99fc-58a36d269936.c000.snappy.parquet.crc
/tmp/mangoTestMvn2Zakolx/TempSuite3586849095685378216.adam/referenceName=1/positionBin=26
/tmp/mangoTestMvn2Zakolx/TempSuite3586849095685378216.adam/referenceName=1/positionBin=26/part-00000-310ee72f-4b12-4edd-99fc-58a36d269936.c000.snappy.parquet
/tmp/mangoTestMvn2Zakolx/TempSuite3586849095685378216.adam/referenceName=1/positionBin=26/.part-00000-310ee72f-4b12-4edd-99fc-58a36d269936.c000.snappy.parquet.crc
/tmp/mangoTestMvn2Zakolx/TempSuite3586849095685378216.adam/_readGroups.avro
/tmp/mangoTestMvn2Zakolx/TempSuite3586849095685378216.adam/._processingSteps.avro.crc
/tmp/mangoTestMvn2Zakolx/TempSuite3586849095685378216.adam/_processingSteps.avro
/tmp/mangoTestMvn2Zakolx/TempSuite3586849095685378216.adam/referenceName=2
/tmp/mangoTestMvn2Zakolx/TempSuite3586849095685378216.adam/referenceName=2/positionBin=189
/tmp/mangoTestMvn2Zakolx/TempSuite3586849095685378216.adam/referenceName=2/positionBin=189/part-00000-310ee72f-4b12-4edd-99fc-58a36d269936.c000.snappy.parquet
/tmp/mangoTestMvn2Zakolx/TempSuite3586849095685378216.adam/referenceName=2/positionBin=189/.part-00000-310ee72f-4b12-4edd-99fc-58a36d269936.c000.snappy.parquet.crc
/tmp/mangoTestMvn2Zakolx/TempSuite3586849095685378216.adam/._readGroups.avro.crc
/tmp/mangoTestMvn2Zakolx/TempSuite3586849095685378216.adam/._partitionedByStartPos.crc
/tmp/mangoTestMvn2Zakolx/TempSuite3586849095685378216.adam/_SUCCESS
/tmp/mangoTestMvn2Zakolx/TempSuite3586849095685378216.adam/_references.avro
/tmp/mangoTestMvn2Zakolx/TempSuite4892809485329140850.adam
/tmp/mangoTestMvn2Zakolx/TempSuite4892809485329140850.adam/._SUCCESS.crc
/tmp/mangoTestMvn2Zakolx/TempSuite4892809485329140850.adam/._references.avro.crc
/tmp/mangoTestMvn2Zakolx/TempSuite4892809485329140850.adam/_partitionedByStartPos
/tmp/mangoTestMvn2Zakolx/TempSuite4892809485329140850.adam/referenceName=1
/tmp/mangoTestMvn2Zakolx/TempSuite4892809485329140850.adam/referenceName=1/positionBin=0
/tmp/mangoTestMvn2Zakolx/TempSuite4892809485329140850.adam/referenceName=1/positionBin=0/.part-00000-71c33889-3741-4b2d-9ff3-5bcfe456f083.c000.snappy.parquet.crc
/tmp/mangoTestMvn2Zakolx/TempSuite4892809485329140850.adam/referenceName=1/positionBin=0/part-00000-71c33889-3741-4b2d-9ff3-5bcfe456f083.c000.snappy.parquet
/tmp/mangoTestMvn2Zakolx/TempSuite4892809485329140850.adam/_header
/tmp/mangoTestMvn2Zakolx/TempSuite4892809485329140850.adam/._header.crc
/tmp/mangoTestMvn2Zakolx/TempSuite4892809485329140850.adam/._partitionedByStartPos.crc
/tmp/mangoTestMvn2Zakolx/TempSuite4892809485329140850.adam/_SUCCESS
/tmp/mangoTestMvn2Zakolx/TempSuite4892809485329140850.adam/_references.avro
/tmp/mangoTestMvn2Zakolx/TempSuite4892809485329140850.adam/_samples.avro
/tmp/mangoTestMvn2Zakolx/TempSuite4892809485329140850.adam/._samples.avro.crc
/tmp/mangoTestMvn2Zakolx/7549301194588957691
/tmp/mangoTestMvn2Zakolx/2286839266842868315
/tmp/mangoTestMvn2Zakolx/2286839266842868315/anoGam1.genome
/tmp/mangoTestMvn2Zakolx/mmbroken6353599970200000543.genome
/tmp/mangoTestMvn2Zakolx/invalidBuild.genome676290607695481564
/tmp/mangoTestMvn2Zakolx/invalidBuild.genome676290607695481564/properties.txt
/tmp/mangoTestMvn2Zakolx/TempSuite3586849095685378216
/tmp/mangoTestMvn2Zakolx/fake-924913531606700481.sh
/tmp/mangoTestMvn2Zakolx/3291034719018856861
/tmp/mangoTestMvn2Zakolx/TempSuite3991671049610830636
/tmp/mangoTestMvn2Zakolx/fake-3916230641423325315.txt
/tmp/mangoTestMvn2Zakolx/TempSuite3122040104287688178
/tmp/mangoTestMvn2Zakolx/fake-7786153776364440434.txt
/tmp/mangoTestMvn2Zakolx/genomes2201670428639652862
/tmp/mangoTestMvn2Zakolx/genomes2201670428639652862/hg19.genome
rm -rf ${MANGO_MVN_TMP_DIR}
+ rm -rf /tmp/mangoTestMvn2Zakolx

find . -name pom.xml \
    -exec sed -i.bak \
    -e "s:sun.io.serialization.extendedDebugInfo=true -Djava.io.tmpdir=${MANGO_MVN_TMP_DIR}:sun.io.serialization.extendedDebugInfo=true:g" \
    {} \;
+ find . -name pom.xml -exec sed -i.bak -e 's:sun.io.serialization.extendedDebugInfo=true -Djava.io.tmpdir=/tmp/mangoTestMvn2Zakolx:sun.io.serialization.extendedDebugInfo=true:g' '{}' ';'
find . -name "*.bak" -exec rm -f {} \;
+ find . -name '*.bak' -exec rm -f '{}' ';'

# set spark artifact string for downloading assembly
SPARK=spark-${SPARK_VERSION}
+ SPARK=spark-2.4.6

# what hadoop version are we on? format string for downloading spark assembly
if [[ $HADOOP_VERSION =~ ^2\.7 ]]; then
    HADOOP=hadoop2.7
else
    echo "Unknown Hadoop version."
    exit 1
fi
+ [[ 2.7.5 =~ ^2\.7 ]]
+ HADOOP=hadoop2.7

# Spark 2.4.3+ and less than 3.0.0 needs special case for Scala 2.12
if [ ${SCALAVER} == 2.12 ] && [ ${SPARK_VERSION} == 2.4.6 ]
then
    curl \
        -L "https://www.apache.org/dyn/mirrors/mirrors.cgi?action=download&filename=spark/${SPARK}/${SPARK}-bin-without-hadoop-scala-2.12.tgz" \
        -o ${MANGO_TMP_DIR}/${SPARK}-bin-without-hadoop-scala-2.12.tgz

    tar xzf ${MANGO_TMP_DIR}/${SPARK}-bin-without-hadoop-scala-2.12.tgz --directory ${MANGO_TMP_DIR}
    export SPARK_HOME=${MANGO_TMP_DIR}/${SPARK}-bin-without-hadoop-scala-2.12

    curl \
        -L "https://www.apache.org/dyn/mirrors/mirrors.cgi?action=download&filename=hadoop/core/hadoop-2.7.7/hadoop-2.7.7.tar.gz" \
        -o ${MANGO_TMP_DIR}/hadoop-2.7.7.tar.gz

    tar xzf ${MANGO_TMP_DIR}/hadoop-2.7.7.tar.gz --directory ${MANGO_TMP_DIR}

    # remove references to avro 1.7.x
    find ${MANGO_TMP_DIR}/hadoop-2.7.7 -name *.jar | grep avro | xargs rm

    export SPARK_DIST_CLASSPATH=$(${MANGO_TMP_DIR}/hadoop-2.7.7/bin/hadoop classpath)
else
    curl \
        -v \
        -L "https://www.apache.org/dyn/mirrors/mirrors.cgi?action=download&filename=spark/${SPARK}/${SPARK}-bin-${HADOOP}.tgz" \
        -o ${MANGO_TMP_DIR}/${SPARK}-bin-${HADOOP}.tgz

    tar xzf ${MANGO_TMP_DIR}/${SPARK}-bin-${HADOOP}.tgz --directory ${MANGO_TMP_DIR}
    export SPARK_HOME=${MANGO_TMP_DIR}/${SPARK}-bin-${HADOOP}
fi
+ '[' 2.12 == 2.12 ']'
+ '[' 2.4.6 == 2.4.6 ']'
+ curl -L 'https://www.apache.org/dyn/mirrors/mirrors.cgi?action=download&filename=spark/spark-2.4.6/spark-2.4.6-bin-without-hadoop-scala-2.12.tgz' -o /tmp/mangoTestD0h5221/deleteMePleaseThisIsNoLongerNeeded/spark-2.4.6-bin-without-hadoop-scala-2.12.tgz
  % Total    % Received % Xferd  Average Speed   Time    Time     Time  Current
                                 Dload  Upload   Total   Spent    Left  Speed

  0     0    0     0    0     0      0      0 --:--:-- --:--:-- --:--:--     0
  0     0    0     0    0     0      0      0 --:--:-- --:--:-- --:--:--     0
  0     0    0     0    0     0      0      0 --:--:-- --:--:-- --:--:--     0

  0  139M    0     0    0     0      0      0 --:--:--  0:00:01 --:--:--     0
  5  139M    5 8479k    0     0  3819k      0  0:00:37  0:00:02  0:00:35 12.7M
 27  139M   27 37.8M    0     0  11.7M      0  0:00:11  0:00:03  0:00:08 22.9M
 52  139M   52 73.7M    0     0  14.5M      0  0:00:09  0:00:05  0:00:04 21.0M
 52  139M   52 73.7M    0     0  12.3M      0  0:00:11  0:00:05  0:00:06 16.8M
 53  139M   53 75.1M    0     0  12.0M      0  0:00:11  0:00:06  0:00:05 16.1M
 82  139M   82  114M    0     0  15.9M      0  0:00:08  0:00:07  0:00:01 21.3M
100  139M  100  139M    0     0  18.1M      0  0:00:07  0:00:07 --:--:-- 22.8M
+ tar xzf /tmp/mangoTestD0h5221/deleteMePleaseThisIsNoLongerNeeded/spark-2.4.6-bin-without-hadoop-scala-2.12.tgz --directory /tmp/mangoTestD0h5221/deleteMePleaseThisIsNoLongerNeeded
+ export SPARK_HOME=/tmp/mangoTestD0h5221/deleteMePleaseThisIsNoLongerNeeded/spark-2.4.6-bin-without-hadoop-scala-2.12
+ SPARK_HOME=/tmp/mangoTestD0h5221/deleteMePleaseThisIsNoLongerNeeded/spark-2.4.6-bin-without-hadoop-scala-2.12
+ curl -L 'https://www.apache.org/dyn/mirrors/mirrors.cgi?action=download&filename=hadoop/core/hadoop-2.7.7/hadoop-2.7.7.tar.gz' -o /tmp/mangoTestD0h5221/deleteMePleaseThisIsNoLongerNeeded/hadoop-2.7.7.tar.gz
  % Total    % Received % Xferd  Average Speed   Time    Time     Time  Current
                                 Dload  Upload   Total   Spent    Left  Speed

  0     0    0     0    0     0      0      0 --:--:-- --:--:-- --:--:--     0
  0     0    0     0    0     0      0      0 --:--:-- --:--:-- --:--:--     0
  0     0    0     0    0     0      0      0 --:--:-- --:--:-- --:--:--     0

  0  208M    0  112k    0     0   108k      0  0:32:43  0:00:01  0:32:42  108k
  0  208M    0  692k    0     0   340k      0  0:10:27  0:00:02  0:10:25  581k
  0  208M    0 1787k    0     0   589k      0  0:06:02  0:00:03  0:05:59  838k
  1  208M    1 4121k    0     0  1023k      0  0:03:28  0:00:04  0:03:24 1340k
  3  208M    3 7323k    0     0  1456k      0  0:02:26  0:00:05  0:02:21 1806k
  5  208M    5 10.7M    0     0  1824k      0  0:01:57  0:00:06  0:01:51 2180k
  6  208M    6 14.0M    0     0  2053k      0  0:01:43  0:00:07  0:01:36 2751k
  8  208M    8 17.5M    0     0  2240k      0  0:01:35  0:00:08  0:01:27 3241k
 10  208M   10 21.1M    0     0  2398k      0  0:01:29  0:00:09  0:01:20 3504k
 11  208M   11 24.8M    0     0  2538k      0  0:01:24  0:00:10  0:01:14 3626k
 13  208M   13 28.6M    0     0  2663k      0  0:01:20  0:00:11  0:01:09 3675k
 15  208M   15 32.6M    0     0  2775k      0  0:01:16  0:00:12  0:01:04 3790k
 17  208M   17 36.5M    0     0  2875k      0  0:01:14  0:00:13  0:01:01 3895k
 19  208M   19 40.7M    0     0  2972k      0  0:01:11  0:00:14  0:00:57 4011k
 21  208M   21 44.5M    0     0  3033k      0  0:01:10  0:00:15  0:00:55 4026k
 22  208M   22 47.8M    0     0  3057k      0  0:01:09  0:00:16  0:00:53 3926k
 24  208M   24 51.2M    0     0  3084k      0  0:01:09  0:00:17  0:00:52 3826k
 26  208M   26 54.4M    0     0  3091k      0  0:01:09  0:00:18  0:00:51 3654k
 27  208M   27 57.0M    0     0  3069k      0  0:01:09  0:00:19  0:00:50 3340k
 28  208M   28 59.4M    0     0  3037k      0  0:01:10  0:00:20  0:00:50 3051k
 28  208M   28 59.6M    0     0  2857k      0  0:01:14  0:00:21  0:00:53 2258k
 28  208M   28 59.6M    0     0  2760k      0  0:01:17  0:00:22  0:00:55 1680k
 28  208M   28 59.6M    0     0  2628k      0  0:01:21  0:00:23  0:00:58 1024k
 28  208M   28 59.6M    0     0  2510k      0  0:01:25  0:00:24  0:01:01  502k
 28  208M   28 59.6M    0     0  2436k      0  0:01:27  0:00:25  0:01:02 40030
 28  208M   28 59.6M    0     0  2334k      0  0:01:31  0:00:26  0:01:05  3925
 28  208M   28 59.6M    0     0  2241k      0  0:01:35  0:00:27  0:01:08  3947
 28  208M   28 59.6M    0     0  2155k      0  0:01:39  0:00:28  0:01:11  3967
 28  208M   28 59.6M    0     0  2101k      0  0:01:41  0:00:29  0:01:12  3967
 28  208M   28 59.6M    0     0  2023k      0  0:01:45  0:00:30  0:01:15  3960
 28  208M   28 59.6M    0     0  1953k      0  0:01:49  0:00:31  0:01:18  3960
 28  208M   28 59.6M    0     0  1887k      0  0:01:53  0:00:32  0:01:21  3959
 28  208M   28 59.6M    0     0  1846k      0  0:01:55  0:00:33  0:01:22  3957
 28  208M   28 59.6M    0     0  1787k      0  0:01:59  0:00:34  0:01:25  3959
 28  208M   28 59.6M    0     0  1732k      0  0:02:03  0:00:35  0:01:28  3982
 28  208M   28 59.6M    0     0  1696k      0  0:02:05  0:00:36  0:01:29  3959
 28  208M   28 59.6M    0     0  1644k      0  0:02:09  0:00:37  0:01:32  3931
 28  208M   28 59.7M    0     0  1598k      0  0:02:13  0:00:38  0:01:35  3935
 28  208M   28 59.7M    0     0  1553k      0  0:02:17  0:00:39  0:01:38  3935
 28  208M   28 59.7M    0     0  1525k      0  0:02:20  0:00:40  0:01:40  3924
 28  208M   28 59.7M    0     0  1485k      0  0:02:23  0:00:41  0:01:42  3948
 28  208M   28 59.7M    0     0  1446k      0  0:02:27  0:00:42  0:01:45  3974
 28  208M   28 59.7M    0     0  1410k      0  0:02:31  0:00:43  0:01:48  3974
 28  208M   28 59.7M    0     0  1387k      0  0:02:33  0:00:44  0:01:49  3974
 28  208M   28 59.7M    0     0  1353k      0  0:02:37  0:00:45  0:01:52  3976
 28  208M   28 59.7M    0     0  1322k      0  0:02:41  0:00:46  0:01:55  3985
 28  208M   28 59.7M    0     0  1292k      0  0:02:45  0:00:47  0:01:58  4003
 28  208M   28 59.7M    0     0  1273k      0  0:02:47  0:00:48  0:01:59  4012
 28  208M   28 59.7M    0     0  1244k      0  0:02:51  0:00:49  0:02:02  3998
 28  208M   28 59.7M    0     0  1217k      0  0:02:55  0:00:50  0:02:05  3996
 28  208M   28 59.7M    0     0  1192k      0  0:02:59  0:00:51  0:02:08  6936
 28  208M   28 59.8M    0     0  1176k      0  0:03:01  0:00:52  0:02:09 30627
 28  208M   28 59.9M    0     0  1157k      0  0:03:04  0:00:53  0:02:11 47760
 28  208M   28 60.1M    0     0  1139k      0  0:03:07  0:00:54  0:02:13 87056
 28  208M   28 60.4M    0     0  1125k      0  0:03:09  0:00:55  0:02:14  156k
 29  208M   29 61.0M    0     0  1116k      0  0:03:11  0:00:56  0:02:15  284k
 29  208M   29 62.1M    0     0  1115k      0  0:03:11  0:00:57  0:02:14  470k
 30  208M   30 64.1M    0     0  1132k      0  0:03:08  0:00:58  0:02:10  862k
 32  208M   32 67.6M    0     0  1173k      0  0:03:02  0:00:59  0:02:03 1534k
 34  208M   34 71.7M    0     0  1224k      0  0:02:54  0:01:00  0:01:54 2325k
 36  208M   36 75.8M    0     0  1272k      0  0:02:47  0:01:01  0:01:46 3029k
 38  208M   38 80.0M    0     0  1321k      0  0:02:41  0:01:02  0:01:39 3668k
 40  208M   40 84.1M    0     0  1367k      0  0:02:36  0:01:03  0:01:33 4095k
 40  208M   40 85.3M    0     0  1359k      0  0:02:37  0:01:04  0:01:33 3451k
 40  208M   40 85.4M    0     0  1344k      0  0:02:38  0:01:05  0:01:33 2767k
 41  208M   41 85.9M    0     0  1333k      0  0:02:40  0:01:06  0:01:34 2067k
 41  208M   41 86.8M    0     0  1326k      0  0:02:41  0:01:07  0:01:34 1386k
 41  208M   41 87.5M    0     0  1318k      0  0:02:42  0:01:08  0:01:34  701k
 43  208M   43 90.4M    0     0  1341k      0  0:02:39  0:01:09  0:01:30 1103k
 45  208M   45 94.5M    0     0  1382k      0  0:02:34  0:01:10  0:01:24 1875k
 47  208M   47 98.6M    0     0  1422k      0  0:02:30  0:01:11  0:01:19 2600k
 49  208M   49  102M    0     0  1461k      0  0:02:26  0:01:12  0:01:14 3285k
 51  208M   51  106M    0     0  1499k      0  0:02:22  0:01:13  0:01:09 3970k
 53  208M   53  111M    0     0  1536k      0  0:02:18  0:01:14  0:01:04 4229k
 55  208M   55  115M    0     0  1570k      0  0:02:16  0:01:15  0:01:01 4208k
 56  208M   56  118M    0     0  1590k      0  0:02:14  0:01:16  0:00:58 3985k
 58  208M   58  121M    0     0  1608k      0  0:02:12  0:01:17  0:00:55 3729k
 58  208M   58  122M    0     0  1610k      0  0:02:12  0:01:18  0:00:54 3197k
 58  208M   58  123M    0     0  1592k      0  0:02:14  0:01:19  0:00:55 2407k
 59  208M   59  123M    0     0  1578k      0  0:02:15  0:01:20  0:00:55 1703k
 59  208M   59  124M    0     0  1575k      0  0:02:15  0:01:21  0:00:54 1341k
 61  208M   61  127M    0     0  1589k      0  0:02:14  0:01:22  0:00:52 1298k
 62  208M   62  130M    0     0  1606k      0  0:02:12  0:01:23  0:00:49 1542k
 63  208M   63  132M    0     0  1619k      0  0:02:11  0:01:24  0:00:47 2044k
 65  208M   65  135M    0     0  1633k      0  0:02:10  0:01:25  0:00:45 2502k
 66  208M   66  138M    0     0  1649k      0  0:02:09  0:01:26  0:00:43 2854k
 67  208M   67  140M    0     0  1652k      0  0:02:09  0:01:27  0:00:42 2679k
 68  208M   68  143M    0     0  1667k      0  0:02:08  0:01:28  0:00:40 2684k
 70  208M   70  146M    0     0  1683k      0  0:02:06  0:01:29  0:00:37 2764k
 71  208M   71  149M    0     0  1698k      0  0:02:05  0:01:30  0:00:35 2817k
 73  208M   73  152M    0     0  1716k      0  0:02:04  0:01:31  0:00:33 2871k
 74  208M   74  155M    0     0  1734k      0  0:02:03  0:01:32  0:00:31 3158k
 76  208M   76  159M    0     0  1750k      0  0:02:01  0:01:33  0:00:28 3218k
 77  208M   77  162M    0     0  1768k      0  0:02:00  0:01:34  0:00:26 3291k
 79  208M   79  165M    0     0  1782k      0  0:01:59  0:01:35  0:00:24 3286k
 80  208M   80  167M    0     0  1789k      0  0:01:59  0:01:36  0:00:23 3109k
 81  208M   81  169M    0     0  1793k      0  0:01:59  0:01:37  0:00:22 2886k
 82  208M   82  172M    0     0  1800k      0  0:01:58  0:01:38  0:00:20 2722k
 83  208M   83  174M    0     0  1808k      0  0:01:58  0:01:39  0:00:19 2556k
 85  208M   85  177M    0     0  1817k      0  0:01:57  0:01:40  0:00:17 2480k
 86  208M   86  180M    0     0  1825k      0  0:01:57  0:01:41  0:00:16 2519k
 87  208M   87  182M    0     0  1833k      0  0:01:56  0:01:42  0:00:14 2607k
 88  208M   88  185M    0     0  1841k      0  0:01:55  0:01:43  0:00:12 2651k
 90  208M   90  187M    0     0  1849k      0  0:01:55  0:01:44  0:00:11 2660k
 91  208M   91  190M    0     0  1857k      0  0:01:55  0:01:45  0:00:10 2660k
 92  208M   92  193M    0     0  1865k      0  0:01:54  0:01:46  0:00:08 2668k
 93  208M   93  195M    0     0  1870k      0  0:01:54  0:01:47  0:00:07 2634k
 94  208M   94  196M    0     0  1849k      0  0:01:55  0:01:48  0:00:07 1982k
 94  208M   94  196M    0     0  1831k      0  0:01:56  0:01:49  0:00:07 1517k
 94  208M   94  196M    0     0  1815k      0  0:01:57  0:01:50  0:00:07 1070k
 94  208M   94  196M    0     0  1799k      0  0:01:58  0:01:51  0:00:07  616k
 94  208M   94  196M    0     0  1784k      0  0:01:59  0:01:52  0:00:07  198k
 94  208M   94  196M    0     0  1770k      0  0:02:00  0:01:53  0:00:07  1781
 94  208M   94  196M    0     0  1756k      0  0:02:01  0:01:54  0:00:07  1832
 94  208M   94  196M    0     0  1742k      0  0:02:02  0:01:55  0:00:07  1558
 94  208M   94  196M    0     0  1729k      0  0:02:03  0:01:56  0:00:07  1586
 94  208M   94  196M    0     0  1716k      0  0:02:04  0:01:57  0:00:07  1609
 94  208M   94  196M    0     0  1703k      0  0:02:05  0:01:58  0:00:07  1632
 94  208M   94  196M    0     0  1691k      0  0:02:06  0:01:59  0:00:07  1648
 94  208M   94  196M    0     0  1667k      0  0:02:08  0:02:00  0:00:08  1671
 94  208M   94  196M    0     0  1656k      0  0:02:08  0:02:01  0:00:07  1686
 94  208M   94  196M    0     0  1644k      0  0:02:09  0:02:02  0:00:07  1700
 94  208M   94  196M    0     0  1633k      0  0:02:10  0:02:03  0:00:07  1712
 94  208M   94  196M    0     0  1622k      0  0:02:11  0:02:04  0:00:07  1725
 94  208M   94  196M    0     0  1601k      0  0:02:13  0:02:05  0:00:08  1744
 94  208M   94  196M    0     0  1591k      0  0:02:14  0:02:06  0:00:08  1750
 94  208M   94  196M    0     0  1581k      0  0:02:15  0:02:07  0:00:08  1756
 94  208M   94  196M    0     0  1571k      0  0:02:15  0:02:08  0:00:07  1761
 94  208M   94  196M    0     0  1551k      0  0:02:17  0:02:09  0:00:08  1768
 94  208M   94  196M    0     0  1541k      0  0:02:18  0:02:10  0:00:08  1776
 94  208M   94  196M    0     0  1532k      0  0:02:19  0:02:11  0:00:08  1781
 94  208M   94  196M    0     0  1522k      0  0:02:20  0:02:12  0:00:08  1782
 94  208M   94  196M    0     0  1513k      0  0:02:21  0:02:13  0:00:08  1786
 94  208M   94  196M    0     0  1495k      0  0:02:22  0:02:14  0:00:08  1793
 94  208M   94  196M    0     0  1486k      0  0:02:23  0:02:15  0:00:08  1795
 94  208M   94  196M    0     0  1478k      0  0:02:24  0:02:16  0:00:08  1797
 94  208M   94  196M    0     0  1469k      0  0:02:25  0:02:17  0:00:08  1799
 94  208M   94  196M    0     0  1452k      0  0:02:27  0:02:18  0:00:09  1801
 94  208M   94  196M    0     0  1444k      0  0:02:27  0:02:19  0:00:08  1802
 94  208M   94  196M    0     0  1435k      0  0:02:28  0:02:20  0:00:08  1802
 94  208M   94  196M    0     0  1427k      0  0:02:29  0:02:21  0:00:08  1803
 94  208M   94  196M    0     0  1411k      0  0:02:31  0:02:22  0:00:09  4415
 94  208M   94  196M    0     0  1408k      0  0:02:31  0:02:23  0:00:08 24698
 94  208M   94  196M    0     0  1399k      0  0:02:32  0:02:24  0:00:08 45846
 94  208M   94  197M    0     0  1391k      0  0:02:33  0:02:25  0:00:08 92250
 94  208M   94  197M    0     0  1384k      0  0:02:34  0:02:26  0:00:08  144k
 94  208M   94  197M    0     0  1378k      0  0:02:34  0:02:27  0:00:07  295k
 95  208M   95  198M    0     0  1375k      0  0:02:35  0:02:28  0:00:07  431k
 95  208M   95  200M    0     0  1374k      0  0:02:35  0:02:29  0:00:06  643k
 96  208M   96  201M    0     0  1374k      0  0:02:35  0:02:30  0:00:05  885k
 97  208M   97  202M    0     0  1372k      0  0:02:35  0:02:31  0:00:04 1037k
 97  208M   97  202M    0     0  1366k      0  0:02:36  0:02:32  0:00:04 1014k
 97  208M   97  203M    0     0  1358k      0  0:02:37  0:02:33  0:00:04  863k
 97  208M   97  203M    0     0  1352k      0  0:02:37  0:02:34  0:00:03  712k
 97  208M   97  203M    0     0  1346k      0  0:02:38  0:02:35  0:00:03  512k
 98  208M   98  204M    0     0  1341k      0  0:02:39  0:02:36  0:00:03  380k
 98  208M   98  205M    0     0  1337k      0  0:02:39  0:02:37  0:00:02  460k
 98  208M   98  206M    0     0  1335k      0  0:02:39  0:02:38  0:00:01  626k
 99  208M   99  207M    0     0  1335k      0  0:02:39  0:02:39 --:--:--  785k
100  208M  100  208M    0     0  1337k      0  0:02:39  0:02:39 --:--:-- 1020k
+ tar xzf /tmp/mangoTestD0h5221/deleteMePleaseThisIsNoLongerNeeded/hadoop-2.7.7.tar.gz --directory /tmp/mangoTestD0h5221/deleteMePleaseThisIsNoLongerNeeded
+ grep avro
+ xargs rm
+ find /tmp/mangoTestD0h5221/deleteMePleaseThisIsNoLongerNeeded/hadoop-2.7.7 -name '*.jar'
++ /tmp/mangoTestD0h5221/deleteMePleaseThisIsNoLongerNeeded/hadoop-2.7.7/bin/hadoop classpath
+ export 'SPARK_DIST_CLASSPATH=/tmp/mangoTestD0h5221/deleteMePleaseThisIsNoLongerNeeded/hadoop-2.7.7/etc/hadoop:/tmp/mangoTestD0h5221/deleteMePleaseThisIsNoLongerNeeded/hadoop-2.7.7/share/hadoop/common/lib/*:/tmp/mangoTestD0h5221/deleteMePleaseThisIsNoLongerNeeded/hadoop-2.7.7/share/hadoop/common/*:/tmp/mangoTestD0h5221/deleteMePleaseThisIsNoLongerNeeded/hadoop-2.7.7/share/hadoop/hdfs:/tmp/mangoTestD0h5221/deleteMePleaseThisIsNoLongerNeeded/hadoop-2.7.7/share/hadoop/hdfs/lib/*:/tmp/mangoTestD0h5221/deleteMePleaseThisIsNoLongerNeeded/hadoop-2.7.7/share/hadoop/hdfs/*:/tmp/mangoTestD0h5221/deleteMePleaseThisIsNoLongerNeeded/hadoop-2.7.7/share/hadoop/yarn/lib/*:/tmp/mangoTestD0h5221/deleteMePleaseThisIsNoLongerNeeded/hadoop-2.7.7/share/hadoop/yarn/*:/tmp/mangoTestD0h5221/deleteMePleaseThisIsNoLongerNeeded/hadoop-2.7.7/share/hadoop/mapreduce/lib/*:/tmp/mangoTestD0h5221/deleteMePleaseThisIsNoLongerNeeded/hadoop-2.7.7/share/hadoop/mapreduce/*:/contrib/capacity-scheduler/*.jar'
+ SPARK_DIST_CLASSPATH='/tmp/mangoTestD0h5221/deleteMePleaseThisIsNoLongerNeeded/hadoop-2.7.7/etc/hadoop:/tmp/mangoTestD0h5221/deleteMePleaseThisIsNoLongerNeeded/hadoop-2.7.7/share/hadoop/common/lib/*:/tmp/mangoTestD0h5221/deleteMePleaseThisIsNoLongerNeeded/hadoop-2.7.7/share/hadoop/common/*:/tmp/mangoTestD0h5221/deleteMePleaseThisIsNoLongerNeeded/hadoop-2.7.7/share/hadoop/hdfs:/tmp/mangoTestD0h5221/deleteMePleaseThisIsNoLongerNeeded/hadoop-2.7.7/share/hadoop/hdfs/lib/*:/tmp/mangoTestD0h5221/deleteMePleaseThisIsNoLongerNeeded/hadoop-2.7.7/share/hadoop/hdfs/*:/tmp/mangoTestD0h5221/deleteMePleaseThisIsNoLongerNeeded/hadoop-2.7.7/share/hadoop/yarn/lib/*:/tmp/mangoTestD0h5221/deleteMePleaseThisIsNoLongerNeeded/hadoop-2.7.7/share/hadoop/yarn/*:/tmp/mangoTestD0h5221/deleteMePleaseThisIsNoLongerNeeded/hadoop-2.7.7/share/hadoop/mapreduce/lib/*:/tmp/mangoTestD0h5221/deleteMePleaseThisIsNoLongerNeeded/hadoop-2.7.7/share/hadoop/mapreduce/*:/contrib/capacity-scheduler/*.jar'



# create a conda environment for python build, if necessary
pythons=( 3.6 )
+ pythons=(3.6)
for python in ${pythons[*]}
do
    set +x +v
    conda create -y -q -c conda-forge -n mango-build-${PYTHON_UUID} python=${python} pip=19.3.1 jupyterlab=2.0.1
    source activate mango-build-${PYTHON_UUID}
    set -x -v

    # install npm and node in the venv for mango-pileup
    conda install -y nodejs

    # prepare mango python
    pushd mango-python
    make prepare
    popd

    # we can run the python build, now that we have a spark executable
    # requires SPARK_HOME to be set
    mvn -U \
        -P python,distribution \
        package \
        -DskipTests \
        -Dhadoop.version=${HADOOP_VERSION} \
        -Dspark.version=${SPARK_VERSION}

    # clean mango python
    pushd mango-python
    make clean
    popd

    # prepare mango viz
    pushd mango-pileup
    make prepare
    popd

    # run the widgets tests (mango-pileup)
    mvn -P widgets test

    # clean mango viz
    pushd mango-pileup
    make clean
    popd

    # make sure that the distribution package contains an egg
    # if no assembly jar is found, this will exit with code 1 and fail the build
    tar tzf mango-distribution/target/mango-distribution*-bin.tar.gz | \
        grep bdgenomics.mango | \
        grep egg

    # test mango notebook, output to temporary log file
    MANGO_NOTEBOOK_LOGS=${MANGO_TMP_DIR}/mango-notebook.log

    # notebook args --ip=0.0.0.0 --no-browser --allow-root required for docker
    bash -xv ${PROJECT_ROOT}/bin/mango-notebook -- --ip=0.0.0.0 --no-browser --allow-root &> ${MANGO_NOTEBOOK_LOGS} &

    # sleep for 2 seconds to let mango-notebook start up
    sleep 2

    # if mango-notebook fails, then trying to kill the process will fail
    if kill $! ; then
        echo "Mango Notebook Succeeded"
    else
        echo "Mango Notebook failed with logs:"
        cat ${MANGO_NOTEBOOK_LOGS}
        exit 1
    fi

    # deactivate and remove the conda env
    set +e +x
    source deactivate
    conda remove -y --name mango-build-${PYTHON_UUID} --all
    set -e -x
done
+ for python in ${pythons[*]}
+ set +x +v
Collecting package metadata (current_repodata.json): ...working... done
Solving environment: ...working... failed with repodata from current_repodata.json, will retry with next repodata source.
Collecting package metadata (repodata.json): ...working... done
Solving environment: ...working... done

## Package Plan ##

  environment location: /home/jenkins/.conda/envs/mango-build-28f035a6-d7ab-497f-aac5-d54b85a8a4c1

  added / updated specs:
    - jupyterlab=2.0.1
    - pip=19.3.1
    - python=3.6


The following packages will be downloaded:

    package                    |            build
    ---------------------------|-----------------
    _libgcc_mutex-0.1          |      conda_forge           3 KB  conda-forge
    _openmp_mutex-4.5          |            1_gnu          22 KB  conda-forge
    argon2-cffi-20.1.0         |   py36h8c4c3a4_1          47 KB  conda-forge
    attrs-19.3.0               |             py_0          35 KB  conda-forge
    backcall-0.2.0             |     pyh9f0ad1d_0          13 KB  conda-forge
    backports-1.0              |             py_2           4 KB  conda-forge
    backports.functools_lru_cache-1.6.1|             py_0           8 KB  conda-forge
    bleach-3.1.5               |     pyh9f0ad1d_0         112 KB  conda-forge
    brotlipy-0.7.0             |py36h8c4c3a4_1000         346 KB  conda-forge
    ca-certificates-2020.6.20  |       hecda079_0         145 KB  conda-forge
    certifi-2020.6.20          |   py36h9f0ad1d_0         151 KB  conda-forge
    cffi-1.14.1                |   py36h0ff685e_0         223 KB  conda-forge
    chardet-3.0.4              |py36h9f0ad1d_1006         188 KB  conda-forge
    cryptography-3.0           |   py36h45558ae_0         640 KB  conda-forge
    decorator-4.4.2            |             py_0          11 KB  conda-forge
    defusedxml-0.6.0           |             py_0          22 KB  conda-forge
    entrypoints-0.3            |py36h9f0ad1d_1001          12 KB  conda-forge
    idna-2.10                  |     pyh9f0ad1d_0          52 KB  conda-forge
    importlib-metadata-1.7.0   |   py36h9f0ad1d_0          44 KB  conda-forge
    importlib_metadata-1.7.0   |                0           3 KB  conda-forge
    ipykernel-5.3.4            |   py36h95af2a2_0         165 KB  conda-forge
    ipython-7.16.1             |   py36h95af2a2_0         1.1 MB  conda-forge
    ipython_genutils-0.2.0     |             py_1          21 KB  conda-forge
    jedi-0.17.2                |   py36h9f0ad1d_0         950 KB  conda-forge
    jinja2-2.11.2              |     pyh9f0ad1d_0          93 KB  conda-forge
    json5-0.9.4                |     pyh9f0ad1d_0          20 KB  conda-forge
    jsonschema-3.2.0           |   py36h9f0ad1d_1          89 KB  conda-forge
    jupyter_client-6.1.6       |             py_0          75 KB  conda-forge
    jupyter_core-4.6.3         |   py36h9f0ad1d_1          71 KB  conda-forge
    jupyterlab-2.0.1           |             py_0         5.7 MB  conda-forge
    jupyterlab_server-1.2.0    |             py_0          25 KB  conda-forge
    ld_impl_linux-64-2.34      |       hc38a660_9         612 KB  conda-forge
    libffi-3.2.1               |    he1b5a44_1007          47 KB  conda-forge
    libgcc-ng-9.3.0            |      h24d8f2e_15         7.8 MB  conda-forge
    libgomp-9.3.0              |      h24d8f2e_15         378 KB  conda-forge
    libsodium-1.0.18           |       h516909a_0         339 KB  conda-forge
    libstdcxx-ng-9.3.0         |      hdf63c60_15         4.0 MB  conda-forge
    markupsafe-1.1.1           |   py36h8c4c3a4_1          26 KB  conda-forge
    mistune-0.8.4              |py36h8c4c3a4_1001          53 KB  conda-forge
    nbconvert-5.6.1            |   py36h9f0ad1d_1         487 KB  conda-forge
    nbformat-5.0.7             |             py_0          99 KB  conda-forge
    ncurses-6.2                |       he1b5a44_1         993 KB  conda-forge
    notebook-6.1.3             |   py36h9f0ad1d_0         6.2 MB  conda-forge
    openssl-1.1.1g             |       h516909a_1         2.1 MB  conda-forge
    packaging-20.4             |     pyh9f0ad1d_0          32 KB  conda-forge
    pandoc-2.10.1              |       h516909a_0        19.3 MB  conda-forge
    pandocfilters-1.4.2        |             py_1           9 KB  conda-forge
    parso-0.7.1                |     pyh9f0ad1d_0          70 KB  conda-forge
    pexpect-4.8.0              |   py36h9f0ad1d_1          79 KB  conda-forge
    pickleshare-0.7.5          |py36h9f0ad1d_1001          13 KB  conda-forge
    pip-19.3.1                 |           py36_0         1.9 MB  conda-forge
    prometheus_client-0.8.0    |     pyh9f0ad1d_0          44 KB  conda-forge
    prompt-toolkit-3.0.6       |             py_0         235 KB  conda-forge
    ptyprocess-0.6.0           |          py_1001          15 KB  conda-forge
    pycparser-2.20             |     pyh9f0ad1d_2          94 KB  conda-forge
    pygments-2.6.1             |             py_0         683 KB  conda-forge
    pyopenssl-19.1.0           |             py_1          47 KB  conda-forge
    pyparsing-2.4.7            |     pyh9f0ad1d_0          60 KB  conda-forge
    pyrsistent-0.16.0          |   py36h8c4c3a4_0          89 KB  conda-forge
    pysocks-1.7.1              |   py36h9f0ad1d_1          27 KB  conda-forge
    python-3.6.11              |h4d41432_2_cpython        34.2 MB  conda-forge
    python-dateutil-2.8.1      |             py_0         220 KB  conda-forge
    python_abi-3.6             |          1_cp36m           4 KB  conda-forge
    pyzmq-19.0.2               |   py36h9947dbf_0         465 KB  conda-forge
    readline-8.0               |       he28a2e2_2         281 KB  conda-forge
    requests-2.24.0            |     pyh9f0ad1d_0          47 KB  conda-forge
    send2trash-1.5.0           |             py_0          12 KB  conda-forge
    setuptools-49.6.0          |   py36h9f0ad1d_0         935 KB  conda-forge
    six-1.15.0                 |     pyh9f0ad1d_0          14 KB  conda-forge
    sqlite-3.33.0              |       h4cf870e_0         1.4 MB  conda-forge
    terminado-0.8.3            |   py36h9f0ad1d_1          23 KB  conda-forge
    testpath-0.4.4             |             py_0          85 KB  conda-forge
    tk-8.6.10                  |       hed695b0_0         3.2 MB  conda-forge
    tornado-6.0.4              |   py36h8c4c3a4_1         639 KB  conda-forge
    traitlets-4.3.3            |   py36h9f0ad1d_1         133 KB  conda-forge
    urllib3-1.25.10            |             py_0          92 KB  conda-forge
    wcwidth-0.2.5              |     pyh9f0ad1d_1          33 KB  conda-forge
    webencodings-0.5.1         |             py_1          12 KB  conda-forge
    wheel-0.35.1               |     pyh9f0ad1d_0          29 KB  conda-forge
    xz-5.2.5                   |       h516909a_1         343 KB  conda-forge
    zeromq-4.3.2               |       he1b5a44_3         326 KB  conda-forge
    zipp-3.1.0                 |             py_0          10 KB  conda-forge
    zlib-1.2.11                |    h516909a_1007         106 KB  conda-forge
    ------------------------------------------------------------
                                           Total:        98.7 MB

The following NEW packages will be INSTALLED:

  _libgcc_mutex      conda-forge/linux-64::_libgcc_mutex-0.1-conda_forge
  _openmp_mutex      conda-forge/linux-64::_openmp_mutex-4.5-1_gnu
  argon2-cffi        conda-forge/linux-64::argon2-cffi-20.1.0-py36h8c4c3a4_1
  attrs              conda-forge/noarch::attrs-19.3.0-py_0
  backcall           conda-forge/noarch::backcall-0.2.0-pyh9f0ad1d_0
  backports          conda-forge/noarch::backports-1.0-py_2
  backports.functoo~ conda-forge/noarch::backports.functools_lru_cache-1.6.1-py_0
  bleach             conda-forge/noarch::bleach-3.1.5-pyh9f0ad1d_0
  brotlipy           conda-forge/linux-64::brotlipy-0.7.0-py36h8c4c3a4_1000
  ca-certificates    conda-forge/linux-64::ca-certificates-2020.6.20-hecda079_0
  certifi            conda-forge/linux-64::certifi-2020.6.20-py36h9f0ad1d_0
  cffi               conda-forge/linux-64::cffi-1.14.1-py36h0ff685e_0
  chardet            conda-forge/linux-64::chardet-3.0.4-py36h9f0ad1d_1006
  cryptography       conda-forge/linux-64::cryptography-3.0-py36h45558ae_0
  decorator          conda-forge/noarch::decorator-4.4.2-py_0
  defusedxml         conda-forge/noarch::defusedxml-0.6.0-py_0
  entrypoints        conda-forge/linux-64::entrypoints-0.3-py36h9f0ad1d_1001
  idna               conda-forge/noarch::idna-2.10-pyh9f0ad1d_0
  importlib-metadata conda-forge/linux-64::importlib-metadata-1.7.0-py36h9f0ad1d_0
  importlib_metadata conda-forge/noarch::importlib_metadata-1.7.0-0
  ipykernel          conda-forge/linux-64::ipykernel-5.3.4-py36h95af2a2_0
  ipython            conda-forge/linux-64::ipython-7.16.1-py36h95af2a2_0
  ipython_genutils   conda-forge/noarch::ipython_genutils-0.2.0-py_1
  jedi               conda-forge/linux-64::jedi-0.17.2-py36h9f0ad1d_0
  jinja2             conda-forge/noarch::jinja2-2.11.2-pyh9f0ad1d_0
  json5              conda-forge/noarch::json5-0.9.4-pyh9f0ad1d_0
  jsonschema         conda-forge/linux-64::jsonschema-3.2.0-py36h9f0ad1d_1
  jupyter_client     conda-forge/noarch::jupyter_client-6.1.6-py_0
  jupyter_core       conda-forge/linux-64::jupyter_core-4.6.3-py36h9f0ad1d_1
  jupyterlab         conda-forge/noarch::jupyterlab-2.0.1-py_0
  jupyterlab_server  conda-forge/noarch::jupyterlab_server-1.2.0-py_0
  ld_impl_linux-64   conda-forge/linux-64::ld_impl_linux-64-2.34-hc38a660_9
  libffi             conda-forge/linux-64::libffi-3.2.1-he1b5a44_1007
  libgcc-ng          conda-forge/linux-64::libgcc-ng-9.3.0-h24d8f2e_15
  libgomp            conda-forge/linux-64::libgomp-9.3.0-h24d8f2e_15
  libsodium          conda-forge/linux-64::libsodium-1.0.18-h516909a_0
  libstdcxx-ng       conda-forge/linux-64::libstdcxx-ng-9.3.0-hdf63c60_15
  markupsafe         conda-forge/linux-64::markupsafe-1.1.1-py36h8c4c3a4_1
  mistune            conda-forge/linux-64::mistune-0.8.4-py36h8c4c3a4_1001
  nbconvert          conda-forge/linux-64::nbconvert-5.6.1-py36h9f0ad1d_1
  nbformat           conda-forge/noarch::nbformat-5.0.7-py_0
  ncurses            conda-forge/linux-64::ncurses-6.2-he1b5a44_1
  notebook           conda-forge/linux-64::notebook-6.1.3-py36h9f0ad1d_0
  openssl            conda-forge/linux-64::openssl-1.1.1g-h516909a_1
  packaging          conda-forge/noarch::packaging-20.4-pyh9f0ad1d_0
  pandoc             conda-forge/linux-64::pandoc-2.10.1-h516909a_0
  pandocfilters      conda-forge/noarch::pandocfilters-1.4.2-py_1
  parso              conda-forge/noarch::parso-0.7.1-pyh9f0ad1d_0
  pexpect            conda-forge/linux-64::pexpect-4.8.0-py36h9f0ad1d_1
  pickleshare        conda-forge/linux-64::pickleshare-0.7.5-py36h9f0ad1d_1001
  pip                conda-forge/linux-64::pip-19.3.1-py36_0
  prometheus_client  conda-forge/noarch::prometheus_client-0.8.0-pyh9f0ad1d_0
  prompt-toolkit     conda-forge/noarch::prompt-toolkit-3.0.6-py_0
  ptyprocess         conda-forge/noarch::ptyprocess-0.6.0-py_1001
  pycparser          conda-forge/noarch::pycparser-2.20-pyh9f0ad1d_2
  pygments           conda-forge/noarch::pygments-2.6.1-py_0
  pyopenssl          conda-forge/noarch::pyopenssl-19.1.0-py_1
  pyparsing          conda-forge/noarch::pyparsing-2.4.7-pyh9f0ad1d_0
  pyrsistent         conda-forge/linux-64::pyrsistent-0.16.0-py36h8c4c3a4_0
  pysocks            conda-forge/linux-64::pysocks-1.7.1-py36h9f0ad1d_1
  python             conda-forge/linux-64::python-3.6.11-h4d41432_2_cpython
  python-dateutil    conda-forge/noarch::python-dateutil-2.8.1-py_0
  python_abi         conda-forge/linux-64::python_abi-3.6-1_cp36m
  pyzmq              conda-forge/linux-64::pyzmq-19.0.2-py36h9947dbf_0
  readline           conda-forge/linux-64::readline-8.0-he28a2e2_2
  requests           conda-forge/noarch::requests-2.24.0-pyh9f0ad1d_0
  send2trash         conda-forge/noarch::send2trash-1.5.0-py_0
  setuptools         conda-forge/linux-64::setuptools-49.6.0-py36h9f0ad1d_0
  six                conda-forge/noarch::six-1.15.0-pyh9f0ad1d_0
  sqlite             conda-forge/linux-64::sqlite-3.33.0-h4cf870e_0
  terminado          conda-forge/linux-64::terminado-0.8.3-py36h9f0ad1d_1
  testpath           conda-forge/noarch::testpath-0.4.4-py_0
  tk                 conda-forge/linux-64::tk-8.6.10-hed695b0_0
  tornado            conda-forge/linux-64::tornado-6.0.4-py36h8c4c3a4_1
  traitlets          conda-forge/linux-64::traitlets-4.3.3-py36h9f0ad1d_1
  urllib3            conda-forge/noarch::urllib3-1.25.10-py_0
  wcwidth            conda-forge/noarch::wcwidth-0.2.5-pyh9f0ad1d_1
  webencodings       conda-forge/noarch::webencodings-0.5.1-py_1
  wheel              conda-forge/noarch::wheel-0.35.1-pyh9f0ad1d_0
  xz                 conda-forge/linux-64::xz-5.2.5-h516909a_1
  zeromq             conda-forge/linux-64::zeromq-4.3.2-he1b5a44_3
  zipp               conda-forge/noarch::zipp-3.1.0-py_0
  zlib               conda-forge/linux-64::zlib-1.2.11-h516909a_1007


Preparing transaction: ...working... done
Verifying transaction: ...working... done
Executing transaction: ...working... done
+ conda install -y nodejs
+ '[' 3 -lt 1 ']'
+ local cmd=install
+ shift
+ case "$cmd" in
+ CONDA_INTERNAL_OLDPATH=/home/jenkins/.conda/envs/mango-build-28f035a6-d7ab-497f-aac5-d54b85a8a4c1/bin:/opt/conda/condabin:/docker-java-home/bin:/opt/conda/bin:/usr/local/sbin:/usr/local/bin:/usr/sbin:/usr/bin:/sbin:/bin
+ __add_sys_prefix_to_path
+ '[' -n '' ']'
++ dirname /opt/conda/bin/conda
+ SYSP=/opt/conda/bin
++ dirname /opt/conda/bin
+ SYSP=/opt/conda
+ '[' -n '' ']'
+ PATH=/opt/conda/bin:/home/jenkins/.conda/envs/mango-build-28f035a6-d7ab-497f-aac5-d54b85a8a4c1/bin:/opt/conda/condabin:/docker-java-home/bin:/opt/conda/bin:/usr/local/sbin:/usr/local/bin:/usr/sbin:/usr/bin:/sbin:/bin
+ export PATH
+ /opt/conda/bin/conda install -y nodejs
Collecting package metadata (current_repodata.json): ...working... done
Solving environment: ...working... done

## Package Plan ##

  environment location: /home/jenkins/.conda/envs/mango-build-28f035a6-d7ab-497f-aac5-d54b85a8a4c1

  added / updated specs:
    - nodejs


The following packages will be downloaded:

    package                    |            build
    ---------------------------|-----------------
    certifi-2020.6.20          |           py36_0         156 KB
    ------------------------------------------------------------
                                           Total:         156 KB

The following NEW packages will be INSTALLED:

  nodejs             pkgs/main/linux-64::nodejs-10.13.0-he6710b0_0

The following packages will be UPDATED:

  ca-certificates    conda-forge::ca-certificates-2020.6.2~ --> pkgs/main::ca-certificates-2020.6.24-0

The following packages will be SUPERSEDED by a higher-priority channel:

  certifi            conda-forge::certifi-2020.6.20-py36h9~ --> pkgs/main::certifi-2020.6.20-py36_0
  openssl            conda-forge::openssl-1.1.1g-h516909a_1 --> pkgs/main::openssl-1.1.1g-h7b6447c_0



Downloading and Extracting Packages

certifi-2020.6.20    | 156 KB    |            |   0% 
certifi-2020.6.20    | 156 KB    | ########## | 100% 
Preparing transaction: ...working... done
Verifying transaction: ...working... done
Executing transaction: ...working... done
+ local t1=0
+ PATH=/home/jenkins/.conda/envs/mango-build-28f035a6-d7ab-497f-aac5-d54b85a8a4c1/bin:/opt/conda/condabin:/docker-java-home/bin:/opt/conda/bin:/usr/local/sbin:/usr/local/bin:/usr/sbin:/usr/bin:/sbin:/bin
+ '[' 0 = 0 ']'
+ __conda_reactivate
+ local ask_conda
+ CONDA_INTERNAL_OLDPATH=/home/jenkins/.conda/envs/mango-build-28f035a6-d7ab-497f-aac5-d54b85a8a4c1/bin:/opt/conda/condabin:/docker-java-home/bin:/opt/conda/bin:/usr/local/sbin:/usr/local/bin:/usr/sbin:/usr/bin:/sbin:/bin
+ __add_sys_prefix_to_path
+ '[' -n '' ']'
++ dirname /opt/conda/bin/conda
+ SYSP=/opt/conda/bin
++ dirname /opt/conda/bin
+ SYSP=/opt/conda
+ '[' -n '' ']'
+ PATH=/opt/conda/bin:/home/jenkins/.conda/envs/mango-build-28f035a6-d7ab-497f-aac5-d54b85a8a4c1/bin:/opt/conda/condabin:/docker-java-home/bin:/opt/conda/bin:/usr/local/sbin:/usr/local/bin:/usr/sbin:/usr/bin:/sbin:/bin
+ export PATH
++ PS1='(mango-build-28f035a6-d7ab-497f-aac5-d54b85a8a4c1) '
++ /opt/conda/bin/conda shell.posix reactivate
+ ask_conda='PS1='\''(mango-build-28f035a6-d7ab-497f-aac5-d54b85a8a4c1) '\''
export PATH='\''/home/jenkins/.conda/envs/mango-build-28f035a6-d7ab-497f-aac5-d54b85a8a4c1/bin:/opt/conda/condabin:/docker-java-home/bin:/opt/conda/bin:/usr/local/sbin:/usr/local/bin:/usr/sbin:/usr/bin:/sbin:/bin'\''
export CONDA_SHLVL='\''1'\''
export CONDA_PROMPT_MODIFIER='\''(mango-build-28f035a6-d7ab-497f-aac5-d54b85a8a4c1) '\'''
+ PATH=/home/jenkins/.conda/envs/mango-build-28f035a6-d7ab-497f-aac5-d54b85a8a4c1/bin:/opt/conda/condabin:/docker-java-home/bin:/opt/conda/bin:/usr/local/sbin:/usr/local/bin:/usr/sbin:/usr/bin:/sbin:/bin
+ eval 'PS1='\''(mango-build-28f035a6-d7ab-497f-aac5-d54b85a8a4c1) '\''
export PATH='\''/home/jenkins/.conda/envs/mango-build-28f035a6-d7ab-497f-aac5-d54b85a8a4c1/bin:/opt/conda/condabin:/docker-java-home/bin:/opt/conda/bin:/usr/local/sbin:/usr/local/bin:/usr/sbin:/usr/bin:/sbin:/bin'\''
export CONDA_SHLVL='\''1'\''
export CONDA_PROMPT_MODIFIER='\''(mango-build-28f035a6-d7ab-497f-aac5-d54b85a8a4c1) '\'''
PS1='(mango-build-28f035a6-d7ab-497f-aac5-d54b85a8a4c1) '
++ PS1='(mango-build-28f035a6-d7ab-497f-aac5-d54b85a8a4c1) '
export PATH='/home/jenkins/.conda/envs/mango-build-28f035a6-d7ab-497f-aac5-d54b85a8a4c1/bin:/opt/conda/condabin:/docker-java-home/bin:/opt/conda/bin:/usr/local/sbin:/usr/local/bin:/usr/sbin:/usr/bin:/sbin:/bin'
++ export PATH=/home/jenkins/.conda/envs/mango-build-28f035a6-d7ab-497f-aac5-d54b85a8a4c1/bin:/opt/conda/condabin:/docker-java-home/bin:/opt/conda/bin:/usr/local/sbin:/usr/local/bin:/usr/sbin:/usr/bin:/sbin:/bin
++ PATH=/home/jenkins/.conda/envs/mango-build-28f035a6-d7ab-497f-aac5-d54b85a8a4c1/bin:/opt/conda/condabin:/docker-java-home/bin:/opt/conda/bin:/usr/local/sbin:/usr/local/bin:/usr/sbin:/usr/bin:/sbin:/bin
export CONDA_SHLVL='1'
++ export CONDA_SHLVL=1
++ CONDA_SHLVL=1
export CONDA_PROMPT_MODIFIER='(mango-build-28f035a6-d7ab-497f-aac5-d54b85a8a4c1) '
++ export 'CONDA_PROMPT_MODIFIER=(mango-build-28f035a6-d7ab-497f-aac5-d54b85a8a4c1) '
++ CONDA_PROMPT_MODIFIER='(mango-build-28f035a6-d7ab-497f-aac5-d54b85a8a4c1) '
+ __conda_hashr
+ '[' -n '' ']'
+ '[' -n '' ']'
+ hash -r
+ pushd mango-python
+ make prepare
/tmp/mangoTestD0h5221/deleteMePleaseThisIsNoLongerNeeded/mango-python /tmp/mangoTestD0h5221/deleteMePleaseThisIsNoLongerNeeded /home
which pip
/home/jenkins/.conda/envs/mango-build-28f035a6-d7ab-497f-aac5-d54b85a8a4c1/bin/pip
# ipython version required for python 2.7
pip install -r requirements.txt
Collecting cigar==0.1.3
  Downloading https://files.pythonhosted.org/packages/2d/5f/ffa58a8c64f811772b69a01eeab25c602b72d02a0c83006177c21abedaa3/cigar-0.1.3.tar.gz
Collecting matplotlib==2.0.2
  Downloading https://files.pythonhosted.org/packages/60/d4/6b6d8a7a6bc69a1602ab372f6fc6e88ef88a8a96398a1a25edbac636295b/matplotlib-2.0.2-cp36-cp36m-manylinux1_x86_64.whl (14.6MB)
Collecting ipython==7.8.0
  Downloading https://files.pythonhosted.org/packages/fb/44/f28a13852e562af719f9de1761680a84a93e8b4c50e22d00d68f60ee2e8b/ipython-7.8.0-py3-none-any.whl (775kB)
Collecting jupyter==1.0.0
  Downloading https://files.pythonhosted.org/packages/83/df/0f5dd132200728a86190397e1ea87cd76244e42d39ec5e88efd25b2abd7e/jupyter-1.0.0-py2.py3-none-any.whl
Collecting bdgenomics.adam==0.30.0
  Downloading https://files.pythonhosted.org/packages/8d/4b/b5b92dedae5ddd4e6f425f40a61332a3f646ac4616f840262ebb9441d396/bdgenomics.adam-0.30.0.tar.gz (39.5MB)
Collecting bdgenomics.mango.pileup==0.0.6a0
  Downloading https://files.pythonhosted.org/packages/48/8f/06f3e694caf8ba67dadbfca5c7f050343e7e3363ba348d94a224aa964cfb/bdgenomics.mango.pileup-0.0.6a0.tar.gz (892kB)
Collecting ipywidgets==7.0.0
  Downloading https://files.pythonhosted.org/packages/14/ea/793f6588d5be295d103fb868e26ba8671686b70bd855a21d02302f8dcd37/ipywidgets-7.0.0-py2.py3-none-any.whl (64kB)
Collecting psutil
  Downloading https://files.pythonhosted.org/packages/aa/3e/d18f2c04cf2b528e18515999b0c8e698c136db78f62df34eee89cee205f1/psutil-5.7.2.tar.gz (460kB)
Collecting pytest==3.9.1
  Downloading https://files.pythonhosted.org/packages/bf/14/a16e1ac03aeb9776d98374bb76495a6623d56dff0f7b815ed5a1e04d893e/pytest-3.9.1-py2.py3-none-any.whl (213kB)
Collecting jupyter_contrib_nbextensions
  Downloading https://files.pythonhosted.org/packages/33/f0/6e2c00afda860f655fbf0f795f7310bdbf12122846344dfdc803fc7455d5/jupyter_contrib_nbextensions-0.5.1-py2.py3-none-any.whl (20.9MB)
Requirement already satisfied: pyparsing!=2.0.0,!=2.0.4,!=2.1.2,!=2.1.6,>=1.5.6 in /home/jenkins/.conda/envs/mango-build-28f035a6-d7ab-497f-aac5-d54b85a8a4c1/lib/python3.6/site-packages (from matplotlib==2.0.2->-r requirements.txt (line 2)) (2.4.7)
Collecting pytz
  Downloading https://files.pythonhosted.org/packages/4f/a4/879454d49688e2fad93e59d7d4efda580b783c745fd2ec2a3adf87b0808d/pytz-2020.1-py2.py3-none-any.whl (510kB)
Collecting numpy>=1.7.1
  Downloading https://files.pythonhosted.org/packages/b1/9a/7d474ba0860a41f771c9523d8c4ea56b084840b5ca4092d96bdee8a3b684/numpy-1.19.1-cp36-cp36m-manylinux2010_x86_64.whl (14.5MB)
Requirement already satisfied: six>=1.10 in /home/jenkins/.conda/envs/mango-build-28f035a6-d7ab-497f-aac5-d54b85a8a4c1/lib/python3.6/site-packages (from matplotlib==2.0.2->-r requirements.txt (line 2)) (1.15.0)
Requirement already satisfied: python-dateutil in /home/jenkins/.conda/envs/mango-build-28f035a6-d7ab-497f-aac5-d54b85a8a4c1/lib/python3.6/site-packages (from matplotlib==2.0.2->-r requirements.txt (line 2)) (2.8.1)
Collecting cycler>=0.10
  Downloading https://files.pythonhosted.org/packages/f7/d2/e07d3ebb2bd7af696440ce7e754c59dd546ffe1bbe732c8ab68b9c834e61/cycler-0.10.0-py2.py3-none-any.whl
Requirement already satisfied: traitlets>=4.2 in /home/jenkins/.conda/envs/mango-build-28f035a6-d7ab-497f-aac5-d54b85a8a4c1/lib/python3.6/site-packages (from ipython==7.8.0->-r requirements.txt (line 3)) (4.3.3)
Requirement already satisfied: pickleshare in /home/jenkins/.conda/envs/mango-build-28f035a6-d7ab-497f-aac5-d54b85a8a4c1/lib/python3.6/site-packages (from ipython==7.8.0->-r requirements.txt (line 3)) (0.7.5)
Requirement already satisfied: pexpect; sys_platform != "win32" in /home/jenkins/.conda/envs/mango-build-28f035a6-d7ab-497f-aac5-d54b85a8a4c1/lib/python3.6/site-packages (from ipython==7.8.0->-r requirements.txt (line 3)) (4.8.0)
Collecting prompt-toolkit<2.1.0,>=2.0.0
  Downloading https://files.pythonhosted.org/packages/87/61/2dfea88583d5454e3a64f9308a686071d58d59a55db638268a6413e1eb6d/prompt_toolkit-2.0.10-py3-none-any.whl (340kB)
Requirement already satisfied: setuptools>=18.5 in /home/jenkins/.conda/envs/mango-build-28f035a6-d7ab-497f-aac5-d54b85a8a4c1/lib/python3.6/site-packages (from ipython==7.8.0->-r requirements.txt (line 3)) (49.6.0.post20200814)
Requirement already satisfied: jedi>=0.10 in /home/jenkins/.conda/envs/mango-build-28f035a6-d7ab-497f-aac5-d54b85a8a4c1/lib/python3.6/site-packages (from ipython==7.8.0->-r requirements.txt (line 3)) (0.17.2)
Requirement already satisfied: backcall in /home/jenkins/.conda/envs/mango-build-28f035a6-d7ab-497f-aac5-d54b85a8a4c1/lib/python3.6/site-packages (from ipython==7.8.0->-r requirements.txt (line 3)) (0.2.0)
Requirement already satisfied: pygments in /home/jenkins/.conda/envs/mango-build-28f035a6-d7ab-497f-aac5-d54b85a8a4c1/lib/python3.6/site-packages (from ipython==7.8.0->-r requirements.txt (line 3)) (2.6.1)
Requirement already satisfied: decorator in /home/jenkins/.conda/envs/mango-build-28f035a6-d7ab-497f-aac5-d54b85a8a4c1/lib/python3.6/site-packages (from ipython==7.8.0->-r requirements.txt (line 3)) (4.4.2)
Requirement already satisfied: ipykernel in /home/jenkins/.conda/envs/mango-build-28f035a6-d7ab-497f-aac5-d54b85a8a4c1/lib/python3.6/site-packages (from jupyter==1.0.0->-r requirements.txt (line 4)) (5.3.4)
Collecting jupyter-console
  Downloading https://files.pythonhosted.org/packages/0a/89/742fa5a80b552ffcb6a8922712697c6e6828aee7b91ee4ae2b79f00f8401/jupyter_console-6.1.0-py2.py3-none-any.whl
Requirement already satisfied: notebook in /home/jenkins/.conda/envs/mango-build-28f035a6-d7ab-497f-aac5-d54b85a8a4c1/lib/python3.6/site-packages (from jupyter==1.0.0->-r requirements.txt (line 4)) (6.1.3)
Requirement already satisfied: nbconvert in /home/jenkins/.conda/envs/mango-build-28f035a6-d7ab-497f-aac5-d54b85a8a4c1/lib/python3.6/site-packages (from jupyter==1.0.0->-r requirements.txt (line 4)) (5.6.1)
Collecting qtconsole
  Downloading https://files.pythonhosted.org/packages/41/27/82ed9d2c2e9a30c885f6782d674c8bfe3e3f903d06d837c2978f8b55be56/qtconsole-4.7.6-py2.py3-none-any.whl (118kB)
Collecting pyspark>=1.6.0
  Downloading https://files.pythonhosted.org/packages/8e/b0/bf9020b56492281b9c9d8aae8f44ff51e1bc91b3ef5a884385cb4e389a40/pyspark-3.0.0.tar.gz (204.7MB)
Collecting modin[ray]==0.6.1
  Downloading https://files.pythonhosted.org/packages/4f/62/dbea5f16c685aa1bab65787562f4990d5b78caa915c7d323b47013c454ad/modin-0.6.1-py3-none-any.whl (230kB)
Collecting widgetsnbextension~=3.0.0
  Downloading https://files.pythonhosted.org/packages/8d/f2/c8bcccccbed39d51d3e237fb0c0f0c9bbc845d12afc41f5ca5f5728fffc7/widgetsnbextension-3.0.8-py2.py3-none-any.whl (2.2MB)
Requirement already satisfied: nbformat>=4.2.0 in /home/jenkins/.conda/envs/mango-build-28f035a6-d7ab-497f-aac5-d54b85a8a4c1/lib/python3.6/site-packages (from ipywidgets==7.0.0->-r requirements.txt (line 7)) (5.0.7)
Requirement already satisfied: attrs>=17.4.0 in /home/jenkins/.conda/envs/mango-build-28f035a6-d7ab-497f-aac5-d54b85a8a4c1/lib/python3.6/site-packages (from pytest==3.9.1->-r requirements.txt (line 9)) (19.3.0)
Collecting atomicwrites>=1.0
  Downloading https://files.pythonhosted.org/packages/2c/a0/da5f49008ec6e9a658dbf5d7310a4debd397bce0b4db03cf8a410066bb87/atomicwrites-1.4.0-py2.py3-none-any.whl
Collecting py>=1.5.0
  Downloading https://files.pythonhosted.org/packages/68/0f/41a43535b52a81e4f29e420a151032d26f08b62206840c48d14b70e53376/py-1.9.0-py2.py3-none-any.whl (99kB)
Collecting pluggy>=0.7
  Downloading https://files.pythonhosted.org/packages/a0/28/85c7aa31b80d150b772fbe4a229487bc6644da9ccb7e427dd8cc60cb8a62/pluggy-0.13.1-py2.py3-none-any.whl
Collecting more-itertools>=4.0.0
  Downloading https://files.pythonhosted.org/packages/ef/9b/6c35ec5483710492e21252465160ee508170159f7e0e2d6cd769022f52f6/more_itertools-8.4.0-py3-none-any.whl (43kB)
Requirement already satisfied: tornado in /home/jenkins/.conda/envs/mango-build-28f035a6-d7ab-497f-aac5-d54b85a8a4c1/lib/python3.6/site-packages (from jupyter_contrib_nbextensions->-r requirements.txt (line 10)) (6.0.4)
Collecting pyyaml
  Downloading https://files.pythonhosted.org/packages/64/c2/b80047c7ac2478f9501676c988a5411ed5572f35d1beff9cae07d321512c/PyYAML-5.3.1.tar.gz (269kB)
Collecting lxml
  Downloading https://files.pythonhosted.org/packages/79/37/d420b7fdc9a550bd29b8cfeacff3b38502d9600b09d7dfae9a69e623b891/lxml-4.5.2-cp36-cp36m-manylinux1_x86_64.whl (5.5MB)
Requirement already satisfied: ipython-genutils in /home/jenkins/.conda/envs/mango-build-28f035a6-d7ab-497f-aac5-d54b85a8a4c1/lib/python3.6/site-packages (from jupyter_contrib_nbextensions->-r requirements.txt (line 10)) (0.2.0)
Collecting jupyter-contrib-core>=0.3.3
  Downloading https://files.pythonhosted.org/packages/e6/8f/04a752a8b66a66e7092c035e5d87d2502ac7ec07f9fb6059059b6c0dc272/jupyter_contrib_core-0.3.3-py2.py3-none-any.whl
Requirement already satisfied: jupyter-core in /home/jenkins/.conda/envs/mango-build-28f035a6-d7ab-497f-aac5-d54b85a8a4c1/lib/python3.6/site-packages (from jupyter_contrib_nbextensions->-r requirements.txt (line 10)) (4.6.3)
Collecting jupyter-nbextensions-configurator>=0.4.0
  Downloading https://files.pythonhosted.org/packages/51/a3/d72d5f2dc10c5ccf5a6f4c79f636bf071a5ce462dedd07af2f70384db6cb/jupyter_nbextensions_configurator-0.4.1.tar.gz (479kB)
Collecting jupyter-highlight-selected-word>=0.1.1
  Downloading https://files.pythonhosted.org/packages/50/d7/19ab7cfd60bf268d2abbacc52d4295a40f52d74dfc0d938e4761ee5e598b/jupyter_highlight_selected_word-0.2.0-py2.py3-none-any.whl
Collecting jupyter-latex-envs>=1.3.8
  Downloading https://files.pythonhosted.org/packages/0e/15/55805de080d5542f76920364635e96e64d3b37f678befdfe3b16aa154205/jupyter_latex_envs-1.4.6.tar.gz (861kB)
Requirement already satisfied: ptyprocess>=0.5 in /home/jenkins/.conda/envs/mango-build-28f035a6-d7ab-497f-aac5-d54b85a8a4c1/lib/python3.6/site-packages (from pexpect; sys_platform != "win32"->ipython==7.8.0->-r requirements.txt (line 3)) (0.6.0)
Requirement already satisfied: wcwidth in /home/jenkins/.conda/envs/mango-build-28f035a6-d7ab-497f-aac5-d54b85a8a4c1/lib/python3.6/site-packages (from prompt-toolkit<2.1.0,>=2.0.0->ipython==7.8.0->-r requirements.txt (line 3)) (0.2.5)
Requirement already satisfied: parso<0.8.0,>=0.7.0 in /home/jenkins/.conda/envs/mango-build-28f035a6-d7ab-497f-aac5-d54b85a8a4c1/lib/python3.6/site-packages (from jedi>=0.10->ipython==7.8.0->-r requirements.txt (line 3)) (0.7.1)
Requirement already satisfied: jupyter-client in /home/jenkins/.conda/envs/mango-build-28f035a6-d7ab-497f-aac5-d54b85a8a4c1/lib/python3.6/site-packages (from ipykernel->jupyter==1.0.0->-r requirements.txt (line 4)) (6.1.6)
Requirement already satisfied: jinja2 in /home/jenkins/.conda/envs/mango-build-28f035a6-d7ab-497f-aac5-d54b85a8a4c1/lib/python3.6/site-packages (from notebook->jupyter==1.0.0->-r requirements.txt (line 4)) (2.11.2)
Requirement already satisfied: argon2-cffi in /home/jenkins/.conda/envs/mango-build-28f035a6-d7ab-497f-aac5-d54b85a8a4c1/lib/python3.6/site-packages (from notebook->jupyter==1.0.0->-r requirements.txt (line 4)) (20.1.0)
Requirement already satisfied: terminado>=0.8.3 in /home/jenkins/.conda/envs/mango-build-28f035a6-d7ab-497f-aac5-d54b85a8a4c1/lib/python3.6/site-packages (from notebook->jupyter==1.0.0->-r requirements.txt (line 4)) (0.8.3)
Requirement already satisfied: prometheus-client in /home/jenkins/.conda/envs/mango-build-28f035a6-d7ab-497f-aac5-d54b85a8a4c1/lib/python3.6/site-packages (from notebook->jupyter==1.0.0->-r requirements.txt (line 4)) (0.8.0)
Requirement already satisfied: Send2Trash in /home/jenkins/.conda/envs/mango-build-28f035a6-d7ab-497f-aac5-d54b85a8a4c1/lib/python3.6/site-packages (from notebook->jupyter==1.0.0->-r requirements.txt (line 4)) (1.5.0)
Requirement already satisfied: pyzmq>=17 in /home/jenkins/.conda/envs/mango-build-28f035a6-d7ab-497f-aac5-d54b85a8a4c1/lib/python3.6/site-packages (from notebook->jupyter==1.0.0->-r requirements.txt (line 4)) (19.0.2)
Requirement already satisfied: entrypoints>=0.2.2 in /home/jenkins/.conda/envs/mango-build-28f035a6-d7ab-497f-aac5-d54b85a8a4c1/lib/python3.6/site-packages (from nbconvert->jupyter==1.0.0->-r requirements.txt (line 4)) (0.3)
Requirement already satisfied: defusedxml in /home/jenkins/.conda/envs/mango-build-28f035a6-d7ab-497f-aac5-d54b85a8a4c1/lib/python3.6/site-packages (from nbconvert->jupyter==1.0.0->-r requirements.txt (line 4)) (0.6.0)
Requirement already satisfied: mistune<2,>=0.8.1 in /home/jenkins/.conda/envs/mango-build-28f035a6-d7ab-497f-aac5-d54b85a8a4c1/lib/python3.6/site-packages (from nbconvert->jupyter==1.0.0->-r requirements.txt (line 4)) (0.8.4)
Requirement already satisfied: pandocfilters>=1.4.1 in /home/jenkins/.conda/envs/mango-build-28f035a6-d7ab-497f-aac5-d54b85a8a4c1/lib/python3.6/site-packages (from nbconvert->jupyter==1.0.0->-r requirements.txt (line 4)) (1.4.2)
Requirement already satisfied: testpath in /home/jenkins/.conda/envs/mango-build-28f035a6-d7ab-497f-aac5-d54b85a8a4c1/lib/python3.6/site-packages (from nbconvert->jupyter==1.0.0->-r requirements.txt (line 4)) (0.4.4)
Requirement already satisfied: bleach in /home/jenkins/.conda/envs/mango-build-28f035a6-d7ab-497f-aac5-d54b85a8a4c1/lib/python3.6/site-packages (from nbconvert->jupyter==1.0.0->-r requirements.txt (line 4)) (3.1.5)
Collecting qtpy
  Downloading https://files.pythonhosted.org/packages/cd/fd/9972948f02e967b691cc0ca1f26124826a3b88cb38f412a8b7935b8c3c72/QtPy-1.9.0-py2.py3-none-any.whl (54kB)
Collecting py4j==0.10.9
  Downloading https://files.pythonhosted.org/packages/9e/b6/6a4fb90cd235dc8e265a6a2067f2a2c99f0d91787f06aca4bcf7c23f3f80/py4j-0.10.9-py2.py3-none-any.whl (198kB)
Collecting pandas==0.25.1
  Downloading https://files.pythonhosted.org/packages/73/9b/52e228545d14f14bb2a1622e225f38463c8726645165e1cb7dde95bfe6d4/pandas-0.25.1-cp36-cp36m-manylinux1_x86_64.whl (10.5MB)
Collecting ray==0.7.3; extra == "ray"
  Downloading https://files.pythonhosted.org/packages/a7/21/de080b8458de41fd8ac20dd96547418c0ed94eab4359e5885f4041d61337/ray-0.7.3-cp36-cp36m-manylinux1_x86_64.whl (48.5MB)
Requirement already satisfied: jsonschema!=2.5.0,>=2.4 in /home/jenkins/.conda/envs/mango-build-28f035a6-d7ab-497f-aac5-d54b85a8a4c1/lib/python3.6/site-packages (from nbformat>=4.2.0->ipywidgets==7.0.0->-r requirements.txt (line 7)) (3.2.0)
Requirement already satisfied: importlib-metadata>=0.12; python_version < "3.8" in /home/jenkins/.conda/envs/mango-build-28f035a6-d7ab-497f-aac5-d54b85a8a4c1/lib/python3.6/site-packages (from pluggy>=0.7->pytest==3.9.1->-r requirements.txt (line 9)) (1.7.0)
Requirement already satisfied: MarkupSafe>=0.23 in /home/jenkins/.conda/envs/mango-build-28f035a6-d7ab-497f-aac5-d54b85a8a4c1/lib/python3.6/site-packages (from jinja2->notebook->jupyter==1.0.0->-r requirements.txt (line 4)) (1.1.1)
Requirement already satisfied: cffi>=1.0.0 in /home/jenkins/.conda/envs/mango-build-28f035a6-d7ab-497f-aac5-d54b85a8a4c1/lib/python3.6/site-packages (from argon2-cffi->notebook->jupyter==1.0.0->-r requirements.txt (line 4)) (1.14.1)
Requirement already satisfied: webencodings in /home/jenkins/.conda/envs/mango-build-28f035a6-d7ab-497f-aac5-d54b85a8a4c1/lib/python3.6/site-packages (from bleach->nbconvert->jupyter==1.0.0->-r requirements.txt (line 4)) (0.5.1)
Requirement already satisfied: packaging in /home/jenkins/.conda/envs/mango-build-28f035a6-d7ab-497f-aac5-d54b85a8a4c1/lib/python3.6/site-packages (from bleach->nbconvert->jupyter==1.0.0->-r requirements.txt (line 4)) (20.4)
Collecting filelock
  Downloading https://files.pythonhosted.org/packages/93/83/71a2ee6158bb9f39a90c0dea1637f81d5eef866e188e1971a1b1ab01a35a/filelock-3.0.12-py3-none-any.whl
Collecting protobuf>=3.8.0
  Downloading https://files.pythonhosted.org/packages/30/79/510974552cebff2ba04038544799450defe75e96ea5f1675dbf72cc8744f/protobuf-3.13.0-cp36-cp36m-manylinux1_x86_64.whl (1.3MB)
Collecting colorama
  Downloading https://files.pythonhosted.org/packages/c9/dc/45cdef1b4d119eb96316b3117e6d5708a08029992b2fee2c143c7a0a5cc5/colorama-0.4.3-py2.py3-none-any.whl
Collecting funcsigs
  Downloading https://files.pythonhosted.org/packages/69/cb/f5be453359271714c01b9bd06126eaf2e368f1fddfff30818754b5ac2328/funcsigs-1.0.2-py2.py3-none-any.whl
Collecting redis
  Downloading https://files.pythonhosted.org/packages/a7/7c/24fb0511df653cf1a5d938d8f5d19802a88cef255706fdda242ff97e91b7/redis-3.5.3-py2.py3-none-any.whl (72kB)
Collecting click
  Downloading https://files.pythonhosted.org/packages/d2/3d/fa76db83bf75c4f8d338c2fd15c8d33fdd7ad23a9b5e57eb6c5de26b430e/click-7.1.2-py2.py3-none-any.whl (82kB)
Requirement already satisfied: pyrsistent>=0.14.0 in /home/jenkins/.conda/envs/mango-build-28f035a6-d7ab-497f-aac5-d54b85a8a4c1/lib/python3.6/site-packages (from jsonschema!=2.5.0,>=2.4->nbformat>=4.2.0->ipywidgets==7.0.0->-r requirements.txt (line 7)) (0.16.0)
Requirement already satisfied: zipp>=0.5 in /home/jenkins/.conda/envs/mango-build-28f035a6-d7ab-497f-aac5-d54b85a8a4c1/lib/python3.6/site-packages (from importlib-metadata>=0.12; python_version < "3.8"->pluggy>=0.7->pytest==3.9.1->-r requirements.txt (line 9)) (3.1.0)
Requirement already satisfied: pycparser in /home/jenkins/.conda/envs/mango-build-28f035a6-d7ab-497f-aac5-d54b85a8a4c1/lib/python3.6/site-packages (from cffi>=1.0.0->argon2-cffi->notebook->jupyter==1.0.0->-r requirements.txt (line 4)) (2.20)
Building wheels for collected packages: cigar, bdgenomics.adam, bdgenomics.mango.pileup, psutil, pyspark, pyyaml, jupyter-nbextensions-configurator, jupyter-latex-envs
  Building wheel for cigar (setup.py): started
  Building wheel for cigar (setup.py): finished with status 'done'
  Created wheel for cigar: filename=cigar-0.1.3-cp36-none-any.whl size=4024 sha256=06e1913fcaa1f1dd3f908910781cb29fdad18368fc7e5cff54fcc027c15bf121
  Stored in directory: /home/jenkins/.cache/pip/wheels/eb/c0/e6/f0f525ada263f7f72f4b3efcc7f5b3c12a372f07f55a2d687d
  Building wheel for bdgenomics.adam (setup.py): started
  Building wheel for bdgenomics.adam (setup.py): finished with status 'done'
  Created wheel for bdgenomics.adam: filename=bdgenomics.adam-0.30.0-cp36-none-any.whl size=39575669 sha256=b9342a29b9f22b7a3c71c812697af933a3d41270e29d3ddbbc2249dd2524a363
  Stored in directory: /home/jenkins/.cache/pip/wheels/06/70/62/114cc2bb8d85bfc915d4571adb8f94cc558fdeef2bc09d61ee
  Building wheel for bdgenomics.mango.pileup (setup.py): started
  Building wheel for bdgenomics.mango.pileup (setup.py): finished with status 'done'
  Created wheel for bdgenomics.mango.pileup: filename=bdgenomics.mango.pileup-0.0.6a0-cp36-none-any.whl size=1798435 sha256=86500736f7e24723f500f4257020d5f8774ca4602110a3cd047320083463efe0
  Stored in directory: /home/jenkins/.cache/pip/wheels/ec/df/8e/7e6efc45fd34e2850763a5ec5ac7f27052424d26105f12f971
  Building wheel for psutil (setup.py): started
  Building wheel for psutil (setup.py): finished with status 'done'
  Created wheel for psutil: filename=psutil-5.7.2-cp36-cp36m-linux_x86_64.whl size=279917 sha256=18f7fa8761fa3e8a964353f82c1e127c50916ab0d9e39c593a2ef54315ad8702
  Stored in directory: /home/jenkins/.cache/pip/wheels/39/a0/f5/c4fa280463e29aea07797acb5312358fefb067c1f4f98e11b1
  Building wheel for pyspark (setup.py): started
  Building wheel for pyspark (setup.py): finished with status 'done'
  Created wheel for pyspark: filename=pyspark-3.0.0-py2.py3-none-any.whl size=205044184 sha256=da2ae30934a05759e48ff002e5c3e4c05a3bc97461ded5cd28299edfd707f30b
  Stored in directory: /home/jenkins/.cache/pip/wheels/57/27/4d/ddacf7143f8d5b76c45c61ee2e43d9f8492fc5a8e78ebd7d37
  Building wheel for pyyaml (setup.py): started
  Building wheel for pyyaml (setup.py): finished with status 'done'
  Created wheel for pyyaml: filename=PyYAML-5.3.1-cp36-cp36m-linux_x86_64.whl size=44619 sha256=fde47ab1010d18a9dd2c13813f54353b0ea62bc2c75e9202787938432d54142c
  Stored in directory: /home/jenkins/.cache/pip/wheels/a7/c1/ea/cf5bd31012e735dc1dfea3131a2d5eae7978b251083d6247bd
  Building wheel for jupyter-nbextensions-configurator (setup.py): started
  Building wheel for jupyter-nbextensions-configurator (setup.py): finished with status 'done'
  Created wheel for jupyter-nbextensions-configurator: filename=jupyter_nbextensions_configurator-0.4.1-py2.py3-none-any.whl size=465825 sha256=4ecd14834e124f558462e1e5c9fa8c55c0b2ec3fbe60c160c1c73bd8e58e8458
  Stored in directory: /home/jenkins/.cache/pip/wheels/15/df/fe/2a74fe34709e7fdc5ae153a768675d9fda93cc7d5133ed1fb0
  Building wheel for jupyter-latex-envs (setup.py): started
  Building wheel for jupyter-latex-envs (setup.py): finished with status 'done'
  Created wheel for jupyter-latex-envs: filename=jupyter_latex_envs-1.4.6-py2.py3-none-any.whl size=963395 sha256=917b2d9cd4f039d2ec4c381e21a2a722fe876dfcf4db82721810c6a2d8847973
  Stored in directory: /home/jenkins/.cache/pip/wheels/0d/71/2a/164491997299b9f2479a251e254323fe35d946779e18f27956
Successfully built cigar bdgenomics.adam bdgenomics.mango.pileup psutil pyspark pyyaml jupyter-nbextensions-configurator jupyter-latex-envs
ERROR: bdgenomics-mango-pileup 0.0.6a0 has requirement pytest==2.8.3, but you'll have pytest 3.9.1 which is incompatible.
ERROR: bdgenomics-mango-pileup 0.0.6a0 has requirement six==1.11.0, but you'll have six 1.15.0 which is incompatible.
Installing collected packages: cigar, pytz, numpy, cycler, matplotlib, prompt-toolkit, ipython, jupyter-console, qtpy, qtconsole, widgetsnbextension, ipywidgets, jupyter, py4j, pyspark, bdgenomics.adam, pandas, pyyaml, filelock, protobuf, colorama, funcsigs, redis, atomicwrites, py, pluggy, more-itertools, pytest, click, ray, modin, bdgenomics.mango.pileup, psutil, lxml, jupyter-contrib-core, jupyter-nbextensions-configurator, jupyter-highlight-selected-word, jupyter-latex-envs, jupyter-contrib-nbextensions
  Found existing installation: prompt-toolkit 3.0.6
    Uninstalling prompt-toolkit-3.0.6:
      Successfully uninstalled prompt-toolkit-3.0.6
  Found existing installation: ipython 7.16.1
    Uninstalling ipython-7.16.1:
      Successfully uninstalled ipython-7.16.1
Successfully installed atomicwrites-1.4.0 bdgenomics.adam-0.30.0 bdgenomics.mango.pileup-0.0.6a0 cigar-0.1.3 click-7.1.2 colorama-0.4.3 cycler-0.10.0 filelock-3.0.12 funcsigs-1.0.2 ipython-7.8.0 ipywidgets-7.0.0 jupyter-1.0.0 jupyter-console-6.1.0 jupyter-contrib-core-0.3.3 jupyter-contrib-nbextensions-0.5.1 jupyter-highlight-selected-word-0.2.0 jupyter-latex-envs-1.4.6 jupyter-nbextensions-configurator-0.4.1 lxml-4.5.2 matplotlib-2.0.2 modin-0.6.1 more-itertools-8.4.0 numpy-1.19.1 pandas-0.25.1 pluggy-0.13.1 prompt-toolkit-2.0.10 protobuf-3.13.0 psutil-5.7.2 py-1.9.0 py4j-0.10.9 pyspark-3.0.0 pytest-3.9.1 pytz-2020.1 pyyaml-5.3.1 qtconsole-4.7.6 qtpy-1.9.0 ray-0.7.3 redis-3.5.3 widgetsnbextension-3.0.8
+ popd
+ mvn -U -P python,distribution package -DskipTests -Dhadoop.version=2.7.5 -Dspark.version=2.4.6
/tmp/mangoTestD0h5221/deleteMePleaseThisIsNoLongerNeeded /home
OpenJDK 64-Bit Server VM warning: ignoring option MaxPermSize=1g; support was removed in 8.0
[INFO] Scanning for projects...
[WARNING] 
[WARNING] Some problems were encountered while building the effective model for org.bdgenomics.mango:mango-core-spark3_2.12:jar:0.0.6-SNAPSHOT
[WARNING] 'artifactId' contains an expression but should be a constant. @ org.bdgenomics.mango:mango-core-spark3_${scala.version.prefix}:[unknown-version], /tmp/mangoTestD0h5221/deleteMePleaseThisIsNoLongerNeeded/mango-core/pom.xml, line 11, column 15
[WARNING] 'artifactId' contains an expression but should be a constant. @ org.bdgenomics.mango:mango-parent-spark3_${scala.version.prefix}:0.0.6-SNAPSHOT, /tmp/mangoTestD0h5221/deleteMePleaseThisIsNoLongerNeeded/pom.xml, line 13, column 15
[WARNING] 
[WARNING] Some problems were encountered while building the effective model for org.bdgenomics.mango:mango-python-spark3_2.12:jar:0.0.6-SNAPSHOT
[WARNING] 'artifactId' contains an expression but should be a constant. @ org.bdgenomics.mango:mango-python-spark3_${scala.version.prefix}:[unknown-version], /tmp/mangoTestD0h5221/deleteMePleaseThisIsNoLongerNeeded/mango-python/pom.xml, line 11, column 15
[WARNING] 
[WARNING] Some problems were encountered while building the effective model for org.bdgenomics.mango:mango-cli-spark3_2.12:jar:0.0.6-SNAPSHOT
[WARNING] 'artifactId' contains an expression but should be a constant. @ org.bdgenomics.mango:mango-cli-spark3_${scala.version.prefix}:[unknown-version], /tmp/mangoTestD0h5221/deleteMePleaseThisIsNoLongerNeeded/mango-cli/pom.xml, line 11, column 15
[WARNING] 
[WARNING] Some problems were encountered while building the effective model for org.bdgenomics.mango:mango-assembly-spark3_2.12:jar:0.0.6-SNAPSHOT
[WARNING] 'artifactId' contains an expression but should be a constant. @ org.bdgenomics.mango:mango-assembly-spark3_${scala.version.prefix}:[unknown-version], /tmp/mangoTestD0h5221/deleteMePleaseThisIsNoLongerNeeded/mango-assembly/pom.xml, line 11, column 15
[WARNING] 
[WARNING] Some problems were encountered while building the effective model for org.bdgenomics.mango:mango-distribution-spark3_2.12:pom:0.0.6-SNAPSHOT
[WARNING] 'artifactId' contains an expression but should be a constant. @ org.bdgenomics.mango:mango-distribution-spark3_${scala.version.prefix}:[unknown-version], /tmp/mangoTestD0h5221/deleteMePleaseThisIsNoLongerNeeded/mango-distribution/pom.xml, line 11, column 15
[WARNING] 
[WARNING] Some problems were encountered while building the effective model for org.bdgenomics.mango:mango-parent-spark3_2.12:pom:0.0.6-SNAPSHOT
[WARNING] 'artifactId' contains an expression but should be a constant. @ org.bdgenomics.mango:mango-parent-spark3_${scala.version.prefix}:0.0.6-SNAPSHOT, /tmp/mangoTestD0h5221/deleteMePleaseThisIsNoLongerNeeded/pom.xml, line 13, column 15
[WARNING] 
[WARNING] It is highly recommended to fix these problems because they threaten the stability of your build.
[WARNING] 
[WARNING] For this reason, future Maven versions might no longer support building such malformed projects.
[WARNING] 
[INFO] ------------------------------------------------------------------------
[INFO] Reactor Build Order:
[INFO] 
[INFO] mango_2.12: CORE                                                   [jar]
[INFO] Mango_2.12: Python APIs                                            [jar]
[INFO] mango_2.12: CLI                                                    [jar]
[INFO] Mango_2.12: Assembly                                               [jar]
[INFO] mango_2.12: Distribution                                           [pom]
[INFO] mango_2.12                                                         [pom]
[INFO] 
[INFO] ------------< org.bdgenomics.mango:mango-core-spark3_2.12 >-------------
[INFO] Building mango_2.12: CORE 0.0.6-SNAPSHOT                           [1/6]
[INFO] --------------------------------[ jar ]---------------------------------
[INFO] 
[INFO] --- maven-enforcer-plugin:1.0:enforce (enforce-versions) @ mango-core-spark3_2.12 ---
[INFO] 
[INFO] --- maven-enforcer-plugin:1.0:enforce (enforce-maven) @ mango-core-spark3_2.12 ---
[INFO] 
[INFO] --- build-helper-maven-plugin:1.10:add-source (add-source) @ mango-core-spark3_2.12 ---
[INFO] Source directory: /tmp/mangoTestD0h5221/deleteMePleaseThisIsNoLongerNeeded/mango-core/src/main/scala added.
[INFO] 
[INFO] --- scalariform-maven-plugin:0.1.4:format (default) @ mango-core-spark3_2.12 ---
[INFO] Modified 0 of 32 .scala files
[INFO] 
[INFO] --- maven-resources-plugin:3.1.0:resources (default-resources) @ mango-core-spark3_2.12 ---
[INFO] Using 'UTF-8' encoding to copy filtered resources.
[INFO] skip non existing resourceDirectory /tmp/mangoTestD0h5221/deleteMePleaseThisIsNoLongerNeeded/mango-core/src/main/resources
[INFO] 
[INFO] --- scala-maven-plugin:3.2.2:compile (scala-compile-first) @ mango-core-spark3_2.12 ---
[WARNING]  Expected all dependencies to require Scala version: 2.12.8
[WARNING]  net.liftweb:lift-json_2.12:3.3.0 requires scala version: 2.12.6
[WARNING] Multiple versions of scala libraries detected!
[INFO] Nothing to compile - all classes are up to date
[INFO] 
[INFO] --- maven-compiler-plugin:3.8.0:compile (default-compile) @ mango-core-spark3_2.12 ---
[INFO] Nothing to compile - all classes are up to date
[INFO] 
[INFO] --- build-helper-maven-plugin:1.10:add-test-source (add-test-source) @ mango-core-spark3_2.12 ---
[INFO] Test Source directory: /tmp/mangoTestD0h5221/deleteMePleaseThisIsNoLongerNeeded/mango-core/src/test/scala added.
[INFO] 
[INFO] --- maven-resources-plugin:3.1.0:testResources (default-testResources) @ mango-core-spark3_2.12 ---
[INFO] Using 'UTF-8' encoding to copy filtered resources.
[INFO] Copying 24 resources
[INFO] 
[INFO] --- scala-maven-plugin:3.2.2:testCompile (scala-test-compile-first) @ mango-core-spark3_2.12 ---
[WARNING]  Expected all dependencies to require Scala version: 2.12.8
[WARNING]  net.liftweb:lift-json_2.12:3.3.0 requires scala version: 2.12.6
[WARNING] Multiple versions of scala libraries detected!
[INFO] Nothing to compile - all classes are up to date
[INFO] 
[INFO] --- maven-compiler-plugin:3.8.0:testCompile (default-testCompile) @ mango-core-spark3_2.12 ---
[INFO] Nothing to compile - all classes are up to date
[INFO] 
[INFO] --- maven-surefire-plugin:3.0.0-M3:test (default-test) @ mango-core-spark3_2.12 ---
[INFO] Tests are skipped.
[INFO] 
[INFO] --- scalatest-maven-plugin:2.0.0:test (test) @ mango-core-spark3_2.12 ---
[INFO] Tests are skipped.
[INFO] 
[INFO] --- maven-jar-plugin:3.1.2:jar (default-jar) @ mango-core-spark3_2.12 ---
[INFO] Building jar: /tmp/mangoTestD0h5221/deleteMePleaseThisIsNoLongerNeeded/mango-core/target/mango-core-spark3_2.12-0.0.6-SNAPSHOT.jar
[INFO] 
[INFO] --- maven-source-plugin:3.0.1:jar-no-fork (attach-sources) @ mango-core-spark3_2.12 ---
[INFO] Building jar: /tmp/mangoTestD0h5221/deleteMePleaseThisIsNoLongerNeeded/mango-core/target/mango-core-spark3_2.12-0.0.6-SNAPSHOT-sources.jar
[INFO] 
[INFO] --- maven-javadoc-plugin:3.1.0:jar (attach-javadocs) @ mango-core-spark3_2.12 ---
[INFO] 
[INFO] >>> scala-maven-plugin:3.2.2:doc-jar (attach-scaladocs) > generate-sources @ mango-core-spark3_2.12 >>>
[INFO] 
[INFO] --- maven-enforcer-plugin:1.0:enforce (enforce-versions) @ mango-core-spark3_2.12 ---
[INFO] 
[INFO] --- maven-enforcer-plugin:1.0:enforce (enforce-maven) @ mango-core-spark3_2.12 ---
[INFO] 
[INFO] --- build-helper-maven-plugin:1.10:add-source (add-source) @ mango-core-spark3_2.12 ---
[INFO] Source directory: /tmp/mangoTestD0h5221/deleteMePleaseThisIsNoLongerNeeded/mango-core/src/main/scala added.
[INFO] 
[INFO] <<< scala-maven-plugin:3.2.2:doc-jar (attach-scaladocs) < generate-sources @ mango-core-spark3_2.12 <<<
[INFO] 
[INFO] 
[INFO] --- scala-maven-plugin:3.2.2:doc-jar (attach-scaladocs) @ mango-core-spark3_2.12 ---
[WARNING]  Expected all dependencies to require Scala version: 2.12.8
[WARNING]  net.liftweb:lift-json_2.12:3.3.0 requires scala version: 2.12.6
[WARNING] Multiple versions of scala libraries detected!
[WARNING]  Expected all dependencies to require Scala version: 2.12.8
[WARNING]  net.liftweb:lift-json_2.12:3.3.0 requires scala version: 2.12.6
[WARNING] Multiple versions of scala libraries detected!
model contains 41 documentable templates
/tmp/mangoTestD0h5221/deleteMePleaseThisIsNoLongerNeeded/mango-core/src/main/scala/org/bdgenomics/mango/util/GenomeConfig.scala:55: warning: Variable GENOME undefined in comment for object GenomeConfig in object GenomeConfig
 * - chrom.sizes file: downloaded from http://hgdownload.cse.ucsc.edu/goldenPath/${GENOME}/bigZips/${GENOME}.chrom.sizes
                                                                                  ^
/tmp/mangoTestD0h5221/deleteMePleaseThisIsNoLongerNeeded/mango-core/src/main/scala/org/bdgenomics/mango/util/GenomeConfig.scala:55: warning: Variable GENOME undefined in comment for object GenomeConfig in object GenomeConfig
 * - chrom.sizes file: downloaded from http://hgdownload.cse.ucsc.edu/goldenPath/${GENOME}/bigZips/${GENOME}.chrom.sizes
                                                                                                    ^
/tmp/mangoTestD0h5221/deleteMePleaseThisIsNoLongerNeeded/mango-core/src/main/scala/org/bdgenomics/mango/util/GenomeConfig.scala:56: warning: Variable GENOME undefined in comment for object GenomeConfig in object GenomeConfig
 * - cytoBand.txt file: downloaded from http://hgdownload.cse.ucsc.edu/goldenpath/${GENOME}/database/cytoBand.txt.gz
                                                                                   ^
/tmp/mangoTestD0h5221/deleteMePleaseThisIsNoLongerNeeded/mango-core/src/main/scala/org/bdgenomics/mango/util/GenomeConfig.scala:57: warning: Variable GENOME undefined in comment for object GenomeConfig in object GenomeConfig
 * - refSeq.txt file: downloaded from http://hgdownload.soe.ucsc.edu/goldenPath/${GENOME}/database/refGene.txt.gz
                                                                                 ^
/tmp/mangoTestD0h5221/deleteMePleaseThisIsNoLongerNeeded/mango-core/src/main/scala/org/bdgenomics/mango/util/RefSeq.scala:29: warning: Variable GENOME undefined in comment for object RefSeqFile in object RefSeqFile
 * Processes refSeq file, downloaded from http://hgdownload.soe.ucsc.edu/goldenPath/${GENOME}/database/refGene.txt.gz
                                                                                     ^
/tmp/mangoTestD0h5221/deleteMePleaseThisIsNoLongerNeeded/mango-core/src/main/scala/org/bdgenomics/mango/io/HttpDownloadUtility.scala:34: warning: Could not find any member to link for "IOException".
  /**
  ^
6 warnings found
[INFO] Building jar: /tmp/mangoTestD0h5221/deleteMePleaseThisIsNoLongerNeeded/mango-core/target/mango-core-spark3_2.12-0.0.6-SNAPSHOT-javadoc.jar
[INFO] 
[INFO] -----------< org.bdgenomics.mango:mango-python-spark3_2.12 >------------
[INFO] Building Mango_2.12: Python APIs 0.0.6-SNAPSHOT                    [2/6]
[INFO] --------------------------------[ jar ]---------------------------------
[INFO] 
[INFO] --- maven-enforcer-plugin:1.0:enforce (enforce-versions) @ mango-python-spark3_2.12 ---
[INFO] 
[INFO] --- maven-enforcer-plugin:1.0:enforce (enforce-maven) @ mango-python-spark3_2.12 ---
[INFO] 
[INFO] --- scalariform-maven-plugin:0.1.4:format (default) @ mango-python-spark3_2.12 ---
[INFO] Modified 0 of 0 .scala files
[INFO] 
[INFO] --- maven-resources-plugin:3.1.0:resources (default-resources) @ mango-python-spark3_2.12 ---
[INFO] Using 'UTF-8' encoding to copy filtered resources.
[INFO] skip non existing resourceDirectory /tmp/mangoTestD0h5221/deleteMePleaseThisIsNoLongerNeeded/mango-python/src/main/resources
[INFO] 
[INFO] --- scala-maven-plugin:3.2.2:compile (scala-compile-first) @ mango-python-spark3_2.12 ---
[INFO] No sources to compile
[INFO] 
[INFO] --- exec-maven-plugin:1.6.0:exec (dev-python) @ mango-python-spark3_2.12 ---
bash: /home/jenkins/.conda/envs/mango-build-28f035a6-d7ab-497f-aac5-d54b85a8a4c1/bin/python: Invalid argument
pip install -e .
bash: /home/jenkins/.conda/envs/mango-build-28f035a6-d7ab-497f-aac5-d54b85a8a4c1/bin/pip: /home/jenkins/.conda/envs/mango-build-28f035a6-d7ab-497f-aac5-d54b85a8a4c1/bin/python: bad interpreter: Invalid argument
make: *** [develop] Error 126
Makefile:69: recipe for target 'develop' failed
[ERROR] Command execution failed.
org.apache.commons.exec.ExecuteException: Process exited with an error: 2 (Exit value: 2)
    at org.apache.commons.exec.DefaultExecutor.executeInternal (DefaultExecutor.java:404)
    at org.apache.commons.exec.DefaultExecutor.execute (DefaultExecutor.java:166)
    at org.codehaus.mojo.exec.ExecMojo.executeCommandLine (ExecMojo.java:804)
    at org.codehaus.mojo.exec.ExecMojo.executeCommandLine (ExecMojo.java:751)
    at org.codehaus.mojo.exec.ExecMojo.execute (ExecMojo.java:313)
    at org.apache.maven.plugin.DefaultBuildPluginManager.executeMojo (DefaultBuildPluginManager.java:137)
    at org.apache.maven.lifecycle.internal.MojoExecutor.execute (MojoExecutor.java:210)
    at org.apache.maven.lifecycle.internal.MojoExecutor.execute (MojoExecutor.java:156)
    at org.apache.maven.lifecycle.internal.MojoExecutor.execute (MojoExecutor.java:148)
    at org.apache.maven.lifecycle.internal.LifecycleModuleBuilder.buildProject (LifecycleModuleBuilder.java:117)
    at org.apache.maven.lifecycle.internal.LifecycleModuleBuilder.buildProject (LifecycleModuleBuilder.java:81)
    at org.apache.maven.lifecycle.internal.builder.singlethreaded.SingleThreadedBuilder.build (SingleThreadedBuilder.java:56)
    at org.apache.maven.lifecycle.internal.LifecycleStarter.execute (LifecycleStarter.java:128)
    at org.apache.maven.DefaultMaven.doExecute (DefaultMaven.java:305)
    at org.apache.maven.DefaultMaven.doExecute (DefaultMaven.java:192)
    at org.apache.maven.DefaultMaven.execute (DefaultMaven.java:105)
    at org.apache.maven.cli.MavenCli.execute (MavenCli.java:956)
    at org.apache.maven.cli.MavenCli.doMain (MavenCli.java:288)
    at org.apache.maven.cli.MavenCli.main (MavenCli.java:192)
    at sun.reflect.NativeMethodAccessorImpl.invoke0 (Native Method)
    at sun.reflect.NativeMethodAccessorImpl.invoke (NativeMethodAccessorImpl.java:62)
    at sun.reflect.DelegatingMethodAccessorImpl.invoke (DelegatingMethodAccessorImpl.java:43)
    at java.lang.reflect.Method.invoke (Method.java:498)
    at org.codehaus.plexus.classworlds.launcher.Launcher.launchEnhanced (Launcher.java:289)
    at org.codehaus.plexus.classworlds.launcher.Launcher.launch (Launcher.java:229)
    at org.codehaus.plexus.classworlds.launcher.Launcher.mainWithExitCode (Launcher.java:415)
    at org.codehaus.plexus.classworlds.launcher.Launcher.main (Launcher.java:356)
[INFO] ------------------------------------------------------------------------
[INFO] Reactor Summary for mango_2.12 0.0.6-SNAPSHOT:
[INFO] 
[INFO] mango_2.12: CORE ................................... SUCCESS [ 18.230 s]
[INFO] Mango_2.12: Python APIs ............................ FAILURE [  0.193 s]
[INFO] mango_2.12: CLI .................................... SKIPPED
[INFO] Mango_2.12: Assembly ............................... SKIPPED
[INFO] mango_2.12: Distribution ........................... SKIPPED
[INFO] mango_2.12 ......................................... SKIPPED
[INFO] ------------------------------------------------------------------------
[INFO] BUILD FAILURE
[INFO] ------------------------------------------------------------------------
[INFO] Total time:  18.684 s
[INFO] Finished at: 2020-08-19T03:22:49Z
[INFO] ------------------------------------------------------------------------
[ERROR] Failed to execute goal org.codehaus.mojo:exec-maven-plugin:1.6.0:exec (dev-python) on project mango-python-spark3_2.12: Command execution failed.: Process exited with an error: 2 (Exit value: 2) -> [Help 1]
[ERROR] 
[ERROR] To see the full stack trace of the errors, re-run Maven with the -e switch.
[ERROR] Re-run Maven using the -X switch to enable full debug logging.
[ERROR] 
[ERROR] For more information about the errors and possible solutions, please read the following articles:
[ERROR] [Help 1] http://cwiki.apache.org/confluence/display/MAVEN/MojoExecutionException
[ERROR] 
[ERROR] After correcting the problems, you can resume the build with the command
[ERROR]   mvn <goals> -rf :mango-python-spark3_2.12
clean_up
+ clean_up
+ set +x +v
DeprecationWarning: 'source deactivate' is deprecated. Use 'conda deactivate'.

## Package Plan ##

  environment location: /home/jenkins/.conda/envs/mango-build-28f035a6-d7ab-497f-aac5-d54b85a8a4c1


The following packages will be REMOVED:

  _libgcc_mutex-0.1-conda_forge
  _openmp_mutex-4.5-1_gnu
  argon2-cffi-20.1.0-py36h8c4c3a4_1
  attrs-19.3.0-py_0
  backcall-0.2.0-pyh9f0ad1d_0
  backports-1.0-py_2
  backports.functools_lru_cache-1.6.1-py_0
  bleach-3.1.5-pyh9f0ad1d_0
  brotlipy-0.7.0-py36h8c4c3a4_1000
  ca-certificates-2020.6.24-0
  certifi-2020.6.20-py36_0
  cffi-1.14.1-py36h0ff685e_0
  chardet-3.0.4-py36h9f0ad1d_1006
  cryptography-3.0-py36h45558ae_0
  decorator-4.4.2-py_0
  defusedxml-0.6.0-py_0
  entrypoints-0.3-py36h9f0ad1d_1001
  idna-2.10-pyh9f0ad1d_0
  importlib-metadata-1.7.0-py36h9f0ad1d_0
  importlib_metadata-1.7.0-0
  ipykernel-5.3.4-py36h95af2a2_0
  ipython-7.16.1-py36h95af2a2_0
  ipython_genutils-0.2.0-py_1
  jedi-0.17.2-py36h9f0ad1d_0
  jinja2-2.11.2-pyh9f0ad1d_0
  json5-0.9.4-pyh9f0ad1d_0
  jsonschema-3.2.0-py36h9f0ad1d_1
  jupyter_client-6.1.6-py_0
  jupyter_core-4.6.3-py36h9f0ad1d_1
  jupyterlab-2.0.1-py_0
  jupyterlab_server-1.2.0-py_0
  ld_impl_linux-64-2.34-hc38a660_9
  libffi-3.2.1-he1b5a44_1007
  libgcc-ng-9.3.0-h24d8f2e_15
  libgomp-9.3.0-h24d8f2e_15
  libsodium-1.0.18-h516909a_0
  libstdcxx-ng-9.3.0-hdf63c60_15
  markupsafe-1.1.1-py36h8c4c3a4_1
  mistune-0.8.4-py36h8c4c3a4_1001
  nbconvert-5.6.1-py36h9f0ad1d_1
  nbformat-5.0.7-py_0
  ncurses-6.2-he1b5a44_1
  nodejs-10.13.0-he6710b0_0
  notebook-6.1.3-py36h9f0ad1d_0
  openssl-1.1.1g-h7b6447c_0
  packaging-20.4-pyh9f0ad1d_0
  pandoc-2.10.1-h516909a_0
  pandocfilters-1.4.2-py_1
  parso-0.7.1-pyh9f0ad1d_0
  pexpect-4.8.0-py36h9f0ad1d_1
  pickleshare-0.7.5-py36h9f0ad1d_1001
  pip-19.3.1-py36_0
  prometheus_client-0.8.0-pyh9f0ad1d_0
  prompt-toolkit-3.0.6-py_0
  ptyprocess-0.6.0-py_1001
  pycparser-2.20-pyh9f0ad1d_2
  pygments-2.6.1-py_0
  pyopenssl-19.1.0-py_1
  pyparsing-2.4.7-pyh9f0ad1d_0
  pyrsistent-0.16.0-py36h8c4c3a4_0
  pysocks-1.7.1-py36h9f0ad1d_1
  python-3.6.11-h4d41432_2_cpython
  python-dateutil-2.8.1-py_0
  python_abi-3.6-1_cp36m
  pyzmq-19.0.2-py36h9947dbf_0
  readline-8.0-he28a2e2_2
  requests-2.24.0-pyh9f0ad1d_0
  send2trash-1.5.0-py_0
  setuptools-49.6.0-py36h9f0ad1d_0
  six-1.15.0-pyh9f0ad1d_0
  sqlite-3.33.0-h4cf870e_0
  terminado-0.8.3-py36h9f0ad1d_1
  testpath-0.4.4-py_0
  tk-8.6.10-hed695b0_0
  tornado-6.0.4-py36h8c4c3a4_1
  traitlets-4.3.3-py36h9f0ad1d_1
  urllib3-1.25.10-py_0
  wcwidth-0.2.5-pyh9f0ad1d_1
  webencodings-0.5.1-py_1
  wheel-0.35.1-pyh9f0ad1d_0
  xz-5.2.5-h516909a_1
  zeromq-4.3.2-he1b5a44_3
  zipp-3.1.0-py_0
  zlib-1.2.11-h516909a_1007


Preparing transaction: ...working... done
Verifying transaction: ...working... done
Executing transaction: ...working... done

Remove all packages in environment /home/jenkins/.conda/envs/mango-build-28f035a6-d7ab-497f-aac5-d54b85a8a4c1:

Build step 'Execute shell' marked build as failure
Finished: FAILURE