Console Output

Skipping 7,038 KB.. Full Log
[INFO] Installing artifact /home/jenkins/.m2/repository/org/scala-lang/scalap/2.12.6/scalap-2.12.6.jar to /tmp/mangoTestXx5n6YK/deleteMePleaseThisIsNoLongerNeeded/mango-cli/target/appassembler/repo/org/scala-lang/scalap/2.12.6/scalap-2.12.6.jar
[INFO] Installing artifact /home/jenkins/.m2/repository/com/thoughtworks/paranamer/paranamer/2.8/paranamer-2.8.jar to /tmp/mangoTestXx5n6YK/deleteMePleaseThisIsNoLongerNeeded/mango-cli/target/appassembler/repo/com/thoughtworks/paranamer/paranamer/2.8/paranamer-2.8.jar
[INFO] Installing artifact /home/jenkins/.m2/repository/org/apache/avro/avro/1.8.2/avro-1.8.2.jar to /tmp/mangoTestXx5n6YK/deleteMePleaseThisIsNoLongerNeeded/mango-cli/target/appassembler/repo/org/apache/avro/avro/1.8.2/avro-1.8.2.jar
[INFO] Installing artifact /home/jenkins/.m2/repository/org/codehaus/jackson/jackson-core-asl/1.9.13/jackson-core-asl-1.9.13.jar to /tmp/mangoTestXx5n6YK/deleteMePleaseThisIsNoLongerNeeded/mango-cli/target/appassembler/repo/org/codehaus/jackson/jackson-core-asl/1.9.13/jackson-core-asl-1.9.13.jar
[INFO] Installing artifact /home/jenkins/.m2/repository/org/codehaus/jackson/jackson-mapper-asl/1.9.13/jackson-mapper-asl-1.9.13.jar to /tmp/mangoTestXx5n6YK/deleteMePleaseThisIsNoLongerNeeded/mango-cli/target/appassembler/repo/org/codehaus/jackson/jackson-mapper-asl/1.9.13/jackson-mapper-asl-1.9.13.jar
[INFO] Installing artifact /home/jenkins/.m2/repository/org/xerial/snappy/snappy-java/1.0.5/snappy-java-1.0.5.jar to /tmp/mangoTestXx5n6YK/deleteMePleaseThisIsNoLongerNeeded/mango-cli/target/appassembler/repo/org/xerial/snappy/snappy-java/1.0.5/snappy-java-1.0.5.jar
[INFO] Installing artifact /home/jenkins/.m2/repository/org/apache/commons/commons-compress/1.8.1/commons-compress-1.8.1.jar to /tmp/mangoTestXx5n6YK/deleteMePleaseThisIsNoLongerNeeded/mango-cli/target/appassembler/repo/org/apache/commons/commons-compress/1.8.1/commons-compress-1.8.1.jar
[INFO] Installing artifact /home/jenkins/.m2/repository/org/tukaani/xz/1.5/xz-1.5.jar to /tmp/mangoTestXx5n6YK/deleteMePleaseThisIsNoLongerNeeded/mango-cli/target/appassembler/repo/org/tukaani/xz/1.5/xz-1.5.jar
[INFO] Installing artifact /home/jenkins/.m2/repository/org/slf4j/slf4j-api/1.7.7/slf4j-api-1.7.7.jar to /tmp/mangoTestXx5n6YK/deleteMePleaseThisIsNoLongerNeeded/mango-cli/target/appassembler/repo/org/slf4j/slf4j-api/1.7.7/slf4j-api-1.7.7.jar
[INFO] Installing artifact /home/jenkins/.m2/repository/commons-codec/commons-codec/1.11/commons-codec-1.11.jar to /tmp/mangoTestXx5n6YK/deleteMePleaseThisIsNoLongerNeeded/mango-cli/target/appassembler/repo/commons-codec/commons-codec/1.11/commons-codec-1.11.jar
[INFO] Installing artifact /home/jenkins/.m2/repository/commons-logging/commons-logging/1.1.3/commons-logging-1.1.3.jar to /tmp/mangoTestXx5n6YK/deleteMePleaseThisIsNoLongerNeeded/mango-cli/target/appassembler/repo/commons-logging/commons-logging/1.1.3/commons-logging-1.1.3.jar
[INFO] Installing artifact /home/jenkins/.m2/repository/com/google/code/gson/gson/2.2.4/gson-2.2.4.jar to /tmp/mangoTestXx5n6YK/deleteMePleaseThisIsNoLongerNeeded/mango-cli/target/appassembler/repo/com/google/code/gson/gson/2.2.4/gson-2.2.4.jar
[INFO] Installing artifact /home/jenkins/.m2/repository/org/apache/parquet/parquet-avro/1.10.1/parquet-avro-1.10.1.jar to /tmp/mangoTestXx5n6YK/deleteMePleaseThisIsNoLongerNeeded/mango-cli/target/appassembler/repo/org/apache/parquet/parquet-avro/1.10.1/parquet-avro-1.10.1.jar
[INFO] Installing artifact /home/jenkins/.m2/repository/org/apache/parquet/parquet-column/1.10.1/parquet-column-1.10.1.jar to /tmp/mangoTestXx5n6YK/deleteMePleaseThisIsNoLongerNeeded/mango-cli/target/appassembler/repo/org/apache/parquet/parquet-column/1.10.1/parquet-column-1.10.1.jar
[INFO] Installing artifact /home/jenkins/.m2/repository/org/apache/parquet/parquet-common/1.10.1/parquet-common-1.10.1.jar to /tmp/mangoTestXx5n6YK/deleteMePleaseThisIsNoLongerNeeded/mango-cli/target/appassembler/repo/org/apache/parquet/parquet-common/1.10.1/parquet-common-1.10.1.jar
[INFO] Installing artifact /home/jenkins/.m2/repository/org/apache/parquet/parquet-encoding/1.10.1/parquet-encoding-1.10.1.jar to /tmp/mangoTestXx5n6YK/deleteMePleaseThisIsNoLongerNeeded/mango-cli/target/appassembler/repo/org/apache/parquet/parquet-encoding/1.10.1/parquet-encoding-1.10.1.jar
[INFO] Installing artifact /home/jenkins/.m2/repository/org/apache/parquet/parquet-hadoop/1.10.1/parquet-hadoop-1.10.1.jar to /tmp/mangoTestXx5n6YK/deleteMePleaseThisIsNoLongerNeeded/mango-cli/target/appassembler/repo/org/apache/parquet/parquet-hadoop/1.10.1/parquet-hadoop-1.10.1.jar
[INFO] Installing artifact /home/jenkins/.m2/repository/org/apache/parquet/parquet-jackson/1.10.1/parquet-jackson-1.10.1.jar to /tmp/mangoTestXx5n6YK/deleteMePleaseThisIsNoLongerNeeded/mango-cli/target/appassembler/repo/org/apache/parquet/parquet-jackson/1.10.1/parquet-jackson-1.10.1.jar
[INFO] Installing artifact /home/jenkins/.m2/repository/commons-pool/commons-pool/1.6/commons-pool-1.6.jar to /tmp/mangoTestXx5n6YK/deleteMePleaseThisIsNoLongerNeeded/mango-cli/target/appassembler/repo/commons-pool/commons-pool/1.6/commons-pool-1.6.jar
[INFO] Installing artifact /home/jenkins/.m2/repository/org/apache/parquet/parquet-format/2.4.0/parquet-format-2.4.0.jar to /tmp/mangoTestXx5n6YK/deleteMePleaseThisIsNoLongerNeeded/mango-cli/target/appassembler/repo/org/apache/parquet/parquet-format/2.4.0/parquet-format-2.4.0.jar
[INFO] Installing artifact /home/jenkins/.m2/repository/it/unimi/dsi/fastutil/7.0.13/fastutil-7.0.13.jar to /tmp/mangoTestXx5n6YK/deleteMePleaseThisIsNoLongerNeeded/mango-cli/target/appassembler/repo/it/unimi/dsi/fastutil/7.0.13/fastutil-7.0.13.jar
[INFO] Installing artifact /home/jenkins/.m2/repository/org/apache/parquet/parquet-scala_2.10/1.10.1/parquet-scala_2.10-1.10.1.jar to /tmp/mangoTestXx5n6YK/deleteMePleaseThisIsNoLongerNeeded/mango-cli/target/appassembler/repo/org/apache/parquet/parquet-scala_2.10/1.10.1/parquet-scala_2.10-1.10.1.jar
[INFO] Installing artifact /home/jenkins/.m2/repository/javax/servlet/javax.servlet-api/3.1.0/javax.servlet-api-3.1.0.jar to /tmp/mangoTestXx5n6YK/deleteMePleaseThisIsNoLongerNeeded/mango-cli/target/appassembler/repo/javax/servlet/javax.servlet-api/3.1.0/javax.servlet-api-3.1.0.jar
[INFO] Installing artifact /home/jenkins/.m2/repository/org/apache/commons/commons-lang3/3.9/commons-lang3-3.9.jar to /tmp/mangoTestXx5n6YK/deleteMePleaseThisIsNoLongerNeeded/mango-cli/target/appassembler/repo/org/apache/commons/commons-lang3/3.9/commons-lang3-3.9.jar
[INFO] Installing artifact /home/jenkins/.m2/repository/com/google/code/findbugs/jsr305/3.0.0/jsr305-3.0.0.jar to /tmp/mangoTestXx5n6YK/deleteMePleaseThisIsNoLongerNeeded/mango-cli/target/appassembler/repo/com/google/code/findbugs/jsr305/3.0.0/jsr305-3.0.0.jar
[INFO] Installing artifact /home/jenkins/.m2/repository/org/scala-lang/modules/scala-xml_2.12/1.2.0/scala-xml_2.12-1.2.0.jar to /tmp/mangoTestXx5n6YK/deleteMePleaseThisIsNoLongerNeeded/mango-cli/target/appassembler/repo/org/scala-lang/modules/scala-xml_2.12/1.2.0/scala-xml_2.12-1.2.0.jar
[INFO] Installing artifact /home/jenkins/.m2/repository/org/scala-lang/scala-reflect/2.12.10/scala-reflect-2.12.10.jar to /tmp/mangoTestXx5n6YK/deleteMePleaseThisIsNoLongerNeeded/mango-cli/target/appassembler/repo/org/scala-lang/scala-reflect/2.12.10/scala-reflect-2.12.10.jar
[INFO] Installing artifact /home/jenkins/.m2/repository/org/bdgenomics/adam/adam-cli-spark3_2.12/0.32.0/adam-cli-spark3_2.12-0.32.0.jar to /tmp/mangoTestXx5n6YK/deleteMePleaseThisIsNoLongerNeeded/mango-cli/target/appassembler/repo/org/bdgenomics/adam/adam-cli-spark3_2.12/0.32.0/adam-cli-spark3_2.12-0.32.0.jar
[INFO] Installing artifact /home/jenkins/.m2/repository/org/bdgenomics/adam/adam-apis-spark3_2.12/0.32.0/adam-apis-spark3_2.12-0.32.0.jar to /tmp/mangoTestXx5n6YK/deleteMePleaseThisIsNoLongerNeeded/mango-cli/target/appassembler/repo/org/bdgenomics/adam/adam-apis-spark3_2.12/0.32.0/adam-apis-spark3_2.12-0.32.0.jar
[INFO] Installing artifact /home/jenkins/.m2/repository/args4j/args4j/2.33/args4j-2.33.jar to /tmp/mangoTestXx5n6YK/deleteMePleaseThisIsNoLongerNeeded/mango-cli/target/appassembler/repo/args4j/args4j/2.33/args4j-2.33.jar
[INFO] Installing artifact /home/jenkins/.m2/repository/net/codingwell/scala-guice_2.12/4.2.1/scala-guice_2.12-4.2.1.jar to /tmp/mangoTestXx5n6YK/deleteMePleaseThisIsNoLongerNeeded/mango-cli/target/appassembler/repo/net/codingwell/scala-guice_2.12/4.2.1/scala-guice_2.12-4.2.1.jar
[INFO] Installing artifact /home/jenkins/.m2/repository/com/google/inject/guice/4.2.0/guice-4.2.0.jar to /tmp/mangoTestXx5n6YK/deleteMePleaseThisIsNoLongerNeeded/mango-cli/target/appassembler/repo/com/google/inject/guice/4.2.0/guice-4.2.0.jar
[INFO] Installing artifact /home/jenkins/.m2/repository/javax/inject/javax.inject/1/javax.inject-1.jar to /tmp/mangoTestXx5n6YK/deleteMePleaseThisIsNoLongerNeeded/mango-cli/target/appassembler/repo/javax/inject/javax.inject/1/javax.inject-1.jar
[INFO] Installing artifact /home/jenkins/.m2/repository/aopalliance/aopalliance/1.0/aopalliance-1.0.jar to /tmp/mangoTestXx5n6YK/deleteMePleaseThisIsNoLongerNeeded/mango-cli/target/appassembler/repo/aopalliance/aopalliance/1.0/aopalliance-1.0.jar
[INFO] Installing artifact /home/jenkins/.m2/repository/org/bdgenomics/adam/adam-core-spark3_2.12/0.32.0/adam-core-spark3_2.12-0.32.0.jar to /tmp/mangoTestXx5n6YK/deleteMePleaseThisIsNoLongerNeeded/mango-cli/target/appassembler/repo/org/bdgenomics/adam/adam-core-spark3_2.12/0.32.0/adam-core-spark3_2.12-0.32.0.jar
[INFO] Installing artifact /home/jenkins/.m2/repository/com/esotericsoftware/kryo/kryo/2.24.0/kryo-2.24.0.jar to /tmp/mangoTestXx5n6YK/deleteMePleaseThisIsNoLongerNeeded/mango-cli/target/appassembler/repo/com/esotericsoftware/kryo/kryo/2.24.0/kryo-2.24.0.jar
[INFO] Installing artifact /home/jenkins/.m2/repository/com/esotericsoftware/minlog/minlog/1.2/minlog-1.2.jar to /tmp/mangoTestXx5n6YK/deleteMePleaseThisIsNoLongerNeeded/mango-cli/target/appassembler/repo/com/esotericsoftware/minlog/minlog/1.2/minlog-1.2.jar
[INFO] Installing artifact /home/jenkins/.m2/repository/org/objenesis/objenesis/2.1/objenesis-2.1.jar to /tmp/mangoTestXx5n6YK/deleteMePleaseThisIsNoLongerNeeded/mango-cli/target/appassembler/repo/org/objenesis/objenesis/2.1/objenesis-2.1.jar
[INFO] Installing artifact /home/jenkins/.m2/repository/commons-io/commons-io/2.6/commons-io-2.6.jar to /tmp/mangoTestXx5n6YK/deleteMePleaseThisIsNoLongerNeeded/mango-cli/target/appassembler/repo/commons-io/commons-io/2.6/commons-io-2.6.jar
[INFO] Installing artifact /home/jenkins/.m2/repository/org/clapper/grizzled-slf4j_2.12/1.3.4/grizzled-slf4j_2.12-1.3.4.jar to /tmp/mangoTestXx5n6YK/deleteMePleaseThisIsNoLongerNeeded/mango-cli/target/appassembler/repo/org/clapper/grizzled-slf4j_2.12/1.3.4/grizzled-slf4j_2.12-1.3.4.jar
[INFO] Installing artifact /home/jenkins/.m2/repository/org/seqdoop/hadoop-bam/7.9.2/hadoop-bam-7.9.2.jar to /tmp/mangoTestXx5n6YK/deleteMePleaseThisIsNoLongerNeeded/mango-cli/target/appassembler/repo/org/seqdoop/hadoop-bam/7.9.2/hadoop-bam-7.9.2.jar
[INFO] Installing artifact /home/jenkins/.m2/repository/com/github/jsr203hadoop/jsr203hadoop/1.0.3/jsr203hadoop-1.0.3.jar to /tmp/mangoTestXx5n6YK/deleteMePleaseThisIsNoLongerNeeded/mango-cli/target/appassembler/repo/com/github/jsr203hadoop/jsr203hadoop/1.0.3/jsr203hadoop-1.0.3.jar
[INFO] Installing artifact /home/jenkins/.m2/repository/com/github/samtools/htsjdk/2.19.0/htsjdk-2.19.0.jar to /tmp/mangoTestXx5n6YK/deleteMePleaseThisIsNoLongerNeeded/mango-cli/target/appassembler/repo/com/github/samtools/htsjdk/2.19.0/htsjdk-2.19.0.jar
[INFO] Installing artifact /home/jenkins/.m2/repository/org/apache/commons/commons-jexl/2.1.1/commons-jexl-2.1.1.jar to /tmp/mangoTestXx5n6YK/deleteMePleaseThisIsNoLongerNeeded/mango-cli/target/appassembler/repo/org/apache/commons/commons-jexl/2.1.1/commons-jexl-2.1.1.jar
[INFO] Installing artifact /home/jenkins/.m2/repository/gov/nih/nlm/ncbi/ngs-java/2.9.0/ngs-java-2.9.0.jar to /tmp/mangoTestXx5n6YK/deleteMePleaseThisIsNoLongerNeeded/mango-cli/target/appassembler/repo/gov/nih/nlm/ncbi/ngs-java/2.9.0/ngs-java-2.9.0.jar
[INFO] Installing artifact /home/jenkins/.m2/repository/org/apache/httpcomponents/httpclient/4.5.7/httpclient-4.5.7.jar to /tmp/mangoTestXx5n6YK/deleteMePleaseThisIsNoLongerNeeded/mango-cli/target/appassembler/repo/org/apache/httpcomponents/httpclient/4.5.7/httpclient-4.5.7.jar
[INFO] Installing artifact /home/jenkins/.m2/repository/org/apache/httpcomponents/httpcore/4.4.11/httpcore-4.4.11.jar to /tmp/mangoTestXx5n6YK/deleteMePleaseThisIsNoLongerNeeded/mango-cli/target/appassembler/repo/org/apache/httpcomponents/httpcore/4.4.11/httpcore-4.4.11.jar
[INFO] Installing artifact /home/jenkins/.m2/repository/com/google/guava/guava/27.0-jre/guava-27.0-jre.jar to /tmp/mangoTestXx5n6YK/deleteMePleaseThisIsNoLongerNeeded/mango-cli/target/appassembler/repo/com/google/guava/guava/27.0-jre/guava-27.0-jre.jar
[INFO] Installing artifact /home/jenkins/.m2/repository/com/google/guava/failureaccess/1.0/failureaccess-1.0.jar to /tmp/mangoTestXx5n6YK/deleteMePleaseThisIsNoLongerNeeded/mango-cli/target/appassembler/repo/com/google/guava/failureaccess/1.0/failureaccess-1.0.jar
[INFO] Installing artifact /home/jenkins/.m2/repository/com/google/guava/listenablefuture/9999.0-empty-to-avoid-conflict-with-guava/listenablefuture-9999.0-empty-to-avoid-conflict-with-guava.jar to /tmp/mangoTestXx5n6YK/deleteMePleaseThisIsNoLongerNeeded/mango-cli/target/appassembler/repo/com/google/guava/listenablefuture/9999.0-empty-to-avoid-conflict-with-guava/listenablefuture-9999.0-empty-to-avoid-conflict-with-guava.jar
[INFO] Installing artifact /home/jenkins/.m2/repository/org/checkerframework/checker-qual/2.5.2/checker-qual-2.5.2.jar to /tmp/mangoTestXx5n6YK/deleteMePleaseThisIsNoLongerNeeded/mango-cli/target/appassembler/repo/org/checkerframework/checker-qual/2.5.2/checker-qual-2.5.2.jar
[INFO] Installing artifact /home/jenkins/.m2/repository/com/google/errorprone/error_prone_annotations/2.2.0/error_prone_annotations-2.2.0.jar to /tmp/mangoTestXx5n6YK/deleteMePleaseThisIsNoLongerNeeded/mango-cli/target/appassembler/repo/com/google/errorprone/error_prone_annotations/2.2.0/error_prone_annotations-2.2.0.jar
[INFO] Installing artifact /home/jenkins/.m2/repository/com/google/j2objc/j2objc-annotations/1.1/j2objc-annotations-1.1.jar to /tmp/mangoTestXx5n6YK/deleteMePleaseThisIsNoLongerNeeded/mango-cli/target/appassembler/repo/com/google/j2objc/j2objc-annotations/1.1/j2objc-annotations-1.1.jar
[INFO] Installing artifact /home/jenkins/.m2/repository/org/codehaus/mojo/animal-sniffer-annotations/1.17/animal-sniffer-annotations-1.17.jar to /tmp/mangoTestXx5n6YK/deleteMePleaseThisIsNoLongerNeeded/mango-cli/target/appassembler/repo/org/codehaus/mojo/animal-sniffer-annotations/1.17/animal-sniffer-annotations-1.17.jar
[INFO] Installing artifact /home/jenkins/.m2/repository/org/bdgenomics/adam/adam-codegen-spark3_2.12/0.32.0/adam-codegen-spark3_2.12-0.32.0.jar to /tmp/mangoTestXx5n6YK/deleteMePleaseThisIsNoLongerNeeded/mango-cli/target/appassembler/repo/org/bdgenomics/adam/adam-codegen-spark3_2.12/0.32.0/adam-codegen-spark3_2.12-0.32.0.jar
[INFO] Installing artifact /home/jenkins/.m2/repository/org/bdgenomics/bdg-formats/bdg-formats/0.15.0/bdg-formats-0.15.0.jar to /tmp/mangoTestXx5n6YK/deleteMePleaseThisIsNoLongerNeeded/mango-cli/target/appassembler/repo/org/bdgenomics/bdg-formats/bdg-formats/0.15.0/bdg-formats-0.15.0.jar
[INFO] Installing artifact /home/jenkins/.m2/repository/org/bdgenomics/utils/utils-cli-spark3_2.12/0.3.0/utils-cli-spark3_2.12-0.3.0.jar to /tmp/mangoTestXx5n6YK/deleteMePleaseThisIsNoLongerNeeded/mango-cli/target/appassembler/repo/org/bdgenomics/utils/utils-cli-spark3_2.12/0.3.0/utils-cli-spark3_2.12-0.3.0.jar
[INFO] Installing artifact /home/jenkins/.m2/repository/org/bdgenomics/utils/utils-misc-spark3_2.12/0.3.0/utils-misc-spark3_2.12-0.3.0.jar to /tmp/mangoTestXx5n6YK/deleteMePleaseThisIsNoLongerNeeded/mango-cli/target/appassembler/repo/org/bdgenomics/utils/utils-misc-spark3_2.12/0.3.0/utils-misc-spark3_2.12-0.3.0.jar
[INFO] Installing artifact /home/jenkins/.m2/repository/org/bdgenomics/utils/utils-intervalrdd-spark3_2.12/0.3.0/utils-intervalrdd-spark3_2.12-0.3.0.jar to /tmp/mangoTestXx5n6YK/deleteMePleaseThisIsNoLongerNeeded/mango-cli/target/appassembler/repo/org/bdgenomics/utils/utils-intervalrdd-spark3_2.12/0.3.0/utils-intervalrdd-spark3_2.12-0.3.0.jar
[INFO] Installing artifact /home/jenkins/.m2/repository/org/eclipse/jetty/jetty-server/9.4.17.v20190418/jetty-server-9.4.17.v20190418.jar to /tmp/mangoTestXx5n6YK/deleteMePleaseThisIsNoLongerNeeded/mango-cli/target/appassembler/repo/org/eclipse/jetty/jetty-server/9.4.17.v20190418/jetty-server-9.4.17.v20190418.jar
[INFO] Installing artifact /home/jenkins/.m2/repository/org/eclipse/jetty/jetty-http/9.4.17.v20190418/jetty-http-9.4.17.v20190418.jar to /tmp/mangoTestXx5n6YK/deleteMePleaseThisIsNoLongerNeeded/mango-cli/target/appassembler/repo/org/eclipse/jetty/jetty-http/9.4.17.v20190418/jetty-http-9.4.17.v20190418.jar
[INFO] Installing artifact /home/jenkins/.m2/repository/org/eclipse/jetty/jetty-util/9.4.17.v20190418/jetty-util-9.4.17.v20190418.jar to /tmp/mangoTestXx5n6YK/deleteMePleaseThisIsNoLongerNeeded/mango-cli/target/appassembler/repo/org/eclipse/jetty/jetty-util/9.4.17.v20190418/jetty-util-9.4.17.v20190418.jar
[INFO] Installing artifact /home/jenkins/.m2/repository/org/eclipse/jetty/jetty-io/9.4.17.v20190418/jetty-io-9.4.17.v20190418.jar to /tmp/mangoTestXx5n6YK/deleteMePleaseThisIsNoLongerNeeded/mango-cli/target/appassembler/repo/org/eclipse/jetty/jetty-io/9.4.17.v20190418/jetty-io-9.4.17.v20190418.jar
[INFO] Installing artifact /home/jenkins/.m2/repository/org/eclipse/jetty/jetty-webapp/9.4.17.v20190418/jetty-webapp-9.4.17.v20190418.jar to /tmp/mangoTestXx5n6YK/deleteMePleaseThisIsNoLongerNeeded/mango-cli/target/appassembler/repo/org/eclipse/jetty/jetty-webapp/9.4.17.v20190418/jetty-webapp-9.4.17.v20190418.jar
[INFO] Installing artifact /home/jenkins/.m2/repository/org/eclipse/jetty/jetty-xml/9.4.17.v20190418/jetty-xml-9.4.17.v20190418.jar to /tmp/mangoTestXx5n6YK/deleteMePleaseThisIsNoLongerNeeded/mango-cli/target/appassembler/repo/org/eclipse/jetty/jetty-xml/9.4.17.v20190418/jetty-xml-9.4.17.v20190418.jar
[INFO] Installing artifact /home/jenkins/.m2/repository/org/eclipse/jetty/jetty-servlet/9.4.17.v20190418/jetty-servlet-9.4.17.v20190418.jar to /tmp/mangoTestXx5n6YK/deleteMePleaseThisIsNoLongerNeeded/mango-cli/target/appassembler/repo/org/eclipse/jetty/jetty-servlet/9.4.17.v20190418/jetty-servlet-9.4.17.v20190418.jar
[INFO] Installing artifact /home/jenkins/.m2/repository/org/eclipse/jetty/jetty-security/9.4.17.v20190418/jetty-security-9.4.17.v20190418.jar to /tmp/mangoTestXx5n6YK/deleteMePleaseThisIsNoLongerNeeded/mango-cli/target/appassembler/repo/org/eclipse/jetty/jetty-security/9.4.17.v20190418/jetty-security-9.4.17.v20190418.jar
[INFO] Installing artifact /home/jenkins/.m2/repository/org/scalatra/scalatra_2.12/2.5.0/scalatra_2.12-2.5.0.jar to /tmp/mangoTestXx5n6YK/deleteMePleaseThisIsNoLongerNeeded/mango-cli/target/appassembler/repo/org/scalatra/scalatra_2.12/2.5.0/scalatra_2.12-2.5.0.jar
[INFO] Installing artifact /home/jenkins/.m2/repository/org/scalatra/scalatra-common_2.12/2.5.0/scalatra-common_2.12-2.5.0.jar to /tmp/mangoTestXx5n6YK/deleteMePleaseThisIsNoLongerNeeded/mango-cli/target/appassembler/repo/org/scalatra/scalatra-common_2.12/2.5.0/scalatra-common_2.12-2.5.0.jar
[INFO] Installing artifact /home/jenkins/.m2/repository/com/googlecode/juniversalchardet/juniversalchardet/1.0.3/juniversalchardet-1.0.3.jar to /tmp/mangoTestXx5n6YK/deleteMePleaseThisIsNoLongerNeeded/mango-cli/target/appassembler/repo/com/googlecode/juniversalchardet/juniversalchardet/1.0.3/juniversalchardet-1.0.3.jar
[INFO] Installing artifact /home/jenkins/.m2/repository/eu/medsea/mimeutil/mime-util/2.1.3/mime-util-2.1.3.jar to /tmp/mangoTestXx5n6YK/deleteMePleaseThisIsNoLongerNeeded/mango-cli/target/appassembler/repo/eu/medsea/mimeutil/mime-util/2.1.3/mime-util-2.1.3.jar
[INFO] Installing artifact /home/jenkins/.m2/repository/org/scala-lang/modules/scala-parser-combinators_2.12/1.0.4/scala-parser-combinators_2.12-1.0.4.jar to /tmp/mangoTestXx5n6YK/deleteMePleaseThisIsNoLongerNeeded/mango-cli/target/appassembler/repo/org/scala-lang/modules/scala-parser-combinators_2.12/1.0.4/scala-parser-combinators_2.12-1.0.4.jar
[INFO] Installing artifact /home/jenkins/.m2/repository/org/scalatra/scalate/scalate-core_2.12/1.9.1/scalate-core_2.12-1.9.1.jar to /tmp/mangoTestXx5n6YK/deleteMePleaseThisIsNoLongerNeeded/mango-cli/target/appassembler/repo/org/scalatra/scalate/scalate-core_2.12/1.9.1/scalate-core_2.12-1.9.1.jar
[INFO] Installing artifact /home/jenkins/.m2/repository/org/scala-lang/scala-compiler/2.12.8/scala-compiler-2.12.8.jar to /tmp/mangoTestXx5n6YK/deleteMePleaseThisIsNoLongerNeeded/mango-cli/target/appassembler/repo/org/scala-lang/scala-compiler/2.12.8/scala-compiler-2.12.8.jar
[INFO] Installing artifact /home/jenkins/.m2/repository/org/scalatra/scalate/scalate-util_2.12/1.9.1/scalate-util_2.12-1.9.1.jar to /tmp/mangoTestXx5n6YK/deleteMePleaseThisIsNoLongerNeeded/mango-cli/target/appassembler/repo/org/scalatra/scalate/scalate-util_2.12/1.9.1/scalate-util_2.12-1.9.1.jar
[INFO] Installing artifact /tmp/mangoTestXx5n6YK/deleteMePleaseThisIsNoLongerNeeded/mango-core/target/mango-core-spark3_2.12-0.0.6-SNAPSHOT.jar to /tmp/mangoTestXx5n6YK/deleteMePleaseThisIsNoLongerNeeded/mango-cli/target/appassembler/repo/org/bdgenomics/mango/mango-core-spark3_2.12/0.0.6-SNAPSHOT/mango-core-spark3_2.12-0.0.6-SNAPSHOT.jar
[INFO] Installing artifact /home/jenkins/.m2/repository/org/bdgenomics/utils/utils-io-spark3_2.12/0.3.0/utils-io-spark3_2.12-0.3.0.jar to /tmp/mangoTestXx5n6YK/deleteMePleaseThisIsNoLongerNeeded/mango-cli/target/appassembler/repo/org/bdgenomics/utils/utils-io-spark3_2.12/0.3.0/utils-io-spark3_2.12-0.3.0.jar
[INFO] Installing artifact /home/jenkins/.m2/repository/com/google/protobuf/protobuf-java/3.0.0-beta-3/protobuf-java-3.0.0-beta-3.jar to /tmp/mangoTestXx5n6YK/deleteMePleaseThisIsNoLongerNeeded/mango-cli/target/appassembler/repo/com/google/protobuf/protobuf-java/3.0.0-beta-3/protobuf-java-3.0.0-beta-3.jar
[INFO] Installing artifact /home/jenkins/.m2/repository/com/google/protobuf/protobuf-java-util/3.0.0-beta-3/protobuf-java-util-3.0.0-beta-3.jar to /tmp/mangoTestXx5n6YK/deleteMePleaseThisIsNoLongerNeeded/mango-cli/target/appassembler/repo/com/google/protobuf/protobuf-java-util/3.0.0-beta-3/protobuf-java-util-3.0.0-beta-3.jar
[INFO] Installing artifact /home/jenkins/.m2/repository/org/ga4gh/ga4gh-schemas/0.6.0a10/ga4gh-schemas-0.6.0a10.jar to /tmp/mangoTestXx5n6YK/deleteMePleaseThisIsNoLongerNeeded/mango-cli/target/appassembler/repo/org/ga4gh/ga4gh-schemas/0.6.0a10/ga4gh-schemas-0.6.0a10.jar
[INFO] Installing artifact /home/jenkins/.m2/repository/org/bdgenomics/convert/convert-ga4gh/0.9.0/convert-ga4gh-0.9.0.jar to /tmp/mangoTestXx5n6YK/deleteMePleaseThisIsNoLongerNeeded/mango-cli/target/appassembler/repo/org/bdgenomics/convert/convert-ga4gh/0.9.0/convert-ga4gh-0.9.0.jar
[INFO] Installing artifact /home/jenkins/.m2/repository/org/bdgenomics/convert/convert-htsjdk/0.9.0/convert-htsjdk-0.9.0.jar to /tmp/mangoTestXx5n6YK/deleteMePleaseThisIsNoLongerNeeded/mango-cli/target/appassembler/repo/org/bdgenomics/convert/convert-htsjdk/0.9.0/convert-htsjdk-0.9.0.jar
[INFO] Installing artifact /home/jenkins/.m2/repository/com/google/inject/extensions/guice-assistedinject/4.2.2/guice-assistedinject-4.2.2.jar to /tmp/mangoTestXx5n6YK/deleteMePleaseThisIsNoLongerNeeded/mango-cli/target/appassembler/repo/com/google/inject/extensions/guice-assistedinject/4.2.2/guice-assistedinject-4.2.2.jar
[INFO] Installing artifact /home/jenkins/.m2/repository/org/bdgenomics/convert/convert/0.9.0/convert-0.9.0.jar to /tmp/mangoTestXx5n6YK/deleteMePleaseThisIsNoLongerNeeded/mango-cli/target/appassembler/repo/org/bdgenomics/convert/convert/0.9.0/convert-0.9.0.jar
[INFO] Installing artifact /tmp/mangoTestXx5n6YK/deleteMePleaseThisIsNoLongerNeeded/mango-cli/target/mango-cli-spark3_2.12-0.0.6-SNAPSHOT.jar to /tmp/mangoTestXx5n6YK/deleteMePleaseThisIsNoLongerNeeded/mango-cli/target/appassembler/repo/org/bdgenomics/mango/mango-cli-spark3_2.12/0.0.6-SNAPSHOT/mango-cli-spark3_2.12-0.0.6-SNAPSHOT.jar
[INFO] 
[INFO] ----------< org.bdgenomics.mango:mango-assembly-spark3_2.12 >-----------
[INFO] Building Mango_2.12: Assembly 0.0.6-SNAPSHOT                       [4/6]
[INFO] --------------------------------[ jar ]---------------------------------
[INFO] 
[INFO] --- maven-enforcer-plugin:1.0:enforce (enforce-versions) @ mango-assembly-spark3_2.12 ---
[INFO] 
[INFO] --- maven-enforcer-plugin:1.0:enforce (enforce-maven) @ mango-assembly-spark3_2.12 ---
[INFO] 
[INFO] --- git-commit-id-plugin:2.2.2:revision (default) @ mango-assembly-spark3_2.12 ---
[INFO] 
[INFO] --- templating-maven-plugin:1.0.0:filter-sources (filter-src) @ mango-assembly-spark3_2.12 ---
[INFO] Request to add '/tmp/mangoTestXx5n6YK/deleteMePleaseThisIsNoLongerNeeded/mango-assembly/src/main/java-templates' folder. Not added since it does not exist.
[INFO] 
[INFO] --- build-helper-maven-plugin:1.10:add-source (add-source) @ mango-assembly-spark3_2.12 ---
[INFO] Source directory: /tmp/mangoTestXx5n6YK/deleteMePleaseThisIsNoLongerNeeded/mango-assembly/src/main/scala added.
[INFO] 
[INFO] --- scalariform-maven-plugin:0.1.4:format (default) @ mango-assembly-spark3_2.12 ---
[INFO] Modified 0 of 1 .scala files
[INFO] 
[INFO] --- maven-resources-plugin:3.1.0:resources (default-resources) @ mango-assembly-spark3_2.12 ---
[INFO] Using 'UTF-8' encoding to copy filtered resources.
[INFO] skip non existing resourceDirectory /tmp/mangoTestXx5n6YK/deleteMePleaseThisIsNoLongerNeeded/mango-assembly/src/main/resources
[INFO] 
[INFO] --- scala-maven-plugin:3.2.2:compile (scala-compile-first) @ mango-assembly-spark3_2.12 ---
[WARNING]  Expected all dependencies to require Scala version: 2.12.8
[WARNING]  net.liftweb:lift-json_2.12:3.3.0 requires scala version: 2.12.6
[WARNING] Multiple versions of scala libraries detected!
[INFO] Nothing to compile - all classes are up to date
[INFO] 
[INFO] --- maven-compiler-plugin:3.8.0:compile (default-compile) @ mango-assembly-spark3_2.12 ---
[INFO] Nothing to compile - all classes are up to date
[INFO] 
[INFO] --- build-helper-maven-plugin:1.10:add-test-source (add-test-source) @ mango-assembly-spark3_2.12 ---
[INFO] Test Source directory: /tmp/mangoTestXx5n6YK/deleteMePleaseThisIsNoLongerNeeded/mango-assembly/src/test/scala added.
[INFO] 
[INFO] --- maven-resources-plugin:3.1.0:testResources (default-testResources) @ mango-assembly-spark3_2.12 ---
[INFO] Using 'UTF-8' encoding to copy filtered resources.
[INFO] skip non existing resourceDirectory /tmp/mangoTestXx5n6YK/deleteMePleaseThisIsNoLongerNeeded/mango-assembly/src/test/resources
[INFO] 
[INFO] --- scala-maven-plugin:3.2.2:testCompile (scala-test-compile-first) @ mango-assembly-spark3_2.12 ---
[WARNING]  Expected all dependencies to require Scala version: 2.12.8
[WARNING]  net.liftweb:lift-json_2.12:3.3.0 requires scala version: 2.12.6
[WARNING] Multiple versions of scala libraries detected!
[INFO] No sources to compile
[INFO] 
[INFO] --- maven-compiler-plugin:3.8.0:testCompile (default-testCompile) @ mango-assembly-spark3_2.12 ---
[INFO] No sources to compile
[INFO] 
[INFO] --- maven-surefire-plugin:3.0.0-M3:test (default-test) @ mango-assembly-spark3_2.12 ---
[INFO] Tests are skipped.
[INFO] 
[INFO] --- maven-jar-plugin:3.1.2:jar (default-jar) @ mango-assembly-spark3_2.12 ---
[INFO] Building jar: /tmp/mangoTestXx5n6YK/deleteMePleaseThisIsNoLongerNeeded/mango-assembly/target/mango-assembly-spark3_2.12-0.0.6-SNAPSHOT.jar
[INFO] 
[INFO] --- maven-source-plugin:3.0.1:jar-no-fork (attach-sources) @ mango-assembly-spark3_2.12 ---
[INFO] Building jar: /tmp/mangoTestXx5n6YK/deleteMePleaseThisIsNoLongerNeeded/mango-assembly/target/mango-assembly-spark3_2.12-0.0.6-SNAPSHOT-sources.jar
[INFO] 
[INFO] --- maven-javadoc-plugin:3.1.0:jar (attach-javadocs) @ mango-assembly-spark3_2.12 ---
[INFO] 
[INFO] >>> scala-maven-plugin:3.2.2:doc-jar (attach-scaladocs) > generate-sources @ mango-assembly-spark3_2.12 >>>
[INFO] 
[INFO] --- maven-enforcer-plugin:1.0:enforce (enforce-versions) @ mango-assembly-spark3_2.12 ---
[INFO] 
[INFO] --- maven-enforcer-plugin:1.0:enforce (enforce-maven) @ mango-assembly-spark3_2.12 ---
[INFO] 
[INFO] --- git-commit-id-plugin:2.2.2:revision (default) @ mango-assembly-spark3_2.12 ---
[INFO] 
[INFO] --- templating-maven-plugin:1.0.0:filter-sources (filter-src) @ mango-assembly-spark3_2.12 ---
[INFO] Request to add '/tmp/mangoTestXx5n6YK/deleteMePleaseThisIsNoLongerNeeded/mango-assembly/src/main/java-templates' folder. Not added since it does not exist.
[INFO] 
[INFO] --- build-helper-maven-plugin:1.10:add-source (add-source) @ mango-assembly-spark3_2.12 ---
[INFO] Source directory: /tmp/mangoTestXx5n6YK/deleteMePleaseThisIsNoLongerNeeded/mango-assembly/src/main/scala added.
[INFO] 
[INFO] <<< scala-maven-plugin:3.2.2:doc-jar (attach-scaladocs) < generate-sources @ mango-assembly-spark3_2.12 <<<
[INFO] 
[INFO] 
[INFO] --- scala-maven-plugin:3.2.2:doc-jar (attach-scaladocs) @ mango-assembly-spark3_2.12 ---
[WARNING]  Expected all dependencies to require Scala version: 2.12.8
[WARNING]  net.liftweb:lift-json_2.12:3.3.0 requires scala version: 2.12.6
[WARNING] Multiple versions of scala libraries detected!
[WARNING]  Expected all dependencies to require Scala version: 2.12.8
[WARNING]  net.liftweb:lift-json_2.12:3.3.0 requires scala version: 2.12.6
[WARNING] Multiple versions of scala libraries detected!
model contains 6 documentable templates
[INFO] Building jar: /tmp/mangoTestXx5n6YK/deleteMePleaseThisIsNoLongerNeeded/mango-assembly/target/mango-assembly-spark3_2.12-0.0.6-SNAPSHOT-javadoc.jar
[INFO] 
[INFO] --- maven-shade-plugin:3.2.0:shade (default) @ mango-assembly-spark3_2.12 ---
[INFO] Including org.bdgenomics.mango:mango-cli-spark3_2.12:jar:0.0.6-SNAPSHOT in the shaded jar.
[INFO] Including net.liftweb:lift-json_2.12:jar:3.3.0 in the shaded jar.
[INFO] Including org.scala-lang:scala-library:jar:2.12.6 in the shaded jar.
[INFO] Including org.scala-lang:scalap:jar:2.12.6 in the shaded jar.
[INFO] Including com.thoughtworks.paranamer:paranamer:jar:2.8 in the shaded jar.
[INFO] Including org.apache.avro:avro:jar:1.8.2 in the shaded jar.
[INFO] Including org.codehaus.jackson:jackson-core-asl:jar:1.9.13 in the shaded jar.
[INFO] Including org.codehaus.jackson:jackson-mapper-asl:jar:1.9.13 in the shaded jar.
[INFO] Including org.xerial.snappy:snappy-java:jar:1.0.5 in the shaded jar.
[INFO] Including org.apache.commons:commons-compress:jar:1.8.1 in the shaded jar.
[INFO] Including org.tukaani:xz:jar:1.5 in the shaded jar.
[INFO] Including org.slf4j:slf4j-api:jar:1.7.7 in the shaded jar.
[INFO] Including org.apache.parquet:parquet-avro:jar:1.10.1 in the shaded jar.
[INFO] Including org.apache.parquet:parquet-column:jar:1.10.1 in the shaded jar.
[INFO] Including org.apache.parquet:parquet-common:jar:1.10.1 in the shaded jar.
[INFO] Including org.apache.parquet:parquet-encoding:jar:1.10.1 in the shaded jar.
[INFO] Including commons-codec:commons-codec:jar:1.10 in the shaded jar.
[INFO] Including org.apache.parquet:parquet-hadoop:jar:1.10.1 in the shaded jar.
[INFO] Including org.apache.parquet:parquet-jackson:jar:1.10.1 in the shaded jar.
[INFO] Including commons-pool:commons-pool:jar:1.6 in the shaded jar.
[INFO] Including org.apache.parquet:parquet-format:jar:2.4.0 in the shaded jar.
[INFO] Including it.unimi.dsi:fastutil:jar:7.0.13 in the shaded jar.
[INFO] Including org.apache.parquet:parquet-scala_2.10:jar:1.10.1 in the shaded jar.
[INFO] Including org.bdgenomics.adam:adam-cli-spark3_2.12:jar:0.32.0 in the shaded jar.
[INFO] Including org.bdgenomics.adam:adam-apis-spark3_2.12:jar:0.32.0 in the shaded jar.
[INFO] Including args4j:args4j:jar:2.33 in the shaded jar.
[INFO] Including net.codingwell:scala-guice_2.12:jar:4.2.1 in the shaded jar.
[INFO] Including com.google.inject:guice:jar:4.2.0 in the shaded jar.
[INFO] Including javax.inject:javax.inject:jar:1 in the shaded jar.
[INFO] Including aopalliance:aopalliance:jar:1.0 in the shaded jar.
[INFO] Including org.scala-lang:scala-reflect:jar:2.12.6 in the shaded jar.
[INFO] Including com.google.code.findbugs:jsr305:jar:1.3.9 in the shaded jar.
[INFO] Including org.bdgenomics.adam:adam-core-spark3_2.12:jar:0.32.0 in the shaded jar.
[INFO] Including com.esotericsoftware.kryo:kryo:jar:2.24.0 in the shaded jar.
[INFO] Including com.esotericsoftware.minlog:minlog:jar:1.2 in the shaded jar.
[INFO] Including org.objenesis:objenesis:jar:2.1 in the shaded jar.
[INFO] Including commons-io:commons-io:jar:2.6 in the shaded jar.
[INFO] Including org.clapper:grizzled-slf4j_2.12:jar:1.3.4 in the shaded jar.
[INFO] Including org.seqdoop:hadoop-bam:jar:7.9.2 in the shaded jar.
[INFO] Including com.github.jsr203hadoop:jsr203hadoop:jar:1.0.3 in the shaded jar.
[INFO] Including com.github.samtools:htsjdk:jar:2.19.0 in the shaded jar.
[INFO] Including org.apache.commons:commons-jexl:jar:2.1.1 in the shaded jar.
[INFO] Including commons-logging:commons-logging:jar:1.1.1 in the shaded jar.
[INFO] Including gov.nih.nlm.ncbi:ngs-java:jar:2.9.0 in the shaded jar.
[INFO] Including org.apache.httpcomponents:httpclient:jar:4.5.7 in the shaded jar.
[INFO] Including org.apache.httpcomponents:httpcore:jar:4.4.11 in the shaded jar.
[INFO] Including com.google.guava:guava:jar:27.0-jre in the shaded jar.
[INFO] Including com.google.guava:failureaccess:jar:1.0 in the shaded jar.
[INFO] Including com.google.guava:listenablefuture:jar:9999.0-empty-to-avoid-conflict-with-guava in the shaded jar.
[INFO] Including org.checkerframework:checker-qual:jar:2.5.2 in the shaded jar.
[INFO] Including com.google.errorprone:error_prone_annotations:jar:2.2.0 in the shaded jar.
[INFO] Including com.google.j2objc:j2objc-annotations:jar:1.1 in the shaded jar.
[INFO] Including org.codehaus.mojo:animal-sniffer-annotations:jar:1.17 in the shaded jar.
[INFO] Including org.bdgenomics.adam:adam-codegen-spark3_2.12:jar:0.32.0 in the shaded jar.
[INFO] Including org.bdgenomics.bdg-formats:bdg-formats:jar:0.15.0 in the shaded jar.
[INFO] Including org.bdgenomics.utils:utils-cli-spark3_2.12:jar:0.3.0 in the shaded jar.
[INFO] Including org.bdgenomics.utils:utils-misc-spark3_2.12:jar:0.3.0 in the shaded jar.
[INFO] Including org.bdgenomics.utils:utils-intervalrdd-spark3_2.12:jar:0.3.0 in the shaded jar.
[INFO] Including org.eclipse.jetty:jetty-server:jar:9.4.17.v20190418 in the shaded jar.
[INFO] Including javax.servlet:javax.servlet-api:jar:3.1.0 in the shaded jar.
[INFO] Including org.eclipse.jetty:jetty-http:jar:9.4.17.v20190418 in the shaded jar.
[INFO] Including org.eclipse.jetty:jetty-util:jar:9.4.17.v20190418 in the shaded jar.
[INFO] Including org.eclipse.jetty:jetty-io:jar:9.4.17.v20190418 in the shaded jar.
[INFO] Including org.eclipse.jetty:jetty-webapp:jar:9.4.17.v20190418 in the shaded jar.
[INFO] Including org.eclipse.jetty:jetty-xml:jar:9.4.17.v20190418 in the shaded jar.
[INFO] Including org.eclipse.jetty:jetty-servlet:jar:9.4.17.v20190418 in the shaded jar.
[INFO] Including org.eclipse.jetty:jetty-security:jar:9.4.17.v20190418 in the shaded jar.
[INFO] Including org.scalatra:scalatra_2.12:jar:2.5.0 in the shaded jar.
[INFO] Including org.scalatra:scalatra-common_2.12:jar:2.5.0 in the shaded jar.
[INFO] Including com.googlecode.juniversalchardet:juniversalchardet:jar:1.0.3 in the shaded jar.
[INFO] Including eu.medsea.mimeutil:mime-util:jar:2.1.3 in the shaded jar.
[INFO] Including org.apache.commons:commons-lang3:jar:3.5 in the shaded jar.
[INFO] Including org.scala-lang.modules:scala-parser-combinators_2.12:jar:1.0.4 in the shaded jar.
[INFO] Including org.scala-lang.modules:scala-xml_2.12:jar:1.0.6 in the shaded jar.
[INFO] Including org.scalatra.scalate:scalate-core_2.12:jar:1.9.1 in the shaded jar.
[INFO] Including org.scala-lang:scala-compiler:jar:2.12.8 in the shaded jar.
[INFO] Including org.scalatra.scalate:scalate-util_2.12:jar:1.9.1 in the shaded jar.
[INFO] Including org.bdgenomics.mango:mango-core-spark3_2.12:jar:0.0.6-SNAPSHOT in the shaded jar.
[INFO] Including org.bdgenomics.utils:utils-io-spark3_2.12:jar:0.3.0 in the shaded jar.
[INFO] Including com.google.protobuf:protobuf-java:jar:3.0.0-beta-3 in the shaded jar.
[INFO] Including com.google.protobuf:protobuf-java-util:jar:3.0.0-beta-3 in the shaded jar.
[INFO] Including com.google.code.gson:gson:jar:2.3 in the shaded jar.
[INFO] Including org.ga4gh:ga4gh-schemas:jar:0.6.0a10 in the shaded jar.
[INFO] Including org.bdgenomics.convert:convert-ga4gh:jar:0.9.0 in the shaded jar.
[INFO] Including org.bdgenomics.convert:convert-htsjdk:jar:0.9.0 in the shaded jar.
[INFO] Including com.google.inject.extensions:guice-assistedinject:jar:4.2.2 in the shaded jar.
[INFO] Including org.bdgenomics.convert:convert:jar:0.9.0 in the shaded jar.
[WARNING] WORKAROUND:  refusing to add class org/apache/parquet/avro/AvroSchemaConverter$2.class from jar /home/jenkins/.m2/repository/org/apache/parquet/parquet-avro/1.10.1/parquet-avro-1.10.1.jar
[WARNING] WORKAROUND:  refusing to add class org/apache/parquet/avro/AvroSchemaConverter.class from jar /home/jenkins/.m2/repository/org/apache/parquet/parquet-avro/1.10.1/parquet-avro-1.10.1.jar
[WARNING] WORKAROUND:  refusing to add class org/apache/parquet/avro/AvroSchemaConverter$1.class from jar /home/jenkins/.m2/repository/org/apache/parquet/parquet-avro/1.10.1/parquet-avro-1.10.1.jar
[WARNING] guava-27.0-jre.jar, failureaccess-1.0.jar define 2 overlapping classes: 
[WARNING]   - com.google.common.util.concurrent.internal.InternalFutureFailureAccess
[WARNING]   - com.google.common.util.concurrent.internal.InternalFutures
[WARNING] mango-cli-spark3_2.12-0.0.6-SNAPSHOT.jar, adam-cli-spark3_2.12-0.32.0.jar define 3 overlapping classes: 
[WARNING]   - org.bdgenomics.adam.cli.CommandGroup
[WARNING]   - org.bdgenomics.adam.cli.InitArgs
[WARNING]   - org.bdgenomics.adam.cli.CommandGroup$
[WARNING] maven-shade-plugin has detected that some class files are
[WARNING] present in two or more JARs. When this happens, only one
[WARNING] single version of the class is copied to the uber jar.
[WARNING] Usually this is not harmful and you can skip these warnings,
[WARNING] otherwise try to manually exclude artifacts based on
[WARNING] mvn dependency:tree -Ddetail=true and the above output.
[WARNING] See http://maven.apache.org/plugins/maven-shade-plugin/
[INFO] Replacing original artifact with shaded artifact.
[INFO] Replacing /tmp/mangoTestXx5n6YK/deleteMePleaseThisIsNoLongerNeeded/mango-assembly/target/mango-assembly-spark3_2.12-0.0.6-SNAPSHOT.jar with /tmp/mangoTestXx5n6YK/deleteMePleaseThisIsNoLongerNeeded/mango-assembly/target/mango-assembly-spark3_2.12-0.0.6-SNAPSHOT-shaded.jar
[INFO] 
[INFO] --------< org.bdgenomics.mango:mango-distribution-spark3_2.12 >---------
[INFO] Building mango_2.12: Distribution 0.0.6-SNAPSHOT                   [5/6]
[INFO] --------------------------------[ pom ]---------------------------------
[INFO] 
[INFO] --- maven-enforcer-plugin:1.0:enforce (enforce-versions) @ mango-distribution-spark3_2.12 ---
[INFO] 
[INFO] --- maven-enforcer-plugin:1.0:enforce (enforce-maven) @ mango-distribution-spark3_2.12 ---
[INFO] 
[INFO] --- scalariform-maven-plugin:0.1.4:format (default) @ mango-distribution-spark3_2.12 ---
[INFO] Modified 0 of 0 .scala files
[INFO] 
[INFO] --- scala-maven-plugin:3.2.2:compile (scala-compile-first) @ mango-distribution-spark3_2.12 ---
[INFO] No sources to compile
[INFO] 
[INFO] --- scala-maven-plugin:3.2.2:testCompile (scala-test-compile-first) @ mango-distribution-spark3_2.12 ---
[INFO] No sources to compile
[INFO] 
[INFO] --- maven-source-plugin:3.0.1:jar-no-fork (attach-sources) @ mango-distribution-spark3_2.12 ---
[INFO] 
[INFO] --- maven-javadoc-plugin:3.1.0:jar (attach-javadocs) @ mango-distribution-spark3_2.12 ---
[INFO] 
[INFO] >>> scala-maven-plugin:3.2.2:doc-jar (attach-scaladocs) > generate-sources @ mango-distribution-spark3_2.12 >>>
[INFO] 
[INFO] --- maven-enforcer-plugin:1.0:enforce (enforce-versions) @ mango-distribution-spark3_2.12 ---
[INFO] 
[INFO] --- maven-enforcer-plugin:1.0:enforce (enforce-maven) @ mango-distribution-spark3_2.12 ---
[INFO] 
[INFO] <<< scala-maven-plugin:3.2.2:doc-jar (attach-scaladocs) < generate-sources @ mango-distribution-spark3_2.12 <<<
[INFO] 
[INFO] 
[INFO] --- scala-maven-plugin:3.2.2:doc-jar (attach-scaladocs) @ mango-distribution-spark3_2.12 ---
[INFO] No source files found
[INFO] 
[INFO] --- maven-assembly-plugin:2.2-beta-5:single (default) @ mango-distribution-spark3_2.12 ---
[INFO] Reading assembly descriptor: src/main/assembly/assembly.xml
[INFO] Building tar : /tmp/mangoTestXx5n6YK/deleteMePleaseThisIsNoLongerNeeded/mango-distribution/target/mango-distribution-spark3_2.12-0.0.6-SNAPSHOT-bin.tar.gz
[WARNING] Entry: mango-distribution-spark3_2.12-0.0.6-SNAPSHOT/repo/mango-assembly-spark3_2.12-0.0.6-SNAPSHOT-javadoc.jar longer than 100 characters.
[WARNING] Resulting tar file can only be processed successfully by GNU compatible tar commands
[WARNING] Entry: mango-distribution-spark3_2.12-0.0.6-SNAPSHOT/repo/mango-assembly-spark3_2.12-0.0.6-SNAPSHOT-sources.jar longer than 100 characters.
[INFO] Building tar : /tmp/mangoTestXx5n6YK/deleteMePleaseThisIsNoLongerNeeded/mango-distribution/target/mango-distribution-spark3_2.12-0.0.6-SNAPSHOT-bin.tar.bz2
[WARNING] Entry: mango-distribution-spark3_2.12-0.0.6-SNAPSHOT/repo/mango-assembly-spark3_2.12-0.0.6-SNAPSHOT-javadoc.jar longer than 100 characters.
[WARNING] Resulting tar file can only be processed successfully by GNU compatible tar commands
[WARNING] Entry: mango-distribution-spark3_2.12-0.0.6-SNAPSHOT/repo/mango-assembly-spark3_2.12-0.0.6-SNAPSHOT-sources.jar longer than 100 characters.
[INFO] Building zip: /tmp/mangoTestXx5n6YK/deleteMePleaseThisIsNoLongerNeeded/mango-distribution/target/mango-distribution-spark3_2.12-0.0.6-SNAPSHOT-bin.zip
[INFO] 
[INFO] -----------< org.bdgenomics.mango:mango-parent-spark3_2.12 >------------
[INFO] Building mango_2.12 0.0.6-SNAPSHOT                                 [6/6]
[INFO] --------------------------------[ pom ]---------------------------------
[INFO] 
[INFO] --- maven-enforcer-plugin:1.0:enforce (enforce-versions) @ mango-parent-spark3_2.12 ---
[INFO] 
[INFO] --- maven-enforcer-plugin:1.0:enforce (enforce-maven) @ mango-parent-spark3_2.12 ---
[INFO] 
[INFO] --- scalariform-maven-plugin:0.1.4:format (default) @ mango-parent-spark3_2.12 ---
[INFO] Modified 147 of 236 .scala files
[INFO] 
[INFO] --- scala-maven-plugin:3.2.2:compile (scala-compile-first) @ mango-parent-spark3_2.12 ---
[INFO] No sources to compile
[INFO] 
[INFO] --- scala-maven-plugin:3.2.2:testCompile (scala-test-compile-first) @ mango-parent-spark3_2.12 ---
[INFO] No sources to compile
[INFO] 
[INFO] --- maven-source-plugin:3.0.1:jar-no-fork (attach-sources) @ mango-parent-spark3_2.12 ---
[INFO] 
[INFO] --- maven-javadoc-plugin:3.1.0:jar (attach-javadocs) @ mango-parent-spark3_2.12 ---
[INFO] 
[INFO] >>> scala-maven-plugin:3.2.2:doc-jar (attach-scaladocs) > generate-sources @ mango-parent-spark3_2.12 >>>
[INFO] 
[INFO] --- maven-enforcer-plugin:1.0:enforce (enforce-versions) @ mango-parent-spark3_2.12 ---
[INFO] 
[INFO] --- maven-enforcer-plugin:1.0:enforce (enforce-maven) @ mango-parent-spark3_2.12 ---
[INFO] 
[INFO] <<< scala-maven-plugin:3.2.2:doc-jar (attach-scaladocs) < generate-sources @ mango-parent-spark3_2.12 <<<
[INFO] 
[INFO] 
[INFO] --- scala-maven-plugin:3.2.2:doc-jar (attach-scaladocs) @ mango-parent-spark3_2.12 ---
[INFO] No source files found
[INFO] ------------------------------------------------------------------------
[INFO] Reactor Summary for mango_2.12 0.0.6-SNAPSHOT:
[INFO] 
[INFO] mango_2.12: CORE ................................... SUCCESS [ 28.025 s]
[INFO] Mango_2.12: Python APIs ............................ SUCCESS [02:15 min]
[INFO] mango_2.12: CLI .................................... SUCCESS [ 41.734 s]
[INFO] Mango_2.12: Assembly ............................... SUCCESS [ 28.111 s]
[INFO] mango_2.12: Distribution ........................... SUCCESS [01:48 min]
[INFO] mango_2.12 ......................................... SUCCESS [  3.823 s]
[INFO] ------------------------------------------------------------------------
[INFO] BUILD SUCCESS
[INFO] ------------------------------------------------------------------------
[INFO] Total time:  05:46 min
[INFO] Finished at: 2021-02-04T19:47:40Z
[INFO] ------------------------------------------------------------------------
+ pushd mango-python
+ make clean
/tmp/mangoTestXx5n6YK/deleteMePleaseThisIsNoLongerNeeded/mango-python /tmp/mangoTestXx5n6YK/deleteMePleaseThisIsNoLongerNeeded /home
pip uninstall -y bdgenomics.mango
Uninstalling bdgenomics.mango-0.0.6a2:
  Successfully uninstalled bdgenomics.mango-0.0.6a2
rm -rf src/*.egg-info
rm -rf build/
+ popd
+ pushd mango-pileup
/tmp/mangoTestXx5n6YK/deleteMePleaseThisIsNoLongerNeeded /home
+ make prepare
/tmp/mangoTestXx5n6YK/deleteMePleaseThisIsNoLongerNeeded/mango-pileup /tmp/mangoTestXx5n6YK/deleteMePleaseThisIsNoLongerNeeded /home
pip install -r requirements.txt
Collecting ipywidgets>=7.5.0
  Downloading https://files.pythonhosted.org/packages/11/53/084940a83a8158364e630a664a30b03068c25ab75243224d6b488800d43a/ipywidgets-7.6.3-py2.py3-none-any.whl (121kB)
Collecting six==1.11.0
  Downloading https://files.pythonhosted.org/packages/67/4b/141a581104b1f6397bfa78ac9d43d8ad29a7ca43ea90a2d863fe3056e86a/six-1.11.0-py2.py3-none-any.whl
Collecting pytest>=5.3.2
  Downloading https://files.pythonhosted.org/packages/a1/cf/7f67585bd2fc0359ec482cf3c430bce3ef6d3f40bc468137225a733e3069/pytest-6.2.2-py3-none-any.whl (280kB)
Requirement already satisfied: jupyter==1.0.0 in /home/jenkins/.conda/envs/mango-build-db034478-c8f4-476e-bb9a-32c7f9ef3762/lib/python3.6/site-packages (from -r requirements.txt (line 4)) (1.0.0)
Collecting modin[ray]==0.8.0
  Downloading https://files.pythonhosted.org/packages/e9/7c/7ff264198ce393153f75ad6fce9fef9eb7624602776ea9854e4f067712d8/modin-0.8.0-py3-none-manylinux1_x86_64.whl (387kB)
Requirement already satisfied: jupyter_contrib_nbextensions==0.5.1 in /home/jenkins/.conda/envs/mango-build-db034478-c8f4-476e-bb9a-32c7f9ef3762/lib/python3.6/site-packages (from -r requirements.txt (line 6)) (0.5.1)
Collecting jupyterlab-widgets>=1.0.0; python_version >= "3.6"
  Downloading https://files.pythonhosted.org/packages/18/b5/3473d275e3b2359efdf5768e9df95537308b93a31ad94fa92814ac565826/jupyterlab_widgets-1.0.0-py3-none-any.whl (243kB)
Requirement already satisfied: nbformat>=4.2.0 in /home/jenkins/.conda/envs/mango-build-db034478-c8f4-476e-bb9a-32c7f9ef3762/lib/python3.6/site-packages (from ipywidgets>=7.5.0->-r requirements.txt (line 1)) (5.1.2)
Requirement already satisfied: ipykernel>=4.5.1 in /home/jenkins/.conda/envs/mango-build-db034478-c8f4-476e-bb9a-32c7f9ef3762/lib/python3.6/site-packages (from ipywidgets>=7.5.0->-r requirements.txt (line 1)) (5.4.2)
Collecting widgetsnbextension~=3.5.0
  Downloading https://files.pythonhosted.org/packages/6c/7b/7ac231c20d2d33c445eaacf8a433f4e22c60677eb9776c7c5262d7ddee2d/widgetsnbextension-3.5.1-py2.py3-none-any.whl (2.2MB)
Requirement already satisfied: ipython>=4.0.0; python_version >= "3.3" in /home/jenkins/.conda/envs/mango-build-db034478-c8f4-476e-bb9a-32c7f9ef3762/lib/python3.6/site-packages (from ipywidgets>=7.5.0->-r requirements.txt (line 1)) (7.8.0)
Requirement already satisfied: traitlets>=4.3.1 in /home/jenkins/.conda/envs/mango-build-db034478-c8f4-476e-bb9a-32c7f9ef3762/lib/python3.6/site-packages (from ipywidgets>=7.5.0->-r requirements.txt (line 1)) (4.3.3)
Collecting iniconfig
  Downloading https://files.pythonhosted.org/packages/9b/dd/b3c12c6d707058fa947864b67f0c4e0c39ef8610988d7baea9578f3c48f3/iniconfig-1.1.1-py2.py3-none-any.whl
Requirement already satisfied: attrs>=19.2.0 in /home/jenkins/.conda/envs/mango-build-db034478-c8f4-476e-bb9a-32c7f9ef3762/lib/python3.6/site-packages (from pytest>=5.3.2->-r requirements.txt (line 3)) (20.3.0)
Requirement already satisfied: py>=1.8.2 in /home/jenkins/.conda/envs/mango-build-db034478-c8f4-476e-bb9a-32c7f9ef3762/lib/python3.6/site-packages (from pytest>=5.3.2->-r requirements.txt (line 3)) (1.10.0)
Requirement already satisfied: importlib-metadata>=0.12; python_version < "3.8" in /home/jenkins/.conda/envs/mango-build-db034478-c8f4-476e-bb9a-32c7f9ef3762/lib/python3.6/site-packages (from pytest>=5.3.2->-r requirements.txt (line 3)) (3.4.0)
Requirement already satisfied: packaging in /home/jenkins/.conda/envs/mango-build-db034478-c8f4-476e-bb9a-32c7f9ef3762/lib/python3.6/site-packages (from pytest>=5.3.2->-r requirements.txt (line 3)) (20.9)
Requirement already satisfied: pluggy<1.0.0a1,>=0.12 in /home/jenkins/.conda/envs/mango-build-db034478-c8f4-476e-bb9a-32c7f9ef3762/lib/python3.6/site-packages (from pytest>=5.3.2->-r requirements.txt (line 3)) (0.13.1)
Collecting toml
  Downloading https://files.pythonhosted.org/packages/44/6f/7120676b6d73228c96e17f1f794d8ab046fc910d781c8d151120c3f1569e/toml-0.10.2-py2.py3-none-any.whl
Requirement already satisfied: notebook in /home/jenkins/.conda/envs/mango-build-db034478-c8f4-476e-bb9a-32c7f9ef3762/lib/python3.6/site-packages (from jupyter==1.0.0->-r requirements.txt (line 4)) (6.2.0)
Requirement already satisfied: nbconvert in /home/jenkins/.conda/envs/mango-build-db034478-c8f4-476e-bb9a-32c7f9ef3762/lib/python3.6/site-packages (from jupyter==1.0.0->-r requirements.txt (line 4)) (6.0.7)
Requirement already satisfied: qtconsole in /home/jenkins/.conda/envs/mango-build-db034478-c8f4-476e-bb9a-32c7f9ef3762/lib/python3.6/site-packages (from jupyter==1.0.0->-r requirements.txt (line 4)) (5.0.2)
Requirement already satisfied: jupyter-console in /home/jenkins/.conda/envs/mango-build-db034478-c8f4-476e-bb9a-32c7f9ef3762/lib/python3.6/site-packages (from jupyter==1.0.0->-r requirements.txt (line 4)) (6.2.0)
Collecting pandas==1.0.5
  Downloading https://files.pythonhosted.org/packages/c0/95/cb9820560a2713384ef49060b0087dfa2591c6db6f240215c2bce1f4211c/pandas-1.0.5-cp36-cp36m-manylinux1_x86_64.whl (10.1MB)
Collecting pyarrow<0.17; extra == "ray"
  Downloading https://files.pythonhosted.org/packages/00/d2/695bab1e1e7a4554b6dbd287d55cca096214bd441037058a432afd724bb1/pyarrow-0.16.0-cp36-cp36m-manylinux2014_x86_64.whl (63.1MB)
Collecting ray==0.8.6; extra == "ray"
  Downloading https://files.pythonhosted.org/packages/ea/0b/f253e92aee1225d9d0ef21dd15514352ce87f6dbc55de70707bc9d52477f/ray-0.8.6-cp36-cp36m-manylinux1_x86_64.whl (21.9MB)
Requirement already satisfied: jupyter-latex-envs>=1.3.8 in /home/jenkins/.conda/envs/mango-build-db034478-c8f4-476e-bb9a-32c7f9ef3762/lib/python3.6/site-packages (from jupyter_contrib_nbextensions==0.5.1->-r requirements.txt (line 6)) (1.4.6)
Requirement already satisfied: ipython-genutils in /home/jenkins/.conda/envs/mango-build-db034478-c8f4-476e-bb9a-32c7f9ef3762/lib/python3.6/site-packages (from jupyter_contrib_nbextensions==0.5.1->-r requirements.txt (line 6)) (0.2.0)
Requirement already satisfied: jupyter-highlight-selected-word>=0.1.1 in /home/jenkins/.conda/envs/mango-build-db034478-c8f4-476e-bb9a-32c7f9ef3762/lib/python3.6/site-packages (from jupyter_contrib_nbextensions==0.5.1->-r requirements.txt (line 6)) (0.2.0)
Requirement already satisfied: tornado in /home/jenkins/.conda/envs/mango-build-db034478-c8f4-476e-bb9a-32c7f9ef3762/lib/python3.6/site-packages (from jupyter_contrib_nbextensions==0.5.1->-r requirements.txt (line 6)) (6.1)
Requirement already satisfied: jupyter-contrib-core>=0.3.3 in /home/jenkins/.conda/envs/mango-build-db034478-c8f4-476e-bb9a-32c7f9ef3762/lib/python3.6/site-packages (from jupyter_contrib_nbextensions==0.5.1->-r requirements.txt (line 6)) (0.3.3)
Requirement already satisfied: jupyter-core in /home/jenkins/.conda/envs/mango-build-db034478-c8f4-476e-bb9a-32c7f9ef3762/lib/python3.6/site-packages (from jupyter_contrib_nbextensions==0.5.1->-r requirements.txt (line 6)) (4.7.1)
Requirement already satisfied: jupyter-nbextensions-configurator>=0.4.0 in /home/jenkins/.conda/envs/mango-build-db034478-c8f4-476e-bb9a-32c7f9ef3762/lib/python3.6/site-packages (from jupyter_contrib_nbextensions==0.5.1->-r requirements.txt (line 6)) (0.4.1)
Requirement already satisfied: lxml in /home/jenkins/.conda/envs/mango-build-db034478-c8f4-476e-bb9a-32c7f9ef3762/lib/python3.6/site-packages (from jupyter_contrib_nbextensions==0.5.1->-r requirements.txt (line 6)) (4.6.2)
Requirement already satisfied: pyyaml in /home/jenkins/.conda/envs/mango-build-db034478-c8f4-476e-bb9a-32c7f9ef3762/lib/python3.6/site-packages (from jupyter_contrib_nbextensions==0.5.1->-r requirements.txt (line 6)) (5.4.1)
Requirement already satisfied: jsonschema!=2.5.0,>=2.4 in /home/jenkins/.conda/envs/mango-build-db034478-c8f4-476e-bb9a-32c7f9ef3762/lib/python3.6/site-packages (from nbformat>=4.2.0->ipywidgets>=7.5.0->-r requirements.txt (line 1)) (3.2.0)
Requirement already satisfied: jupyter-client in /home/jenkins/.conda/envs/mango-build-db034478-c8f4-476e-bb9a-32c7f9ef3762/lib/python3.6/site-packages (from ipykernel>=4.5.1->ipywidgets>=7.5.0->-r requirements.txt (line 1)) (6.1.11)
Requirement already satisfied: setuptools>=18.5 in /home/jenkins/.conda/envs/mango-build-db034478-c8f4-476e-bb9a-32c7f9ef3762/lib/python3.6/site-packages (from ipython>=4.0.0; python_version >= "3.3"->ipywidgets>=7.5.0->-r requirements.txt (line 1)) (49.6.0.post20210108)
Requirement already satisfied: pexpect; sys_platform != "win32" in /home/jenkins/.conda/envs/mango-build-db034478-c8f4-476e-bb9a-32c7f9ef3762/lib/python3.6/site-packages (from ipython>=4.0.0; python_version >= "3.3"->ipywidgets>=7.5.0->-r requirements.txt (line 1)) (4.8.0)
Requirement already satisfied: pygments in /home/jenkins/.conda/envs/mango-build-db034478-c8f4-476e-bb9a-32c7f9ef3762/lib/python3.6/site-packages (from ipython>=4.0.0; python_version >= "3.3"->ipywidgets>=7.5.0->-r requirements.txt (line 1)) (2.7.4)
Requirement already satisfied: jedi>=0.10 in /home/jenkins/.conda/envs/mango-build-db034478-c8f4-476e-bb9a-32c7f9ef3762/lib/python3.6/site-packages (from ipython>=4.0.0; python_version >= "3.3"->ipywidgets>=7.5.0->-r requirements.txt (line 1)) (0.17.2)
Requirement already satisfied: backcall in /home/jenkins/.conda/envs/mango-build-db034478-c8f4-476e-bb9a-32c7f9ef3762/lib/python3.6/site-packages (from ipython>=4.0.0; python_version >= "3.3"->ipywidgets>=7.5.0->-r requirements.txt (line 1)) (0.2.0)
Requirement already satisfied: pickleshare in /home/jenkins/.conda/envs/mango-build-db034478-c8f4-476e-bb9a-32c7f9ef3762/lib/python3.6/site-packages (from ipython>=4.0.0; python_version >= "3.3"->ipywidgets>=7.5.0->-r requirements.txt (line 1)) (0.7.5)
Requirement already satisfied: decorator in /home/jenkins/.conda/envs/mango-build-db034478-c8f4-476e-bb9a-32c7f9ef3762/lib/python3.6/site-packages (from ipython>=4.0.0; python_version >= "3.3"->ipywidgets>=7.5.0->-r requirements.txt (line 1)) (4.4.2)
Requirement already satisfied: prompt-toolkit<2.1.0,>=2.0.0 in /home/jenkins/.conda/envs/mango-build-db034478-c8f4-476e-bb9a-32c7f9ef3762/lib/python3.6/site-packages (from ipython>=4.0.0; python_version >= "3.3"->ipywidgets>=7.5.0->-r requirements.txt (line 1)) (2.0.10)
Requirement already satisfied: typing-extensions>=3.6.4; python_version < "3.8" in /home/jenkins/.conda/envs/mango-build-db034478-c8f4-476e-bb9a-32c7f9ef3762/lib/python3.6/site-packages (from importlib-metadata>=0.12; python_version < "3.8"->pytest>=5.3.2->-r requirements.txt (line 3)) (3.7.4.3)
Requirement already satisfied: zipp>=0.5 in /home/jenkins/.conda/envs/mango-build-db034478-c8f4-476e-bb9a-32c7f9ef3762/lib/python3.6/site-packages (from importlib-metadata>=0.12; python_version < "3.8"->pytest>=5.3.2->-r requirements.txt (line 3)) (3.4.0)
Requirement already satisfied: pyparsing>=2.0.2 in /home/jenkins/.conda/envs/mango-build-db034478-c8f4-476e-bb9a-32c7f9ef3762/lib/python3.6/site-packages (from packaging->pytest>=5.3.2->-r requirements.txt (line 3)) (2.4.7)
Requirement already satisfied: prometheus-client in /home/jenkins/.conda/envs/mango-build-db034478-c8f4-476e-bb9a-32c7f9ef3762/lib/python3.6/site-packages (from notebook->jupyter==1.0.0->-r requirements.txt (line 4)) (0.9.0)
Requirement already satisfied: jinja2 in /home/jenkins/.conda/envs/mango-build-db034478-c8f4-476e-bb9a-32c7f9ef3762/lib/python3.6/site-packages (from notebook->jupyter==1.0.0->-r requirements.txt (line 4)) (2.11.3)
Requirement already satisfied: pyzmq>=17 in /home/jenkins/.conda/envs/mango-build-db034478-c8f4-476e-bb9a-32c7f9ef3762/lib/python3.6/site-packages (from notebook->jupyter==1.0.0->-r requirements.txt (line 4)) (22.0.1)
Requirement already satisfied: argon2-cffi in /home/jenkins/.conda/envs/mango-build-db034478-c8f4-476e-bb9a-32c7f9ef3762/lib/python3.6/site-packages (from notebook->jupyter==1.0.0->-r requirements.txt (line 4)) (20.1.0)
Requirement already satisfied: terminado>=0.8.3 in /home/jenkins/.conda/envs/mango-build-db034478-c8f4-476e-bb9a-32c7f9ef3762/lib/python3.6/site-packages (from notebook->jupyter==1.0.0->-r requirements.txt (line 4)) (0.9.2)
Requirement already satisfied: Send2Trash>=1.5.0 in /home/jenkins/.conda/envs/mango-build-db034478-c8f4-476e-bb9a-32c7f9ef3762/lib/python3.6/site-packages (from notebook->jupyter==1.0.0->-r requirements.txt (line 4)) (1.5.0)
Requirement already satisfied: testpath in /home/jenkins/.conda/envs/mango-build-db034478-c8f4-476e-bb9a-32c7f9ef3762/lib/python3.6/site-packages (from nbconvert->jupyter==1.0.0->-r requirements.txt (line 4)) (0.4.4)
Requirement already satisfied: pandocfilters>=1.4.1 in /home/jenkins/.conda/envs/mango-build-db034478-c8f4-476e-bb9a-32c7f9ef3762/lib/python3.6/site-packages (from nbconvert->jupyter==1.0.0->-r requirements.txt (line 4)) (1.4.2)
Requirement already satisfied: entrypoints>=0.2.2 in /home/jenkins/.conda/envs/mango-build-db034478-c8f4-476e-bb9a-32c7f9ef3762/lib/python3.6/site-packages (from nbconvert->jupyter==1.0.0->-r requirements.txt (line 4)) (0.3)
Requirement already satisfied: mistune<2,>=0.8.1 in /home/jenkins/.conda/envs/mango-build-db034478-c8f4-476e-bb9a-32c7f9ef3762/lib/python3.6/site-packages (from nbconvert->jupyter==1.0.0->-r requirements.txt (line 4)) (0.8.4)
Requirement already satisfied: jupyterlab-pygments in /home/jenkins/.conda/envs/mango-build-db034478-c8f4-476e-bb9a-32c7f9ef3762/lib/python3.6/site-packages (from nbconvert->jupyter==1.0.0->-r requirements.txt (line 4)) (0.1.2)
Requirement already satisfied: bleach in /home/jenkins/.conda/envs/mango-build-db034478-c8f4-476e-bb9a-32c7f9ef3762/lib/python3.6/site-packages (from nbconvert->jupyter==1.0.0->-r requirements.txt (line 4)) (3.3.0)
Requirement already satisfied: defusedxml in /home/jenkins/.conda/envs/mango-build-db034478-c8f4-476e-bb9a-32c7f9ef3762/lib/python3.6/site-packages (from nbconvert->jupyter==1.0.0->-r requirements.txt (line 4)) (0.6.0)
Requirement already satisfied: nbclient<0.6.0,>=0.5.0 in /home/jenkins/.conda/envs/mango-build-db034478-c8f4-476e-bb9a-32c7f9ef3762/lib/python3.6/site-packages (from nbconvert->jupyter==1.0.0->-r requirements.txt (line 4)) (0.5.1)
Requirement already satisfied: qtpy in /home/jenkins/.conda/envs/mango-build-db034478-c8f4-476e-bb9a-32c7f9ef3762/lib/python3.6/site-packages (from qtconsole->jupyter==1.0.0->-r requirements.txt (line 4)) (1.9.0)
Requirement already satisfied: numpy>=1.13.3 in /home/jenkins/.conda/envs/mango-build-db034478-c8f4-476e-bb9a-32c7f9ef3762/lib/python3.6/site-packages (from pandas==1.0.5->modin[ray]==0.8.0->-r requirements.txt (line 5)) (1.19.5)
Requirement already satisfied: python-dateutil>=2.6.1 in /home/jenkins/.conda/envs/mango-build-db034478-c8f4-476e-bb9a-32c7f9ef3762/lib/python3.6/site-packages (from pandas==1.0.5->modin[ray]==0.8.0->-r requirements.txt (line 5)) (2.8.1)
Requirement already satisfied: pytz>=2017.2 in /home/jenkins/.conda/envs/mango-build-db034478-c8f4-476e-bb9a-32c7f9ef3762/lib/python3.6/site-packages (from pandas==1.0.5->modin[ray]==0.8.0->-r requirements.txt (line 5)) (2021.1)
Collecting google
  Downloading https://files.pythonhosted.org/packages/ac/35/17c9141c4ae21e9a29a43acdfd848e3e468a810517f862cad07977bf8fe9/google-3.0.0-py2.py3-none-any.whl (45kB)
Collecting py-spy>=0.2.0
  Downloading https://files.pythonhosted.org/packages/0c/b7/2056a6f06adb93f679f2a1e415dd33219b7c66ba69b8fd2ff1668b8064ed/py_spy-0.3.4-py2.py3-none-manylinux1_x86_64.whl (3.2MB)
Collecting redis<3.5.0,>=3.3.2
  Downloading https://files.pythonhosted.org/packages/f0/05/1fc7feedc19c123e7a95cfc9e7892eb6cdd2e5df4e9e8af6384349c1cc3d/redis-3.4.1-py2.py3-none-any.whl (71kB)
Collecting msgpack<2.0.0,>=0.6.0
  Downloading https://files.pythonhosted.org/packages/0c/0d/b1d9d32d03ce38ba5e2a37fbae850afd4530a14cc441e8335f1865a03705/msgpack-1.0.2-cp36-cp36m-manylinux1_x86_64.whl (272kB)
Requirement already satisfied: colorama in /home/jenkins/.conda/envs/mango-build-db034478-c8f4-476e-bb9a-32c7f9ef3762/lib/python3.6/site-packages (from ray==0.8.6; extra == "ray"->modin[ray]==0.8.0->-r requirements.txt (line 5)) (0.4.4)
Requirement already satisfied: click>=7.0 in /home/jenkins/.conda/envs/mango-build-db034478-c8f4-476e-bb9a-32c7f9ef3762/lib/python3.6/site-packages (from ray==0.8.6; extra == "ray"->modin[ray]==0.8.0->-r requirements.txt (line 5)) (7.1.2)
Requirement already satisfied: filelock in /home/jenkins/.conda/envs/mango-build-db034478-c8f4-476e-bb9a-32c7f9ef3762/lib/python3.6/site-packages (from ray==0.8.6; extra == "ray"->modin[ray]==0.8.0->-r requirements.txt (line 5)) (3.0.12)
Collecting aiohttp
  Downloading https://files.pythonhosted.org/packages/ad/e6/d4b6235d776c9b33f853e603efede5aac5a34f71ca9d3877adb30492eb4e/aiohttp-3.7.3-cp36-cp36m-manylinux2014_x86_64.whl (1.3MB)
Requirement already satisfied: protobuf>=3.8.0 in /home/jenkins/.conda/envs/mango-build-db034478-c8f4-476e-bb9a-32c7f9ef3762/lib/python3.6/site-packages (from ray==0.8.6; extra == "ray"->modin[ray]==0.8.0->-r requirements.txt (line 5)) (3.14.0)
Collecting grpcio
  Downloading https://files.pythonhosted.org/packages/88/55/357022b111b856cadaf63d718d79861fc6215b848eff38b2fbfb9d5c47bd/grpcio-1.35.0-cp36-cp36m-manylinux2014_x86_64.whl (4.1MB)
Requirement already satisfied: pyrsistent>=0.14.0 in /home/jenkins/.conda/envs/mango-build-db034478-c8f4-476e-bb9a-32c7f9ef3762/lib/python3.6/site-packages (from jsonschema!=2.5.0,>=2.4->nbformat>=4.2.0->ipywidgets>=7.5.0->-r requirements.txt (line 1)) (0.17.3)
Requirement already satisfied: ptyprocess>=0.5 in /home/jenkins/.conda/envs/mango-build-db034478-c8f4-476e-bb9a-32c7f9ef3762/lib/python3.6/site-packages (from pexpect; sys_platform != "win32"->ipython>=4.0.0; python_version >= "3.3"->ipywidgets>=7.5.0->-r requirements.txt (line 1)) (0.7.0)
Requirement already satisfied: parso<0.8.0,>=0.7.0 in /home/jenkins/.conda/envs/mango-build-db034478-c8f4-476e-bb9a-32c7f9ef3762/lib/python3.6/site-packages (from jedi>=0.10->ipython>=4.0.0; python_version >= "3.3"->ipywidgets>=7.5.0->-r requirements.txt (line 1)) (0.7.1)
Requirement already satisfied: wcwidth in /home/jenkins/.conda/envs/mango-build-db034478-c8f4-476e-bb9a-32c7f9ef3762/lib/python3.6/site-packages (from prompt-toolkit<2.1.0,>=2.0.0->ipython>=4.0.0; python_version >= "3.3"->ipywidgets>=7.5.0->-r requirements.txt (line 1)) (0.2.5)
Requirement already satisfied: MarkupSafe>=0.23 in /home/jenkins/.conda/envs/mango-build-db034478-c8f4-476e-bb9a-32c7f9ef3762/lib/python3.6/site-packages (from jinja2->notebook->jupyter==1.0.0->-r requirements.txt (line 4)) (1.1.1)
Requirement already satisfied: cffi>=1.0.0 in /home/jenkins/.conda/envs/mango-build-db034478-c8f4-476e-bb9a-32c7f9ef3762/lib/python3.6/site-packages (from argon2-cffi->notebook->jupyter==1.0.0->-r requirements.txt (line 4)) (1.14.4)
Requirement already satisfied: webencodings in /home/jenkins/.conda/envs/mango-build-db034478-c8f4-476e-bb9a-32c7f9ef3762/lib/python3.6/site-packages (from bleach->nbconvert->jupyter==1.0.0->-r requirements.txt (line 4)) (0.5.1)
Requirement already satisfied: nest-asyncio in /home/jenkins/.conda/envs/mango-build-db034478-c8f4-476e-bb9a-32c7f9ef3762/lib/python3.6/site-packages (from nbclient<0.6.0,>=0.5.0->nbconvert->jupyter==1.0.0->-r requirements.txt (line 4)) (1.4.3)
Requirement already satisfied: async-generator in /home/jenkins/.conda/envs/mango-build-db034478-c8f4-476e-bb9a-32c7f9ef3762/lib/python3.6/site-packages (from nbclient<0.6.0,>=0.5.0->nbconvert->jupyter==1.0.0->-r requirements.txt (line 4)) (1.10)
Collecting beautifulsoup4
  Downloading https://files.pythonhosted.org/packages/d1/41/e6495bd7d3781cee623ce23ea6ac73282a373088fcd0ddc809a047b18eae/beautifulsoup4-4.9.3-py3-none-any.whl (115kB)
Collecting async-timeout<4.0,>=3.0
  Downloading https://files.pythonhosted.org/packages/e1/1e/5a4441be21b0726c4464f3f23c8b19628372f606755a9d2e46c187e65ec4/async_timeout-3.0.1-py3-none-any.whl
Collecting yarl<2.0,>=1.0
  Downloading https://files.pythonhosted.org/packages/da/08/52b26b44bce7b818b410aee37c5e424c9ea420c557bca97dc2adac29b151/yarl-1.6.3-cp36-cp36m-manylinux2014_x86_64.whl (293kB)
Collecting multidict<7.0,>=4.5
  Downloading https://files.pythonhosted.org/packages/a1/35/b22524d6b9cacfb4c5eff413a069bbc17c6ea628e54da5c6c989998ced5f/multidict-5.1.0-cp36-cp36m-manylinux2014_x86_64.whl (141kB)
Collecting idna-ssl>=1.0; python_version < "3.7"
  Downloading https://files.pythonhosted.org/packages/46/03/07c4894aae38b0de52b52586b24bf189bb83e4ddabfe2e2c8f2419eec6f4/idna-ssl-1.1.0.tar.gz
Collecting chardet<4.0,>=2.0
  Downloading https://files.pythonhosted.org/packages/bc/a9/01ffebfb562e4274b6487b4bb1ddec7ca55ec7510b22e4c51f14098443b8/chardet-3.0.4-py2.py3-none-any.whl (133kB)
Requirement already satisfied: pycparser in /home/jenkins/.conda/envs/mango-build-db034478-c8f4-476e-bb9a-32c7f9ef3762/lib/python3.6/site-packages (from cffi>=1.0.0->argon2-cffi->notebook->jupyter==1.0.0->-r requirements.txt (line 4)) (2.20)
Collecting soupsieve>1.2; python_version >= "3.0"
  Downloading https://files.pythonhosted.org/packages/02/fb/1c65691a9aeb7bd6ac2aa505b84cb8b49ac29c976411c6ab3659425e045f/soupsieve-2.1-py3-none-any.whl
Requirement already satisfied: idna>=2.0 in /home/jenkins/.conda/envs/mango-build-db034478-c8f4-476e-bb9a-32c7f9ef3762/lib/python3.6/site-packages (from yarl<2.0,>=1.0->aiohttp->ray==0.8.6; extra == "ray"->modin[ray]==0.8.0->-r requirements.txt (line 5)) (2.10)
Building wheels for collected packages: idna-ssl
  Building wheel for idna-ssl (setup.py): started
  Building wheel for idna-ssl (setup.py): finished with status 'done'
  Created wheel for idna-ssl: filename=idna_ssl-1.1.0-cp36-none-any.whl size=3163 sha256=475ee1d3743c299b5c30bb92420957fa43cb127f0da8b069273bc2a9bd769743
  Stored in directory: /home/jenkins/.cache/pip/wheels/d3/00/b3/32d613e19e08a739751dd6bf998cfed277728f8b2127ad4eb7
Successfully built idna-ssl
ERROR: jupyterlab 2.0.1 has requirement jupyterlab_server~=1.0.0, but you'll have jupyterlab-server 1.2.0 which is incompatible.
ERROR: bdgenomics-mango-pileup 0.0.6a0 has requirement ipywidgets==7.0.0, but you'll have ipywidgets 7.6.3 which is incompatible.
ERROR: bdgenomics-mango-pileup 0.0.6a0 has requirement modin[ray]==0.6.1, but you'll have modin 0.8.0 which is incompatible.
ERROR: bdgenomics-mango-pileup 0.0.6a0 has requirement pytest==2.8.3, but you'll have pytest 6.2.2 which is incompatible.
Installing collected packages: jupyterlab-widgets, widgetsnbextension, ipywidgets, six, iniconfig, toml, pytest, pandas, pyarrow, soupsieve, beautifulsoup4, google, py-spy, redis, msgpack, async-timeout, multidict, yarl, idna-ssl, chardet, aiohttp, grpcio, ray, modin
  Found existing installation: widgetsnbextension 3.0.8
    Uninstalling widgetsnbextension-3.0.8:
      Successfully uninstalled widgetsnbextension-3.0.8
  Found existing installation: ipywidgets 7.0.0
    Uninstalling ipywidgets-7.0.0:
      Successfully uninstalled ipywidgets-7.0.0
  Found existing installation: six 1.15.0
    Uninstalling six-1.15.0:
      Successfully uninstalled six-1.15.0
  Found existing installation: pytest 3.9.1
    Uninstalling pytest-3.9.1:
      Successfully uninstalled pytest-3.9.1
  Found existing installation: pandas 0.25.1
    Uninstalling pandas-0.25.1:
      Successfully uninstalled pandas-0.25.1
  Found existing installation: redis 3.5.3
    Uninstalling redis-3.5.3:
      Successfully uninstalled redis-3.5.3
  Found existing installation: chardet 4.0.0
    Uninstalling chardet-4.0.0:
      Successfully uninstalled chardet-4.0.0
  Found existing installation: ray 0.7.3
    Uninstalling ray-0.7.3:
      Successfully uninstalled ray-0.7.3
  Found existing installation: modin 0.6.1
    Uninstalling modin-0.6.1:
      Successfully uninstalled modin-0.6.1
Successfully installed aiohttp-3.7.3 async-timeout-3.0.1 beautifulsoup4-4.9.3 chardet-3.0.4 google-3.0.0 grpcio-1.35.0 idna-ssl-1.1.0 iniconfig-1.1.1 ipywidgets-7.6.3 jupyterlab-widgets-1.0.0 modin-0.8.0 msgpack-1.0.2 multidict-5.1.0 pandas-1.0.5 py-spy-0.3.4 pyarrow-0.16.0 pytest-6.2.2 ray-0.8.6 redis-3.4.1 six-1.11.0 soupsieve-2.1 toml-0.10.2 widgetsnbextension-3.5.1 yarl-1.6.3
# install node_modules
cd bdgenomics/mango/js; \
	npm install
npm WARN deprecated mkdirp@0.5.1: Legacy versions of mkdirp are no longer supported. Please update to mkdirp 1.x. (Note that the API surface has changed to use Promises in 1.x.)
npm WARN deprecated debug@4.1.1: Debug versions >=3.2.0 <3.2.7 || >=4 <4.3.1 have a low-severity ReDos regression when used in a Node.js environment. It is recommended you upgrade to 3.2.7 or 4.3.1. (https://github.com/visionmedia/debug/issues/797)
npm WARN deprecated request@2.88.2: request has been deprecated, see https://github.com/request/request/issues/3142
npm WARN deprecated browserslist@1.7.7: Browserslist 2 could fail on reading Browserslist >3.0 config used in other tools.
npm WARN deprecated chokidar@2.1.8: Chokidar 2 will break on node v14+. Upgrade to chokidar 3 with 15x less dependencies.
npm WARN deprecated har-validator@5.1.5: this library is no longer supported
npm WARN deprecated core-js@1.2.7: core-js@<3 is no longer maintained and not recommended for usage due to the number of issues. Please, upgrade your dependencies to the actual version of core-js@3.
npm WARN deprecated resolve-url@0.2.1: https://github.com/lydell/resolve-url#deprecated
npm WARN deprecated urix@0.1.0: Please see https://github.com/lydell/urix#deprecated
npm WARN deprecated fsevents@1.2.13: fsevents 1 will break on node v14+ and could be using insecure binaries. Upgrade to fsevents 2.
npm WARN prepublish-on-install As of npm@5, `prepublish` scripts are deprecated.
npm WARN prepublish-on-install Use `prepare` for build steps and `prepublishOnly` for upload-only.
npm WARN prepublish-on-install See the deprecation note in `npm help scripts` for more information.

> bdgenomics.mango.pileup@0.0.6-beta.1 prepublish /tmp/mangoTestXx5n6YK/deleteMePleaseThisIsNoLongerNeeded/mango-pileup/bdgenomics/mango/js
> npm run build


> bdgenomics.mango.pileup@0.0.6-beta.1 build /tmp/mangoTestXx5n6YK/deleteMePleaseThisIsNoLongerNeeded/mango-pileup/bdgenomics/mango/js
> npm run build:js && webpack


> bdgenomics.mango.pileup@0.0.6-beta.1 build:js /tmp/mangoTestXx5n6YK/deleteMePleaseThisIsNoLongerNeeded/mango-pileup/bdgenomics/mango/js
> tsc

Hash: fbf91a448a06ec206a44765942d76bfd9061978b0ca12c87fffc8797db4b
Version: webpack 4.46.0
Child
    Hash: fbf91a448a06ec206a44
    Time: 2595ms
    Built at: 02/04/2021 7:48:54 PM
           Asset      Size  Chunks             Chunk Names
    extension.js  1.16 KiB       0  [emitted]  main
    Entrypoint main = extension.js
    [0] ./lib/extension.js 1.19 KiB {0} [built]
Child
    Hash: 765942d76bfd9061978b
    Time: 21819ms
    Built at: 02/04/2021 7:49:14 PM
           Asset      Size  Chunks                          Chunk Names
        index.js   706 KiB       0  [emitted]        [big]  main
    index.js.map  3.27 MiB       0  [emitted] [dev]         main
    Entrypoint main [big] = index.js index.js.map
      [4] ./node_modules/underscore/modules/index-all.js + 159 modules 80.5 KiB {0} [built]
          |    160 modules
     [34] (webpack)/buildin/global.js 472 bytes {0} [built]
    [109] (webpack)/buildin/module.js 497 bytes {0} [built]
    [124] (webpack)/buildin/harmony-module.js 573 bytes {0} [built]
    [128] ./package.json 1.99 KiB {0} [built]
    [201] ./lib/index.js 2.18 KiB {0} [built]
    [202] ./css/index.css 899 bytes {0} [built]
    [203] ./node_modules/css-loader!./css/index.css 333 bytes {0} [built]
    [206] ./lib/pileupViewer.js 10.6 KiB {0} [built]
    [207] external "@jupyter-widgets/base" 42 bytes {0} [built]
    [453] ./lib/utils.js 703 bytes {0} [built]
    [454] ./node_modules/react-color/es/index.js + 209 modules 268 KiB {0} [built]
          |    210 modules
        + 444 hidden modules
    
    WARNING in asset size limit: The following asset(s) exceed the recommended size limit (244 KiB).
    This can impact web performance.
    Assets: 
      index.js (706 KiB)
    
    WARNING in entrypoint size limit: The following entrypoint(s) combined asset size exceeds the recommended limit (244 KiB). This can impact web performance.
    Entrypoints:
      main (706 KiB)
          index.js
    
    
    WARNING in webpack performance recommendations: 
    You can limit the size of your bundles by using import() or require.ensure to lazy load some parts of your application.
    For more info visit https://webpack.js.org/guides/code-splitting/
Child
    Hash: 0ca12c87fffc8797db4b
    Time: 24056ms
    Built at: 02/04/2021 7:49:16 PM
           Asset      Size  Chunks                          Chunk Names
        index.js   695 KiB       0  [emitted]        [big]  main
    index.js.map  3.24 MiB       0  [emitted] [dev]         main
    Entrypoint main [big] = index.js index.js.map
      [4] ./node_modules/underscore/modules/index-all.js + 159 modules 80.5 KiB {0} [built]
          |    160 modules
     [34] (webpack)/buildin/global.js 472 bytes {0} [built]
    [109] (webpack)/buildin/module.js 497 bytes {0} [built]
    [124] (webpack)/buildin/harmony-module.js 573 bytes {0} [built]
    [194] ./package.json 1.99 KiB {0} [built]
    [199] ./lib/embed.js 1.44 KiB {0} [built]
    [200] ./lib/pileupViewer.js 10.6 KiB {0} [built]
    [201] external "@jupyter-widgets/base" 42 bytes {0} [built]
    [447] ./lib/utils.js 703 bytes {0} [built]
    [448] ./node_modules/react-color/es/index.js + 209 modules 268 KiB {0} [built]
          |    210 modules
        + 440 hidden modules
    
    WARNING in asset size limit: The following asset(s) exceed the recommended size limit (244 KiB).
    This can impact web performance.
    Assets: 
      index.js (695 KiB)
    
    WARNING in entrypoint size limit: The following entrypoint(s) combined asset size exceeds the recommended limit (244 KiB). This can impact web performance.
    Entrypoints:
      main (695 KiB)
          index.js
    
    
    WARNING in webpack performance recommendations: 
    You can limit the size of your bundles by using import() or require.ensure to lazy load some parts of your application.
    For more info visit https://webpack.js.org/guides/code-splitting/
npm notice created a lockfile as package-lock.json. You should commit this file.
npm WARN optional SKIPPING OPTIONAL DEPENDENCY: fsevents@~2.3.1 (node_modules/chokidar/node_modules/fsevents):
npm WARN notsup SKIPPING OPTIONAL DEPENDENCY: Unsupported platform for fsevents@2.3.1: wanted {"os":"darwin","arch":"any"} (current: {"os":"linux","arch":"x64"})
npm WARN optional SKIPPING OPTIONAL DEPENDENCY: fsevents@^1.2.7 (node_modules/watchpack-chokidar2/node_modules/chokidar/node_modules/fsevents):
npm WARN notsup SKIPPING OPTIONAL DEPENDENCY: Unsupported platform for fsevents@1.2.13: wanted {"os":"darwin","arch":"any"} (current: {"os":"linux","arch":"x64"})
npm WARN @lumino/coreutils@1.5.3 requires a peer of crypto@1.0.1 but none is installed. You must install peer dependencies yourself.
npm WARN ws@7.4.3 requires a peer of bufferutil@^4.0.1 but none is installed. You must install peer dependencies yourself.
npm WARN ws@7.4.3 requires a peer of utf-8-validate@^5.0.2 but none is installed. You must install peer dependencies yourself.

added 1125 packages from 2018 contributors and audited 1128 packages in 60.545s
found 4 vulnerabilities (1 low, 2 moderate, 1 high)
  run `npm audit fix` to fix them, or `npm audit` for details
+ popd
+ mvn -P widgets test
/tmp/mangoTestXx5n6YK/deleteMePleaseThisIsNoLongerNeeded /home
OpenJDK 64-Bit Server VM warning: ignoring option MaxPermSize=1g; support was removed in 8.0
[INFO] Scanning for projects...
[WARNING] 
[WARNING] Some problems were encountered while building the effective model for org.bdgenomics.mango:mango-pileup-spark3_2.12:jar:0.0.6-SNAPSHOT
[WARNING] 'artifactId' contains an expression but should be a constant. @ org.bdgenomics.mango:mango-pileup-spark3_${scala.version.prefix}:[unknown-version], /tmp/mangoTestXx5n6YK/deleteMePleaseThisIsNoLongerNeeded/mango-pileup/pom.xml, line 11, column 15
[WARNING] 'artifactId' contains an expression but should be a constant. @ org.bdgenomics.mango:mango-parent-spark3_${scala.version.prefix}:0.0.6-SNAPSHOT, /tmp/mangoTestXx5n6YK/deleteMePleaseThisIsNoLongerNeeded/pom.xml, line 13, column 15
[WARNING] 
[WARNING] Some problems were encountered while building the effective model for org.bdgenomics.mango:mango-parent-spark3_2.12:pom:0.0.6-SNAPSHOT
[WARNING] 'artifactId' contains an expression but should be a constant. @ org.bdgenomics.mango:mango-parent-spark3_${scala.version.prefix}:0.0.6-SNAPSHOT, /tmp/mangoTestXx5n6YK/deleteMePleaseThisIsNoLongerNeeded/pom.xml, line 13, column 15
[WARNING] 
[WARNING] It is highly recommended to fix these problems because they threaten the stability of your build.
[WARNING] 
[WARNING] For this reason, future Maven versions might no longer support building such malformed projects.
[WARNING] 
[INFO] ------------------------------------------------------------------------
[INFO] Reactor Build Order:
[INFO] 
[INFO] Mango_2.12: Python visualization hooks                             [jar]
[INFO] mango_2.12                                                         [pom]
[INFO] 
[INFO] -----------< org.bdgenomics.mango:mango-pileup-spark3_2.12 >------------
[INFO] Building Mango_2.12: Python visualization hooks 0.0.6-SNAPSHOT     [1/2]
[INFO] --------------------------------[ jar ]---------------------------------
[INFO] 
[INFO] --- maven-enforcer-plugin:1.0:enforce (enforce-versions) @ mango-pileup-spark3_2.12 ---
[INFO] 
[INFO] --- maven-enforcer-plugin:1.0:enforce (enforce-maven) @ mango-pileup-spark3_2.12 ---
[INFO] 
[INFO] --- scalariform-maven-plugin:0.1.4:format (default) @ mango-pileup-spark3_2.12 ---
[INFO] Modified 0 of 0 .scala files
[INFO] 
[INFO] --- maven-resources-plugin:3.1.0:resources (default-resources) @ mango-pileup-spark3_2.12 ---
[INFO] Using 'UTF-8' encoding to copy filtered resources.
[INFO] skip non existing resourceDirectory /tmp/mangoTestXx5n6YK/deleteMePleaseThisIsNoLongerNeeded/mango-pileup/src/main/resources
[INFO] 
[INFO] --- scala-maven-plugin:3.2.2:compile (scala-compile-first) @ mango-pileup-spark3_2.12 ---
[INFO] No sources to compile
[INFO] 
[INFO] --- exec-maven-plugin:1.6.0:exec (dev-python) @ mango-pileup-spark3_2.12 ---
rm -rf bdgenomics/mango/pileup/static
rm -rf bdgenomics/mango/js/dist
rm -rf bdgenomics.mango.pileup.egg-info/
pip install -v -e .
Created temporary directory: /tmp/mangoTestXx5n6YK/deleteMePleaseThisIsNoLongerNeeded/pip-ephem-wheel-cache-1zo9urpv
Created temporary directory: /tmp/mangoTestXx5n6YK/deleteMePleaseThisIsNoLongerNeeded/pip-req-tracker-alldtgkw
Created requirements tracker '/tmp/mangoTestXx5n6YK/deleteMePleaseThisIsNoLongerNeeded/pip-req-tracker-alldtgkw'
Created temporary directory: /tmp/mangoTestXx5n6YK/deleteMePleaseThisIsNoLongerNeeded/pip-install-pe3_tvjc
Obtaining file:///tmp/mangoTestXx5n6YK/deleteMePleaseThisIsNoLongerNeeded/mango-pileup
  Added file:///tmp/mangoTestXx5n6YK/deleteMePleaseThisIsNoLongerNeeded/mango-pileup to build tracker '/tmp/mangoTestXx5n6YK/deleteMePleaseThisIsNoLongerNeeded/pip-req-tracker-alldtgkw'
    Running setup.py (path:/tmp/mangoTestXx5n6YK/deleteMePleaseThisIsNoLongerNeeded/mango-pileup/setup.py) egg_info for package from file:///tmp/mangoTestXx5n6YK/deleteMePleaseThisIsNoLongerNeeded/mango-pileup
    Running command python setup.py egg_info
    running egg_info
    running jsdeps
    6.4.1
    6.4.1
    Installing build dependencies with npm.  This may take a while...
    npm WARN prepublish-on-install As of npm@5, `prepublish` scripts are deprecated.
    npm WARN prepublish-on-install Use `prepare` for build steps and `prepublishOnly` for upload-only.
    npm WARN prepublish-on-install See the deprecation note in `npm help scripts` for more information.

    > bdgenomics.mango.pileup@0.0.6-beta.1 prepublish /tmp/mangoTestXx5n6YK/deleteMePleaseThisIsNoLongerNeeded/mango-pileup/bdgenomics/mango/js
    > npm run build


    > bdgenomics.mango.pileup@0.0.6-beta.1 build /tmp/mangoTestXx5n6YK/deleteMePleaseThisIsNoLongerNeeded/mango-pileup/bdgenomics/mango/js
    > npm run build:js && webpack


    > bdgenomics.mango.pileup@0.0.6-beta.1 build:js /tmp/mangoTestXx5n6YK/deleteMePleaseThisIsNoLongerNeeded/mango-pileup/bdgenomics/mango/js
    > tsc

    Hash: fbf91a448a06ec206a44765942d76bfd9061978b0ca12c87fffc8797db4b
    Version: webpack 4.46.0
    Child
        Hash: fbf91a448a06ec206a44
        Time: 230ms
        Built at: 02/04/2021 7:49:44 PM
               Asset      Size  Chunks             Chunk Names
        extension.js  1.16 KiB       0  [emitted]  main
        Entrypoint main = extension.js
        [0] ./lib/extension.js 1.19 KiB {0} [built]
    Child
        Hash: 765942d76bfd9061978b
        Time: 11837ms
        Built at: 02/04/2021 7:49:56 PM
               Asset      Size  Chunks                          Chunk Names
            index.js   706 KiB       0  [emitted]        [big]  main
        index.js.map  3.27 MiB       0  [emitted] [dev]         main
        Entrypoint main [big] = index.js index.js.map
          [4] ./node_modules/underscore/modules/index-all.js + 159 modules 80.5 KiB {0} [built]
              |    160 modules
         [34] (webpack)/buildin/global.js 472 bytes {0} [built]
        [109] (webpack)/buildin/module.js 497 bytes {0} [built]
        [124] (webpack)/buildin/harmony-module.js 573 bytes {0} [built]
        [128] ./package.json 1.99 KiB {0} [built]
        [201] ./lib/index.js 2.18 KiB {0} [built]
        [202] ./css/index.css 899 bytes {0} [built]
        [203] ./node_modules/css-loader!./css/index.css 333 bytes {0} [built]
        [206] ./lib/pileupViewer.js 10.6 KiB {0} [built]
        [207] external "@jupyter-widgets/base" 42 bytes {0} [built]
        [453] ./lib/utils.js 703 bytes {0} [built]
        [454] ./node_modules/react-color/es/index.js + 209 modules 268 KiB {0} [built]
              |    210 modules
            + 444 hidden modules

        WARNING in asset size limit: The following asset(s) exceed the recommended size limit (244 KiB).
        This can impact web performance.
        Assets:
          index.js (706 KiB)

        WARNING in entrypoint size limit: The following entrypoint(s) combined asset size exceeds the recommended limit (244 KiB). This can impact web performance.
        Entrypoints:
          main (706 KiB)
              index.js


        WARNING in webpack performance recommendations:
        You can limit the size of your bundles by using import() or require.ensure to lazy load some parts of your application.
        For more info visit https://webpack.js.org/guides/code-splitting/
    Child
        Hash: 0ca12c87fffc8797db4b
        Time: 9630ms
        Built at: 02/04/2021 7:49:53 PM
               Asset      Size  Chunks                          Chunk Names
            index.js   695 KiB       0  [emitted]        [big]  main
        index.js.map  3.24 MiB       0  [emitted] [dev]         main
        Entrypoint main [big] = index.js index.js.map
          [4] ./node_modules/underscore/modules/index-all.js + 159 modules 80.5 KiB {0} [built]
              |    160 modules
         [34] (webpack)/buildin/global.js 472 bytes {0} [built]
        [109] (webpack)/buildin/module.js 497 bytes {0} [built]
        [124] (webpack)/buildin/harmony-module.js 573 bytes {0} [built]
        [194] ./package.json 1.99 KiB {0} [built]
        [199] ./lib/embed.js 1.44 KiB {0} [built]
        [200] ./lib/pileupViewer.js 10.6 KiB {0} [built]
        [201] external "@jupyter-widgets/base" 42 bytes {0} [built]
        [447] ./lib/utils.js 703 bytes {0} [built]
        [448] ./node_modules/react-color/es/index.js + 209 modules 268 KiB {0} [built]
              |    210 modules
            + 440 hidden modules

        WARNING in asset size limit: The following asset(s) exceed the recommended size limit (244 KiB).
        This can impact web performance.
        Assets:
          index.js (695 KiB)

        WARNING in entrypoint size limit: The following entrypoint(s) combined asset size exceeds the recommended limit (244 KiB). This can impact web performance.
        Entrypoints:
          main (695 KiB)
              index.js


        WARNING in webpack performance recommendations:
        You can limit the size of your bundles by using import() or require.ensure to lazy load some parts of your application.
        For more info visit https://webpack.js.org/guides/code-splitting/
    npm WARN @lumino/coreutils@1.5.3 requires a peer of crypto@1.0.1 but none is installed. You must install peer dependencies yourself.
    npm WARN ws@7.4.3 requires a peer of bufferutil@^4.0.1 but none is installed. You must install peer dependencies yourself.
    npm WARN ws@7.4.3 requires a peer of utf-8-validate@^5.0.2 but none is installed. You must install peer dependencies yourself.
    npm WARN optional SKIPPING OPTIONAL DEPENDENCY: fsevents@2.3.1 (node_modules/fsevents):
    npm WARN notsup SKIPPING OPTIONAL DEPENDENCY: Unsupported platform for fsevents@2.3.1: wanted {"os":"darwin","arch":"any"} (current: {"os":"linux","arch":"x64"})
    npm WARN optional SKIPPING OPTIONAL DEPENDENCY: fsevents@1.2.13 (node_modules/watchpack-chokidar2/node_modules/fsevents):
    npm WARN notsup SKIPPING OPTIONAL DEPENDENCY: Unsupported platform for fsevents@1.2.13: wanted {"os":"darwin","arch":"any"} (current: {"os":"linux","arch":"x64"})

    audited 1128 packages in 29.914s
    found 4 vulnerabilities (1 low, 2 moderate, 1 high)
      run `npm audit fix` to fix them, or `npm audit` for details
    creating bdgenomics.mango.pileup.egg-info
    writing bdgenomics.mango.pileup.egg-info/PKG-INFO
    writing dependency_links to bdgenomics.mango.pileup.egg-info/dependency_links.txt
    writing requirements to bdgenomics.mango.pileup.egg-info/requires.txt
    writing top-level names to bdgenomics.mango.pileup.egg-info/top_level.txt
    writing manifest file 'bdgenomics.mango.pileup.egg-info/SOURCES.txt'
    reading manifest file 'bdgenomics.mango.pileup.egg-info/SOURCES.txt'
    reading manifest template 'MANIFEST.in'
    warning: no previously-included files matching '*.py[cod]' found anywhere in distribution
    warning: no previously-included files matching '__pycache__' found anywhere in distribution
    warning: no previously-included files matching '.DS_Store' found anywhere in distribution
    warning: no files found matching 'version.py'
    warning: no files found matching '*.*' under directory 'pileup/static'
    writing manifest file 'bdgenomics.mango.pileup.egg-info/SOURCES.txt'
  Source in /tmp/mangoTestXx5n6YK/deleteMePleaseThisIsNoLongerNeeded/mango-pileup has version 0.0.6a1, which satisfies requirement bdgenomics.mango.pileup==0.0.6a1 from file:///tmp/mangoTestXx5n6YK/deleteMePleaseThisIsNoLongerNeeded/mango-pileup
  Removed bdgenomics.mango.pileup==0.0.6a1 from file:///tmp/mangoTestXx5n6YK/deleteMePleaseThisIsNoLongerNeeded/mango-pileup from build tracker '/tmp/mangoTestXx5n6YK/deleteMePleaseThisIsNoLongerNeeded/pip-req-tracker-alldtgkw'
Requirement already satisfied: ipywidgets>=7.5.0 in /home/jenkins/.conda/envs/mango-build-db034478-c8f4-476e-bb9a-32c7f9ef3762/lib/python3.6/site-packages (from bdgenomics.mango.pileup==0.0.6a1) (7.6.3)
Requirement already satisfied: six==1.11.0 in /home/jenkins/.conda/envs/mango-build-db034478-c8f4-476e-bb9a-32c7f9ef3762/lib/python3.6/site-packages (from bdgenomics.mango.pileup==0.0.6a1) (1.11.0)
Requirement already satisfied: pytest>=5.3.2 in /home/jenkins/.conda/envs/mango-build-db034478-c8f4-476e-bb9a-32c7f9ef3762/lib/python3.6/site-packages (from bdgenomics.mango.pileup==0.0.6a1) (6.2.2)
Requirement already satisfied: jupyter==1.0.0 in /home/jenkins/.conda/envs/mango-build-db034478-c8f4-476e-bb9a-32c7f9ef3762/lib/python3.6/site-packages (from bdgenomics.mango.pileup==0.0.6a1) (1.0.0)
Requirement already satisfied: modin[ray]==0.8.0 in /home/jenkins/.conda/envs/mango-build-db034478-c8f4-476e-bb9a-32c7f9ef3762/lib/python3.6/site-packages (from bdgenomics.mango.pileup==0.0.6a1) (0.8.0)
  Installing extra requirements: 'ray'
Requirement already satisfied: jupyter_contrib_nbextensions==0.5.1 in /home/jenkins/.conda/envs/mango-build-db034478-c8f4-476e-bb9a-32c7f9ef3762/lib/python3.6/site-packages (from bdgenomics.mango.pileup==0.0.6a1) (0.5.1)
Requirement already satisfied: widgetsnbextension~=3.5.0 in /home/jenkins/.conda/envs/mango-build-db034478-c8f4-476e-bb9a-32c7f9ef3762/lib/python3.6/site-packages (from ipywidgets>=7.5.0->bdgenomics.mango.pileup==0.0.6a1) (3.5.1)
Requirement already satisfied: ipykernel>=4.5.1 in /home/jenkins/.conda/envs/mango-build-db034478-c8f4-476e-bb9a-32c7f9ef3762/lib/python3.6/site-packages (from ipywidgets>=7.5.0->bdgenomics.mango.pileup==0.0.6a1) (5.4.2)
Requirement already satisfied: traitlets>=4.3.1 in /home/jenkins/.conda/envs/mango-build-db034478-c8f4-476e-bb9a-32c7f9ef3762/lib/python3.6/site-packages (from ipywidgets>=7.5.0->bdgenomics.mango.pileup==0.0.6a1) (4.3.3)
Requirement already satisfied: ipython>=4.0.0; python_version >= "3.3" in /home/jenkins/.conda/envs/mango-build-db034478-c8f4-476e-bb9a-32c7f9ef3762/lib/python3.6/site-packages (from ipywidgets>=7.5.0->bdgenomics.mango.pileup==0.0.6a1) (7.8.0)
Requirement already satisfied: jupyterlab-widgets>=1.0.0; python_version >= "3.6" in /home/jenkins/.conda/envs/mango-build-db034478-c8f4-476e-bb9a-32c7f9ef3762/lib/python3.6/site-packages (from ipywidgets>=7.5.0->bdgenomics.mango.pileup==0.0.6a1) (1.0.0)
Requirement already satisfied: nbformat>=4.2.0 in /home/jenkins/.conda/envs/mango-build-db034478-c8f4-476e-bb9a-32c7f9ef3762/lib/python3.6/site-packages (from ipywidgets>=7.5.0->bdgenomics.mango.pileup==0.0.6a1) (5.1.2)
Requirement already satisfied: iniconfig in /home/jenkins/.conda/envs/mango-build-db034478-c8f4-476e-bb9a-32c7f9ef3762/lib/python3.6/site-packages (from pytest>=5.3.2->bdgenomics.mango.pileup==0.0.6a1) (1.1.1)
Requirement already satisfied: packaging in /home/jenkins/.conda/envs/mango-build-db034478-c8f4-476e-bb9a-32c7f9ef3762/lib/python3.6/site-packages (from pytest>=5.3.2->bdgenomics.mango.pileup==0.0.6a1) (20.9)
Requirement already satisfied: attrs>=19.2.0 in /home/jenkins/.conda/envs/mango-build-db034478-c8f4-476e-bb9a-32c7f9ef3762/lib/python3.6/site-packages (from pytest>=5.3.2->bdgenomics.mango.pileup==0.0.6a1) (20.3.0)
Requirement already satisfied: py>=1.8.2 in /home/jenkins/.conda/envs/mango-build-db034478-c8f4-476e-bb9a-32c7f9ef3762/lib/python3.6/site-packages (from pytest>=5.3.2->bdgenomics.mango.pileup==0.0.6a1) (1.10.0)
Requirement already satisfied: toml in /home/jenkins/.conda/envs/mango-build-db034478-c8f4-476e-bb9a-32c7f9ef3762/lib/python3.6/site-packages (from pytest>=5.3.2->bdgenomics.mango.pileup==0.0.6a1) (0.10.2)
Requirement already satisfied: importlib-metadata>=0.12; python_version < "3.8" in /home/jenkins/.conda/envs/mango-build-db034478-c8f4-476e-bb9a-32c7f9ef3762/lib/python3.6/site-packages (from pytest>=5.3.2->bdgenomics.mango.pileup==0.0.6a1) (3.4.0)
Requirement already satisfied: pluggy<1.0.0a1,>=0.12 in /home/jenkins/.conda/envs/mango-build-db034478-c8f4-476e-bb9a-32c7f9ef3762/lib/python3.6/site-packages (from pytest>=5.3.2->bdgenomics.mango.pileup==0.0.6a1) (0.13.1)
Requirement already satisfied: qtconsole in /home/jenkins/.conda/envs/mango-build-db034478-c8f4-476e-bb9a-32c7f9ef3762/lib/python3.6/site-packages (from jupyter==1.0.0->bdgenomics.mango.pileup==0.0.6a1) (5.0.2)
Requirement already satisfied: nbconvert in /home/jenkins/.conda/envs/mango-build-db034478-c8f4-476e-bb9a-32c7f9ef3762/lib/python3.6/site-packages (from jupyter==1.0.0->bdgenomics.mango.pileup==0.0.6a1) (6.0.7)
Requirement already satisfied: notebook in /home/jenkins/.conda/envs/mango-build-db034478-c8f4-476e-bb9a-32c7f9ef3762/lib/python3.6/site-packages (from jupyter==1.0.0->bdgenomics.mango.pileup==0.0.6a1) (6.2.0)
Requirement already satisfied: jupyter-console in /home/jenkins/.conda/envs/mango-build-db034478-c8f4-476e-bb9a-32c7f9ef3762/lib/python3.6/site-packages (from jupyter==1.0.0->bdgenomics.mango.pileup==0.0.6a1) (6.2.0)
Requirement already satisfied: pandas==1.0.5 in /home/jenkins/.conda/envs/mango-build-db034478-c8f4-476e-bb9a-32c7f9ef3762/lib/python3.6/site-packages (from modin[ray]==0.8.0->bdgenomics.mango.pileup==0.0.6a1) (1.0.5)
Requirement already satisfied: ray==0.8.6; extra == "ray" in /home/jenkins/.conda/envs/mango-build-db034478-c8f4-476e-bb9a-32c7f9ef3762/lib/python3.6/site-packages (from modin[ray]==0.8.0->bdgenomics.mango.pileup==0.0.6a1) (0.8.6)
Requirement already satisfied: pyarrow<0.17; extra == "ray" in /home/jenkins/.conda/envs/mango-build-db034478-c8f4-476e-bb9a-32c7f9ef3762/lib/python3.6/site-packages (from modin[ray]==0.8.0->bdgenomics.mango.pileup==0.0.6a1) (0.16.0)
Requirement already satisfied: jupyter-core in /home/jenkins/.conda/envs/mango-build-db034478-c8f4-476e-bb9a-32c7f9ef3762/lib/python3.6/site-packages (from jupyter_contrib_nbextensions==0.5.1->bdgenomics.mango.pileup==0.0.6a1) (4.7.1)
Requirement already satisfied: pyyaml in /home/jenkins/.conda/envs/mango-build-db034478-c8f4-476e-bb9a-32c7f9ef3762/lib/python3.6/site-packages (from jupyter_contrib_nbextensions==0.5.1->bdgenomics.mango.pileup==0.0.6a1) (5.4.1)
Requirement already satisfied: lxml in /home/jenkins/.conda/envs/mango-build-db034478-c8f4-476e-bb9a-32c7f9ef3762/lib/python3.6/site-packages (from jupyter_contrib_nbextensions==0.5.1->bdgenomics.mango.pileup==0.0.6a1) (4.6.2)
Requirement already satisfied: jupyter-contrib-core>=0.3.3 in /home/jenkins/.conda/envs/mango-build-db034478-c8f4-476e-bb9a-32c7f9ef3762/lib/python3.6/site-packages (from jupyter_contrib_nbextensions==0.5.1->bdgenomics.mango.pileup==0.0.6a1) (0.3.3)
Requirement already satisfied: jupyter-highlight-selected-word>=0.1.1 in /home/jenkins/.conda/envs/mango-build-db034478-c8f4-476e-bb9a-32c7f9ef3762/lib/python3.6/site-packages (from jupyter_contrib_nbextensions==0.5.1->bdgenomics.mango.pileup==0.0.6a1) (0.2.0)
Requirement already satisfied: ipython-genutils in /home/jenkins/.conda/envs/mango-build-db034478-c8f4-476e-bb9a-32c7f9ef3762/lib/python3.6/site-packages (from jupyter_contrib_nbextensions==0.5.1->bdgenomics.mango.pileup==0.0.6a1) (0.2.0)
Requirement already satisfied: jupyter-nbextensions-configurator>=0.4.0 in /home/jenkins/.conda/envs/mango-build-db034478-c8f4-476e-bb9a-32c7f9ef3762/lib/python3.6/site-packages (from jupyter_contrib_nbextensions==0.5.1->bdgenomics.mango.pileup==0.0.6a1) (0.4.1)
Requirement already satisfied: tornado in /home/jenkins/.conda/envs/mango-build-db034478-c8f4-476e-bb9a-32c7f9ef3762/lib/python3.6/site-packages (from jupyter_contrib_nbextensions==0.5.1->bdgenomics.mango.pileup==0.0.6a1) (6.1)
Requirement already satisfied: jupyter-latex-envs>=1.3.8 in /home/jenkins/.conda/envs/mango-build-db034478-c8f4-476e-bb9a-32c7f9ef3762/lib/python3.6/site-packages (from jupyter_contrib_nbextensions==0.5.1->bdgenomics.mango.pileup==0.0.6a1) (1.4.6)
Requirement already satisfied: jupyter-client in /home/jenkins/.conda/envs/mango-build-db034478-c8f4-476e-bb9a-32c7f9ef3762/lib/python3.6/site-packages (from ipykernel>=4.5.1->ipywidgets>=7.5.0->bdgenomics.mango.pileup==0.0.6a1) (6.1.11)
Requirement already satisfied: decorator in /home/jenkins/.conda/envs/mango-build-db034478-c8f4-476e-bb9a-32c7f9ef3762/lib/python3.6/site-packages (from traitlets>=4.3.1->ipywidgets>=7.5.0->bdgenomics.mango.pileup==0.0.6a1) (4.4.2)
Requirement already satisfied: setuptools>=18.5 in /home/jenkins/.conda/envs/mango-build-db034478-c8f4-476e-bb9a-32c7f9ef3762/lib/python3.6/site-packages (from ipython>=4.0.0; python_version >= "3.3"->ipywidgets>=7.5.0->bdgenomics.mango.pileup==0.0.6a1) (49.6.0.post20210108)
Requirement already satisfied: prompt-toolkit<2.1.0,>=2.0.0 in /home/jenkins/.conda/envs/mango-build-db034478-c8f4-476e-bb9a-32c7f9ef3762/lib/python3.6/site-packages (from ipython>=4.0.0; python_version >= "3.3"->ipywidgets>=7.5.0->bdgenomics.mango.pileup==0.0.6a1) (2.0.10)
Requirement already satisfied: jedi>=0.10 in /home/jenkins/.conda/envs/mango-build-db034478-c8f4-476e-bb9a-32c7f9ef3762/lib/python3.6/site-packages (from ipython>=4.0.0; python_version >= "3.3"->ipywidgets>=7.5.0->bdgenomics.mango.pileup==0.0.6a1) (0.17.2)
Requirement already satisfied: backcall in /home/jenkins/.conda/envs/mango-build-db034478-c8f4-476e-bb9a-32c7f9ef3762/lib/python3.6/site-packages (from ipython>=4.0.0; python_version >= "3.3"->ipywidgets>=7.5.0->bdgenomics.mango.pileup==0.0.6a1) (0.2.0)
Requirement already satisfied: pickleshare in /home/jenkins/.conda/envs/mango-build-db034478-c8f4-476e-bb9a-32c7f9ef3762/lib/python3.6/site-packages (from ipython>=4.0.0; python_version >= "3.3"->ipywidgets>=7.5.0->bdgenomics.mango.pileup==0.0.6a1) (0.7.5)
Requirement already satisfied: pexpect; sys_platform != "win32" in /home/jenkins/.conda/envs/mango-build-db034478-c8f4-476e-bb9a-32c7f9ef3762/lib/python3.6/site-packages (from ipython>=4.0.0; python_version >= "3.3"->ipywidgets>=7.5.0->bdgenomics.mango.pileup==0.0.6a1) (4.8.0)
Requirement already satisfied: pygments in /home/jenkins/.conda/envs/mango-build-db034478-c8f4-476e-bb9a-32c7f9ef3762/lib/python3.6/site-packages (from ipython>=4.0.0; python_version >= "3.3"->ipywidgets>=7.5.0->bdgenomics.mango.pileup==0.0.6a1) (2.7.4)
Requirement already satisfied: jsonschema!=2.5.0,>=2.4 in /home/jenkins/.conda/envs/mango-build-db034478-c8f4-476e-bb9a-32c7f9ef3762/lib/python3.6/site-packages (from nbformat>=4.2.0->ipywidgets>=7.5.0->bdgenomics.mango.pileup==0.0.6a1) (3.2.0)
Requirement already satisfied: pyparsing>=2.0.2 in /home/jenkins/.conda/envs/mango-build-db034478-c8f4-476e-bb9a-32c7f9ef3762/lib/python3.6/site-packages (from packaging->pytest>=5.3.2->bdgenomics.mango.pileup==0.0.6a1) (2.4.7)
Requirement already satisfied: zipp>=0.5 in /home/jenkins/.conda/envs/mango-build-db034478-c8f4-476e-bb9a-32c7f9ef3762/lib/python3.6/site-packages (from importlib-metadata>=0.12; python_version < "3.8"->pytest>=5.3.2->bdgenomics.mango.pileup==0.0.6a1) (3.4.0)
Requirement already satisfied: typing-extensions>=3.6.4; python_version < "3.8" in /home/jenkins/.conda/envs/mango-build-db034478-c8f4-476e-bb9a-32c7f9ef3762/lib/python3.6/site-packages (from importlib-metadata>=0.12; python_version < "3.8"->pytest>=5.3.2->bdgenomics.mango.pileup==0.0.6a1) (3.7.4.3)
Requirement already satisfied: qtpy in /home/jenkins/.conda/envs/mango-build-db034478-c8f4-476e-bb9a-32c7f9ef3762/lib/python3.6/site-packages (from qtconsole->jupyter==1.0.0->bdgenomics.mango.pileup==0.0.6a1) (1.9.0)
Requirement already satisfied: pyzmq>=17.1 in /home/jenkins/.conda/envs/mango-build-db034478-c8f4-476e-bb9a-32c7f9ef3762/lib/python3.6/site-packages (from qtconsole->jupyter==1.0.0->bdgenomics.mango.pileup==0.0.6a1) (22.0.1)
Requirement already satisfied: jupyterlab-pygments in /home/jenkins/.conda/envs/mango-build-db034478-c8f4-476e-bb9a-32c7f9ef3762/lib/python3.6/site-packages (from nbconvert->jupyter==1.0.0->bdgenomics.mango.pileup==0.0.6a1) (0.1.2)
Requirement already satisfied: nbclient<0.6.0,>=0.5.0 in /home/jenkins/.conda/envs/mango-build-db034478-c8f4-476e-bb9a-32c7f9ef3762/lib/python3.6/site-packages (from nbconvert->jupyter==1.0.0->bdgenomics.mango.pileup==0.0.6a1) (0.5.1)
Requirement already satisfied: jinja2>=2.4 in /home/jenkins/.conda/envs/mango-build-db034478-c8f4-476e-bb9a-32c7f9ef3762/lib/python3.6/site-packages (from nbconvert->jupyter==1.0.0->bdgenomics.mango.pileup==0.0.6a1) (2.11.3)
Requirement already satisfied: mistune<2,>=0.8.1 in /home/jenkins/.conda/envs/mango-build-db034478-c8f4-476e-bb9a-32c7f9ef3762/lib/python3.6/site-packages (from nbconvert->jupyter==1.0.0->bdgenomics.mango.pileup==0.0.6a1) (0.8.4)
Requirement already satisfied: bleach in /home/jenkins/.conda/envs/mango-build-db034478-c8f4-476e-bb9a-32c7f9ef3762/lib/python3.6/site-packages (from nbconvert->jupyter==1.0.0->bdgenomics.mango.pileup==0.0.6a1) (3.3.0)
Requirement already satisfied: entrypoints>=0.2.2 in /home/jenkins/.conda/envs/mango-build-db034478-c8f4-476e-bb9a-32c7f9ef3762/lib/python3.6/site-packages (from nbconvert->jupyter==1.0.0->bdgenomics.mango.pileup==0.0.6a1) (0.3)
Requirement already satisfied: testpath in /home/jenkins/.conda/envs/mango-build-db034478-c8f4-476e-bb9a-32c7f9ef3762/lib/python3.6/site-packages (from nbconvert->jupyter==1.0.0->bdgenomics.mango.pileup==0.0.6a1) (0.4.4)
Requirement already satisfied: defusedxml in /home/jenkins/.conda/envs/mango-build-db034478-c8f4-476e-bb9a-32c7f9ef3762/lib/python3.6/site-packages (from nbconvert->jupyter==1.0.0->bdgenomics.mango.pileup==0.0.6a1) (0.6.0)
Requirement already satisfied: pandocfilters>=1.4.1 in /home/jenkins/.conda/envs/mango-build-db034478-c8f4-476e-bb9a-32c7f9ef3762/lib/python3.6/site-packages (from nbconvert->jupyter==1.0.0->bdgenomics.mango.pileup==0.0.6a1) (1.4.2)
Requirement already satisfied: argon2-cffi in /home/jenkins/.conda/envs/mango-build-db034478-c8f4-476e-bb9a-32c7f9ef3762/lib/python3.6/site-packages (from notebook->jupyter==1.0.0->bdgenomics.mango.pileup==0.0.6a1) (20.1.0)
Requirement already satisfied: terminado>=0.8.3 in /home/jenkins/.conda/envs/mango-build-db034478-c8f4-476e-bb9a-32c7f9ef3762/lib/python3.6/site-packages (from notebook->jupyter==1.0.0->bdgenomics.mango.pileup==0.0.6a1) (0.9.2)
Requirement already satisfied: prometheus-client in /home/jenkins/.conda/envs/mango-build-db034478-c8f4-476e-bb9a-32c7f9ef3762/lib/python3.6/site-packages (from notebook->jupyter==1.0.0->bdgenomics.mango.pileup==0.0.6a1) (0.9.0)
Requirement already satisfied: Send2Trash>=1.5.0 in /home/jenkins/.conda/envs/mango-build-db034478-c8f4-476e-bb9a-32c7f9ef3762/lib/python3.6/site-packages (from notebook->jupyter==1.0.0->bdgenomics.mango.pileup==0.0.6a1) (1.5.0)
Requirement already satisfied: numpy>=1.13.3 in /home/jenkins/.conda/envs/mango-build-db034478-c8f4-476e-bb9a-32c7f9ef3762/lib/python3.6/site-packages (from pandas==1.0.5->modin[ray]==0.8.0->bdgenomics.mango.pileup==0.0.6a1) (1.19.5)
Requirement already satisfied: pytz>=2017.2 in /home/jenkins/.conda/envs/mango-build-db034478-c8f4-476e-bb9a-32c7f9ef3762/lib/python3.6/site-packages (from pandas==1.0.5->modin[ray]==0.8.0->bdgenomics.mango.pileup==0.0.6a1) (2021.1)
Requirement already satisfied: python-dateutil>=2.6.1 in /home/jenkins/.conda/envs/mango-build-db034478-c8f4-476e-bb9a-32c7f9ef3762/lib/python3.6/site-packages (from pandas==1.0.5->modin[ray]==0.8.0->bdgenomics.mango.pileup==0.0.6a1) (2.8.1)
Requirement already satisfied: google in /home/jenkins/.conda/envs/mango-build-db034478-c8f4-476e-bb9a-32c7f9ef3762/lib/python3.6/site-packages (from ray==0.8.6; extra == "ray"->modin[ray]==0.8.0->bdgenomics.mango.pileup==0.0.6a1) (3.0.0)
Requirement already satisfied: protobuf>=3.8.0 in /home/jenkins/.conda/envs/mango-build-db034478-c8f4-476e-bb9a-32c7f9ef3762/lib/python3.6/site-packages (from ray==0.8.6; extra == "ray"->modin[ray]==0.8.0->bdgenomics.mango.pileup==0.0.6a1) (3.14.0)
Requirement already satisfied: py-spy>=0.2.0 in /home/jenkins/.conda/envs/mango-build-db034478-c8f4-476e-bb9a-32c7f9ef3762/lib/python3.6/site-packages (from ray==0.8.6; extra == "ray"->modin[ray]==0.8.0->bdgenomics.mango.pileup==0.0.6a1) (0.3.4)
Requirement already satisfied: filelock in /home/jenkins/.conda/envs/mango-build-db034478-c8f4-476e-bb9a-32c7f9ef3762/lib/python3.6/site-packages (from ray==0.8.6; extra == "ray"->modin[ray]==0.8.0->bdgenomics.mango.pileup==0.0.6a1) (3.0.12)
Requirement already satisfied: colorama in /home/jenkins/.conda/envs/mango-build-db034478-c8f4-476e-bb9a-32c7f9ef3762/lib/python3.6/site-packages (from ray==0.8.6; extra == "ray"->modin[ray]==0.8.0->bdgenomics.mango.pileup==0.0.6a1) (0.4.4)
Requirement already satisfied: aiohttp in /home/jenkins/.conda/envs/mango-build-db034478-c8f4-476e-bb9a-32c7f9ef3762/lib/python3.6/site-packages (from ray==0.8.6; extra == "ray"->modin[ray]==0.8.0->bdgenomics.mango.pileup==0.0.6a1) (3.7.3)
Requirement already satisfied: msgpack<2.0.0,>=0.6.0 in /home/jenkins/.conda/envs/mango-build-db034478-c8f4-476e-bb9a-32c7f9ef3762/lib/python3.6/site-packages (from ray==0.8.6; extra == "ray"->modin[ray]==0.8.0->bdgenomics.mango.pileup==0.0.6a1) (1.0.2)
Requirement already satisfied: grpcio in /home/jenkins/.conda/envs/mango-build-db034478-c8f4-476e-bb9a-32c7f9ef3762/lib/python3.6/site-packages (from ray==0.8.6; extra == "ray"->modin[ray]==0.8.0->bdgenomics.mango.pileup==0.0.6a1) (1.35.0)
Requirement already satisfied: redis<3.5.0,>=3.3.2 in /home/jenkins/.conda/envs/mango-build-db034478-c8f4-476e-bb9a-32c7f9ef3762/lib/python3.6/site-packages (from ray==0.8.6; extra == "ray"->modin[ray]==0.8.0->bdgenomics.mango.pileup==0.0.6a1) (3.4.1)
Requirement already satisfied: click>=7.0 in /home/jenkins/.conda/envs/mango-build-db034478-c8f4-476e-bb9a-32c7f9ef3762/lib/python3.6/site-packages (from ray==0.8.6; extra == "ray"->modin[ray]==0.8.0->bdgenomics.mango.pileup==0.0.6a1) (7.1.2)
Requirement already satisfied: wcwidth in /home/jenkins/.conda/envs/mango-build-db034478-c8f4-476e-bb9a-32c7f9ef3762/lib/python3.6/site-packages (from prompt-toolkit<2.1.0,>=2.0.0->ipython>=4.0.0; python_version >= "3.3"->ipywidgets>=7.5.0->bdgenomics.mango.pileup==0.0.6a1) (0.2.5)
Requirement already satisfied: parso<0.8.0,>=0.7.0 in /home/jenkins/.conda/envs/mango-build-db034478-c8f4-476e-bb9a-32c7f9ef3762/lib/python3.6/site-packages (from jedi>=0.10->ipython>=4.0.0; python_version >= "3.3"->ipywidgets>=7.5.0->bdgenomics.mango.pileup==0.0.6a1) (0.7.1)
Requirement already satisfied: ptyprocess>=0.5 in /home/jenkins/.conda/envs/mango-build-db034478-c8f4-476e-bb9a-32c7f9ef3762/lib/python3.6/site-packages (from pexpect; sys_platform != "win32"->ipython>=4.0.0; python_version >= "3.3"->ipywidgets>=7.5.0->bdgenomics.mango.pileup==0.0.6a1) (0.7.0)
Requirement already satisfied: pyrsistent>=0.14.0 in /home/jenkins/.conda/envs/mango-build-db034478-c8f4-476e-bb9a-32c7f9ef3762/lib/python3.6/site-packages (from jsonschema!=2.5.0,>=2.4->nbformat>=4.2.0->ipywidgets>=7.5.0->bdgenomics.mango.pileup==0.0.6a1) (0.17.3)
Requirement already satisfied: nest-asyncio in /home/jenkins/.conda/envs/mango-build-db034478-c8f4-476e-bb9a-32c7f9ef3762/lib/python3.6/site-packages (from nbclient<0.6.0,>=0.5.0->nbconvert->jupyter==1.0.0->bdgenomics.mango.pileup==0.0.6a1) (1.4.3)
Requirement already satisfied: async-generator in /home/jenkins/.conda/envs/mango-build-db034478-c8f4-476e-bb9a-32c7f9ef3762/lib/python3.6/site-packages (from nbclient<0.6.0,>=0.5.0->nbconvert->jupyter==1.0.0->bdgenomics.mango.pileup==0.0.6a1) (1.10)
Requirement already satisfied: MarkupSafe>=0.23 in /home/jenkins/.conda/envs/mango-build-db034478-c8f4-476e-bb9a-32c7f9ef3762/lib/python3.6/site-packages (from jinja2>=2.4->nbconvert->jupyter==1.0.0->bdgenomics.mango.pileup==0.0.6a1) (1.1.1)
Requirement already satisfied: webencodings in /home/jenkins/.conda/envs/mango-build-db034478-c8f4-476e-bb9a-32c7f9ef3762/lib/python3.6/site-packages (from bleach->nbconvert->jupyter==1.0.0->bdgenomics.mango.pileup==0.0.6a1) (0.5.1)
Requirement already satisfied: cffi>=1.0.0 in /home/jenkins/.conda/envs/mango-build-db034478-c8f4-476e-bb9a-32c7f9ef3762/lib/python3.6/site-packages (from argon2-cffi->notebook->jupyter==1.0.0->bdgenomics.mango.pileup==0.0.6a1) (1.14.4)
Requirement already satisfied: beautifulsoup4 in /home/jenkins/.conda/envs/mango-build-db034478-c8f4-476e-bb9a-32c7f9ef3762/lib/python3.6/site-packages (from google->ray==0.8.6; extra == "ray"->modin[ray]==0.8.0->bdgenomics.mango.pileup==0.0.6a1) (4.9.3)
Requirement already satisfied: chardet<4.0,>=2.0 in /home/jenkins/.conda/envs/mango-build-db034478-c8f4-476e-bb9a-32c7f9ef3762/lib/python3.6/site-packages (from aiohttp->ray==0.8.6; extra == "ray"->modin[ray]==0.8.0->bdgenomics.mango.pileup==0.0.6a1) (3.0.4)
Requirement already satisfied: yarl<2.0,>=1.0 in /home/jenkins/.conda/envs/mango-build-db034478-c8f4-476e-bb9a-32c7f9ef3762/lib/python3.6/site-packages (from aiohttp->ray==0.8.6; extra == "ray"->modin[ray]==0.8.0->bdgenomics.mango.pileup==0.0.6a1) (1.6.3)
Requirement already satisfied: multidict<7.0,>=4.5 in /home/jenkins/.conda/envs/mango-build-db034478-c8f4-476e-bb9a-32c7f9ef3762/lib/python3.6/site-packages (from aiohttp->ray==0.8.6; extra == "ray"->modin[ray]==0.8.0->bdgenomics.mango.pileup==0.0.6a1) (5.1.0)
Requirement already satisfied: async-timeout<4.0,>=3.0 in /home/jenkins/.conda/envs/mango-build-db034478-c8f4-476e-bb9a-32c7f9ef3762/lib/python3.6/site-packages (from aiohttp->ray==0.8.6; extra == "ray"->modin[ray]==0.8.0->bdgenomics.mango.pileup==0.0.6a1) (3.0.1)
Requirement already satisfied: idna-ssl>=1.0; python_version < "3.7" in /home/jenkins/.conda/envs/mango-build-db034478-c8f4-476e-bb9a-32c7f9ef3762/lib/python3.6/site-packages (from aiohttp->ray==0.8.6; extra == "ray"->modin[ray]==0.8.0->bdgenomics.mango.pileup==0.0.6a1) (1.1.0)
Requirement already satisfied: pycparser in /home/jenkins/.conda/envs/mango-build-db034478-c8f4-476e-bb9a-32c7f9ef3762/lib/python3.6/site-packages (from cffi>=1.0.0->argon2-cffi->notebook->jupyter==1.0.0->bdgenomics.mango.pileup==0.0.6a1) (2.20)
Requirement already satisfied: soupsieve>1.2; python_version >= "3.0" in /home/jenkins/.conda/envs/mango-build-db034478-c8f4-476e-bb9a-32c7f9ef3762/lib/python3.6/site-packages (from beautifulsoup4->google->ray==0.8.6; extra == "ray"->modin[ray]==0.8.0->bdgenomics.mango.pileup==0.0.6a1) (2.1)
Requirement already satisfied: idna>=2.0 in /home/jenkins/.conda/envs/mango-build-db034478-c8f4-476e-bb9a-32c7f9ef3762/lib/python3.6/site-packages (from yarl<2.0,>=1.0->aiohttp->ray==0.8.6; extra == "ray"->modin[ray]==0.8.0->bdgenomics.mango.pileup==0.0.6a1) (2.10)
Installing collected packages: bdgenomics.mango.pileup
  Found existing installation: bdgenomics.mango.pileup 0.0.6a0
    Uninstalling bdgenomics.mango.pileup-0.0.6a0:
      Created temporary directory: /home/jenkins/.conda/envs/mango-build-db034478-c8f4-476e-bb9a-32c7f9ef3762/lib/python3.6/site-packages/~dgenomics.mango.pileup-0.0.6a0.dist-info
      Removing file or directory /home/jenkins/.conda/envs/mango-build-db034478-c8f4-476e-bb9a-32c7f9ef3762/lib/python3.6/site-packages/bdgenomics.mango.pileup-0.0.6a0.dist-info/
      Created temporary directory: /tmp/mangoTestXx5n6YK/deleteMePleaseThisIsNoLongerNeeded/pip-uninstall-dtmpz3lq
      Removing file or directory /home/jenkins/.conda/envs/mango-build-db034478-c8f4-476e-bb9a-32c7f9ef3762/lib/python3.6/site-packages/bdgenomics/__init__.py
      Created temporary directory: /home/jenkins/.conda/envs/mango-build-db034478-c8f4-476e-bb9a-32c7f9ef3762/lib/python3.6/site-packages/bdgenomics/~_pycache__
      Removing file or directory /home/jenkins/.conda/envs/mango-build-db034478-c8f4-476e-bb9a-32c7f9ef3762/lib/python3.6/site-packages/bdgenomics/__pycache__/
      Created temporary directory: /home/jenkins/.conda/envs/mango-build-db034478-c8f4-476e-bb9a-32c7f9ef3762/lib/python3.6/site-packages/bdgenomics/~ango
      Removing file or directory /home/jenkins/.conda/envs/mango-build-db034478-c8f4-476e-bb9a-32c7f9ef3762/lib/python3.6/site-packages/bdgenomics/mango/
      Created temporary directory: /home/jenkins/.conda/envs/mango-build-db034478-c8f4-476e-bb9a-32c7f9ef3762/share/jupyter/nbextensions/~ileup
      Removing file or directory /home/jenkins/.conda/envs/mango-build-db034478-c8f4-476e-bb9a-32c7f9ef3762/share/jupyter/nbextensions/pileup/
      Successfully uninstalled bdgenomics.mango.pileup-0.0.6a0
  Running setup.py develop for bdgenomics.mango.pileup
    Running command /home/jenkins/.conda/envs/mango-build-db034478-c8f4-476e-bb9a-32c7f9ef3762/bin/python -c 'import sys, setuptools, tokenize; sys.argv[0] = '"'"'/tmp/mangoTestXx5n6YK/deleteMePleaseThisIsNoLongerNeeded/mango-pileup/setup.py'"'"'; __file__='"'"'/tmp/mangoTestXx5n6YK/deleteMePleaseThisIsNoLongerNeeded/mango-pileup/setup.py'"'"';f=getattr(tokenize, '"'"'open'"'"', open)(__file__);code=f.read().replace('"'"'\r\n'"'"', '"'"'\n'"'"');f.close();exec(compile(code, __file__, '"'"'exec'"'"'))' develop --no-deps
    running develop
    running egg_info
    writing bdgenomics.mango.pileup.egg-info/PKG-INFO
    writing dependency_links to bdgenomics.mango.pileup.egg-info/dependency_links.txt
    writing requirements to bdgenomics.mango.pileup.egg-info/requires.txt
    writing top-level names to bdgenomics.mango.pileup.egg-info/top_level.txt
    reading manifest file 'bdgenomics.mango.pileup.egg-info/SOURCES.txt'
    reading manifest template 'MANIFEST.in'
    warning: no previously-included files matching '*.py[cod]' found anywhere in distribution
    warning: no previously-included files matching '__pycache__' found anywhere in distribution
    warning: no previously-included files matching '.DS_Store' found anywhere in distribution
    warning: no files found matching 'version.py'
    warning: no files found matching '*.*' under directory 'pileup/static'
    writing manifest file 'bdgenomics.mango.pileup.egg-info/SOURCES.txt'
    running build_ext
    Creating /home/jenkins/.conda/envs/mango-build-db034478-c8f4-476e-bb9a-32c7f9ef3762/lib/python3.6/site-packages/bdgenomics.mango.pileup.egg-link (link to .)
    Adding bdgenomics.mango.pileup 0.0.6a1 to easy-install.pth file

    Installed /tmp/mangoTestXx5n6YK/deleteMePleaseThisIsNoLongerNeeded/mango-pileup
Successfully installed bdgenomics.mango.pileup
Cleaning up...
Removed build tracker '/tmp/mangoTestXx5n6YK/deleteMePleaseThisIsNoLongerNeeded/pip-req-tracker-alldtgkw'
jupyter nbextension uninstall bdgenomics.mango.pileup
No installed extension 'bdgenomics.mango.pileup' found.
jupyter nbextension enable --py widgetsnbextension
Enabling notebook extension jupyter-js-widgets/extension...
      - Validating: OK
jupyter nbextension install --py --symlink --user bdgenomics.mango.pileup
Installing /tmp/mangoTestXx5n6YK/deleteMePleaseThisIsNoLongerNeeded/mango-pileup/bdgenomics/mango/pileup/static -> bdgenomics.mango.pileup
Symlinking: /home/jenkins/.local/share/jupyter/nbextensions/bdgenomics.mango.pileup -> /tmp/mangoTestXx5n6YK/deleteMePleaseThisIsNoLongerNeeded/mango-pileup/bdgenomics/mango/pileup/static
- Validating: OK

    To initialize this nbextension in the browser every time the notebook (or other app) loads:
    
          jupyter nbextension enable bdgenomics.mango.pileup --user --py
    
jupyter nbextension enable bdgenomics.mango.pileup --py --user
Enabling notebook extension bdgenomics.mango.pileup/extension...
      - Validating: OK
jupyter labextension install bdgenomics/mango/js/ # install widget for jupyter lab
-\|/-\|/-\|/-\|/-\|/-\|/-\|/-\|/-\|/-\|/-\|/-\|/-\|/-\|/-\|/-\|/-\|/-\|/-\|/-\|/-\|/-\|/-\|/-\|/-\|/-\|/-\|/-\|/-\|/-\|/-\|/-\|/-\|/-\|/-\|/-\|/-\|/-\|/-\|/-\|/-\|/-\|/-\|/-\|/-\|/-\|/-\|/-\|/Building jupyterlab assets (build:dev:minimize)
-\|/-\|/-\|/-\|/-\|/-\|/-\|/-\|/-\|/-\|/-\|/-\|/-\|/-\|/-\|/-\|/-\|/-\|/-\|/-\|/-\|/-\|/-\|/-\|/-\|/-\|/-\|/-\|/-\|/-\|/-\|/-\|/-\|/-\|/-\|/-\|/-\|/-\|/-\|/-\|/-\|/-\|/-\|/-\|/-\|/-\|/-\|/-\|/-\|/-\|/-\|/-\|/-\|/-\|/-\|/-\|/-\|/-\|/-\|/-\|/-\|/-\|/-\|/-\|/-\|/-\|/-\|/-\|/-\|/-\|/-\|/-\|/-\|/-\|/-\|/-\|/-\|/-\|/-\|/-\|/-\|/-\|/-\|/-\|/-\|/-\|/-\|/-\|/-\|/-\|/-\|/-\|/-\|/-\|/-\|/-\|/-\|/-\|/-\|/-\|/-\|/-\|/-\|/-\|/-\|/-\|/-\|/-\|/-\|/-\|/-\|/-\|/-\|/-\|/-\|/-\|/-\|/-\|/-\|/-\|/-\|/-\|/-\|/-\|/-\|/-\|/-\|/-\|/-\|/-\|/-\|/-\|/-\|/-\|/-\|/-\|/-\|/-\|/-\|/-\|/-\|/-\|/-\|/-\|/-\|/-\|/-\|/-\|/-\|/-\|/-\|/-\|/-\|/-\|/-\|/-\|/-\|/-\|/-\|/--\|/-\|/-\|/-\|/-\|/-\|/-\|/-\|/-\|/-\|/-\|/-\|/-\|/-\|/-\|/-\|/-\|/-\|/-\|/-\|/-\|/-\|/-\|/-\|/-\|/-\|/-\|/-\|/-\|/-\|/-\|/-\|/-\|/-\|/-\|/-\|/-\|/-\|/-\|/-\|/-\|/-\|/-\|/-\|/-\|/-\|/-\|/-\|/-\|/-\|/-\|/-\|/-\|/-\|/-\|/-\|/-\|/-\|/-\|/-\|/-\|/-\|/-\|/-\|/-\|/-\|/-\|/-\|/-\|/-\|/-\|/-\|/-\|/-\|/-\|/-\|/-\|/-\|/-\|/-\|/-\|/-\|/-\|/-\|/-\|/-\|/-\|/-\|/-\|/-\|/-\|/-\|/-\|/-\|/-\|/-\|/-\|/-\|/-\|/-\|/-\|/-\|/-\|/-\|/-\|/-\|/-\|/-\|/-\|/-\|/-\|/-\|/-\|/-\|/-\|/-\|/-\|/-\|/-\|/-\|python setup.py sdist bdist_egg
running sdist
running egg_info
writing bdgenomics.mango.pileup.egg-info/PKG-INFO
writing dependency_links to bdgenomics.mango.pileup.egg-info/dependency_links.txt
writing requirements to bdgenomics.mango.pileup.egg-info/requires.txt
writing top-level names to bdgenomics.mango.pileup.egg-info/top_level.txt
reading manifest file 'bdgenomics.mango.pileup.egg-info/SOURCES.txt'
reading manifest template 'MANIFEST.in'
warning: no previously-included files matching '*.py[cod]' found anywhere in distribution
warning: no previously-included files matching '__pycache__' found anywhere in distribution
warning: no previously-included files matching '.DS_Store' found anywhere in distribution
warning: no files found matching 'version.py'
warning: no files found matching '*.*' under directory 'pileup/static'
writing manifest file 'bdgenomics.mango.pileup.egg-info/SOURCES.txt'
running check
creating bdgenomics.mango.pileup-0.0.6a1
creating bdgenomics.mango.pileup-0.0.6a1/bdgenomics
creating bdgenomics.mango.pileup-0.0.6a1/bdgenomics.mango.pileup.egg-info
creating bdgenomics.mango.pileup-0.0.6a1/bdgenomics/mango
creating bdgenomics.mango.pileup-0.0.6a1/bdgenomics/mango/io
creating bdgenomics.mango.pileup-0.0.6a1/bdgenomics/mango/io/test
creating bdgenomics.mango.pileup-0.0.6a1/bdgenomics/mango/pileup
creating bdgenomics.mango.pileup-0.0.6a1/bdgenomics/mango/pileup/static
creating bdgenomics.mango.pileup-0.0.6a1/bdgenomics/mango/pileup/test
copying files to bdgenomics.mango.pileup-0.0.6a1...
copying MANIFEST.in -> bdgenomics.mango.pileup-0.0.6a1
copying README.md -> bdgenomics.mango.pileup-0.0.6a1
copying requirements.txt -> bdgenomics.mango.pileup-0.0.6a1
copying setup.py -> bdgenomics.mango.pileup-0.0.6a1
copying bdgenomics/__init__.py -> bdgenomics.mango.pileup-0.0.6a1/bdgenomics
copying bdgenomics.mango.pileup.egg-info/PKG-INFO -> bdgenomics.mango.pileup-0.0.6a1/bdgenomics.mango.pileup.egg-info
copying bdgenomics.mango.pileup.egg-info/SOURCES.txt -> bdgenomics.mango.pileup-0.0.6a1/bdgenomics.mango.pileup.egg-info
copying bdgenomics.mango.pileup.egg-info/dependency_links.txt -> bdgenomics.mango.pileup-0.0.6a1/bdgenomics.mango.pileup.egg-info
copying bdgenomics.mango.pileup.egg-info/not-zip-safe -> bdgenomics.mango.pileup-0.0.6a1/bdgenomics.mango.pileup.egg-info
copying bdgenomics.mango.pileup.egg-info/requires.txt -> bdgenomics.mango.pileup-0.0.6a1/bdgenomics.mango.pileup.egg-info
copying bdgenomics.mango.pileup.egg-info/top_level.txt -> bdgenomics.mango.pileup-0.0.6a1/bdgenomics.mango.pileup.egg-info
copying bdgenomics/mango/__init__.py -> bdgenomics.mango.pileup-0.0.6a1/bdgenomics/mango
copying bdgenomics/mango/io/VCFfile.py -> bdgenomics.mango.pileup-0.0.6a1/bdgenomics/mango/io
copying bdgenomics/mango/io/__init__.py -> bdgenomics.mango.pileup-0.0.6a1/bdgenomics/mango/io
copying bdgenomics/mango/io/bedfile.py -> bdgenomics.mango.pileup-0.0.6a1/bdgenomics/mango/io
copying bdgenomics/mango/io/genomicfile.py -> bdgenomics.mango.pileup-0.0.6a1/bdgenomics/mango/io
copying bdgenomics/mango/io/readers.py -> bdgenomics.mango.pileup-0.0.6a1/bdgenomics/mango/io
copying bdgenomics/mango/io/utils.py -> bdgenomics.mango.pileup-0.0.6a1/bdgenomics/mango/io
copying bdgenomics/mango/io/test/__init__.py -> bdgenomics.mango.pileup-0.0.6a1/bdgenomics/mango/io/test
copying bdgenomics/mango/io/test/test_bed.py -> bdgenomics.mango.pileup-0.0.6a1/bdgenomics/mango/io/test
copying bdgenomics/mango/io/test/test_vcf.py -> bdgenomics.mango.pileup-0.0.6a1/bdgenomics/mango/io/test
copying bdgenomics/mango/pileup/__init__.py -> bdgenomics.mango.pileup-0.0.6a1/bdgenomics/mango/pileup
copying bdgenomics/mango/pileup/_version.py -> bdgenomics.mango.pileup-0.0.6a1/bdgenomics/mango/pileup
copying bdgenomics/mango/pileup/pileupViewer.py -> bdgenomics.mango.pileup-0.0.6a1/bdgenomics/mango/pileup
copying bdgenomics/mango/pileup/sources.py -> bdgenomics.mango.pileup-0.0.6a1/bdgenomics/mango/pileup
copying bdgenomics/mango/pileup/track.py -> bdgenomics.mango.pileup-0.0.6a1/bdgenomics/mango/pileup
copying bdgenomics/mango/pileup/static/extension.js -> bdgenomics.mango.pileup-0.0.6a1/bdgenomics/mango/pileup/static
copying bdgenomics/mango/pileup/static/index.js -> bdgenomics.mango.pileup-0.0.6a1/bdgenomics/mango/pileup/static
copying bdgenomics/mango/pileup/static/index.js.map -> bdgenomics.mango.pileup-0.0.6a1/bdgenomics/mango/pileup/static
copying bdgenomics/mango/pileup/test/__init__.py -> bdgenomics.mango.pileup-0.0.6a1/bdgenomics/mango/pileup/test
copying bdgenomics/mango/pileup/test/test_application.py -> bdgenomics.mango.pileup-0.0.6a1/bdgenomics/mango/pileup/test
copying bdgenomics/mango/pileup/test/test_embed.py -> bdgenomics.mango.pileup-0.0.6a1/bdgenomics/mango/pileup/test
copying bdgenomics/mango/pileup/test/test_notebook.py -> bdgenomics.mango.pileup-0.0.6a1/bdgenomics/mango/pileup/test
copying bdgenomics/mango/pileup/test/test_types.py -> bdgenomics.mango.pileup-0.0.6a1/bdgenomics/mango/pileup/test
Writing bdgenomics.mango.pileup-0.0.6a1/setup.cfg
creating dist
Creating tar archive
removing 'bdgenomics.mango.pileup-0.0.6a1' (and everything under it)
running bdist_egg
installing library code to build/bdist.linux-x86_64/egg
running install_lib
running build_py
creating build
creating build/lib
creating build/lib/bdgenomics
copying bdgenomics/__init__.py -> build/lib/bdgenomics
creating build/lib/bdgenomics/mango
copying bdgenomics/mango/__init__.py -> build/lib/bdgenomics/mango
creating build/lib/bdgenomics/mango/io
copying bdgenomics/mango/io/VCFfile.py -> build/lib/bdgenomics/mango/io
copying bdgenomics/mango/io/readers.py -> build/lib/bdgenomics/mango/io
copying bdgenomics/mango/io/bedfile.py -> build/lib/bdgenomics/mango/io
copying bdgenomics/mango/io/utils.py -> build/lib/bdgenomics/mango/io
copying bdgenomics/mango/io/genomicfile.py -> build/lib/bdgenomics/mango/io
copying bdgenomics/mango/io/__init__.py -> build/lib/bdgenomics/mango/io
creating build/lib/bdgenomics/mango/pileup
copying bdgenomics/mango/pileup/_version.py -> build/lib/bdgenomics/mango/pileup
copying bdgenomics/mango/pileup/pileupViewer.py -> build/lib/bdgenomics/mango/pileup
copying bdgenomics/mango/pileup/sources.py -> build/lib/bdgenomics/mango/pileup
copying bdgenomics/mango/pileup/__init__.py -> build/lib/bdgenomics/mango/pileup
copying bdgenomics/mango/pileup/track.py -> build/lib/bdgenomics/mango/pileup
creating build/lib/bdgenomics/mango/io/test
copying bdgenomics/mango/io/test/test_bed.py -> build/lib/bdgenomics/mango/io/test
copying bdgenomics/mango/io/test/test_vcf.py -> build/lib/bdgenomics/mango/io/test
copying bdgenomics/mango/io/test/__init__.py -> build/lib/bdgenomics/mango/io/test
creating build/lib/bdgenomics/mango/pileup/test
copying bdgenomics/mango/pileup/test/test_types.py -> build/lib/bdgenomics/mango/pileup/test
copying bdgenomics/mango/pileup/test/test_embed.py -> build/lib/bdgenomics/mango/pileup/test
copying bdgenomics/mango/pileup/test/test_notebook.py -> build/lib/bdgenomics/mango/pileup/test
copying bdgenomics/mango/pileup/test/test_application.py -> build/lib/bdgenomics/mango/pileup/test
copying bdgenomics/mango/pileup/test/__init__.py -> build/lib/bdgenomics/mango/pileup/test
creating build/lib/bdgenomics/mango/pileup/static
copying bdgenomics/mango/pileup/static/extension.js -> build/lib/bdgenomics/mango/pileup/static
copying bdgenomics/mango/pileup/static/index.js -> build/lib/bdgenomics/mango/pileup/static
copying bdgenomics/mango/pileup/static/index.js.map -> build/lib/bdgenomics/mango/pileup/static
creating build/bdist.linux-x86_64
creating build/bdist.linux-x86_64/egg
creating build/bdist.linux-x86_64/egg/bdgenomics
copying build/lib/bdgenomics/__init__.py -> build/bdist.linux-x86_64/egg/bdgenomics
creating build/bdist.linux-x86_64/egg/bdgenomics/mango
creating build/bdist.linux-x86_64/egg/bdgenomics/mango/io
copying build/lib/bdgenomics/mango/io/VCFfile.py -> build/bdist.linux-x86_64/egg/bdgenomics/mango/io
copying build/lib/bdgenomics/mango/io/readers.py -> build/bdist.linux-x86_64/egg/bdgenomics/mango/io
creating build/bdist.linux-x86_64/egg/bdgenomics/mango/io/test
copying build/lib/bdgenomics/mango/io/test/test_bed.py -> build/bdist.linux-x86_64/egg/bdgenomics/mango/io/test
copying build/lib/bdgenomics/mango/io/test/test_vcf.py -> build/bdist.linux-x86_64/egg/bdgenomics/mango/io/test
copying build/lib/bdgenomics/mango/io/test/__init__.py -> build/bdist.linux-x86_64/egg/bdgenomics/mango/io/test
copying build/lib/bdgenomics/mango/io/bedfile.py -> build/bdist.linux-x86_64/egg/bdgenomics/mango/io
copying build/lib/bdgenomics/mango/io/utils.py -> build/bdist.linux-x86_64/egg/bdgenomics/mango/io
copying build/lib/bdgenomics/mango/io/genomicfile.py -> build/bdist.linux-x86_64/egg/bdgenomics/mango/io
copying build/lib/bdgenomics/mango/io/__init__.py -> build/bdist.linux-x86_64/egg/bdgenomics/mango/io
creating build/bdist.linux-x86_64/egg/bdgenomics/mango/pileup
copying build/lib/bdgenomics/mango/pileup/_version.py -> build/bdist.linux-x86_64/egg/bdgenomics/mango/pileup
creating build/bdist.linux-x86_64/egg/bdgenomics/mango/pileup/test
copying build/lib/bdgenomics/mango/pileup/test/test_types.py -> build/bdist.linux-x86_64/egg/bdgenomics/mango/pileup/test
copying build/lib/bdgenomics/mango/pileup/test/test_embed.py -> build/bdist.linux-x86_64/egg/bdgenomics/mango/pileup/test
copying build/lib/bdgenomics/mango/pileup/test/test_notebook.py -> build/bdist.linux-x86_64/egg/bdgenomics/mango/pileup/test
copying build/lib/bdgenomics/mango/pileup/test/test_application.py -> build/bdist.linux-x86_64/egg/bdgenomics/mango/pileup/test
copying build/lib/bdgenomics/mango/pileup/test/__init__.py -> build/bdist.linux-x86_64/egg/bdgenomics/mango/pileup/test
copying build/lib/bdgenomics/mango/pileup/pileupViewer.py -> build/bdist.linux-x86_64/egg/bdgenomics/mango/pileup
copying build/lib/bdgenomics/mango/pileup/sources.py -> build/bdist.linux-x86_64/egg/bdgenomics/mango/pileup
creating build/bdist.linux-x86_64/egg/bdgenomics/mango/pileup/static
copying build/lib/bdgenomics/mango/pileup/static/index.js.map -> build/bdist.linux-x86_64/egg/bdgenomics/mango/pileup/static
copying build/lib/bdgenomics/mango/pileup/static/index.js -> build/bdist.linux-x86_64/egg/bdgenomics/mango/pileup/static
copying build/lib/bdgenomics/mango/pileup/static/extension.js -> build/bdist.linux-x86_64/egg/bdgenomics/mango/pileup/static
copying build/lib/bdgenomics/mango/pileup/__init__.py -> build/bdist.linux-x86_64/egg/bdgenomics/mango/pileup
copying build/lib/bdgenomics/mango/pileup/track.py -> build/bdist.linux-x86_64/egg/bdgenomics/mango/pileup
copying build/lib/bdgenomics/mango/__init__.py -> build/bdist.linux-x86_64/egg/bdgenomics/mango
byte-compiling build/bdist.linux-x86_64/egg/bdgenomics/__init__.py to __init__.cpython-36.pyc
byte-compiling build/bdist.linux-x86_64/egg/bdgenomics/mango/io/VCFfile.py to VCFfile.cpython-36.pyc
byte-compiling build/bdist.linux-x86_64/egg/bdgenomics/mango/io/readers.py to readers.cpython-36.pyc
byte-compiling build/bdist.linux-x86_64/egg/bdgenomics/mango/io/test/test_bed.py to test_bed.cpython-36.pyc
byte-compiling build/bdist.linux-x86_64/egg/bdgenomics/mango/io/test/test_vcf.py to test_vcf.cpython-36.pyc
byte-compiling build/bdist.linux-x86_64/egg/bdgenomics/mango/io/test/__init__.py to __init__.cpython-36.pyc
byte-compiling build/bdist.linux-x86_64/egg/bdgenomics/mango/io/bedfile.py to bedfile.cpython-36.pyc
byte-compiling build/bdist.linux-x86_64/egg/bdgenomics/mango/io/utils.py to utils.cpython-36.pyc
byte-compiling build/bdist.linux-x86_64/egg/bdgenomics/mango/io/genomicfile.py to genomicfile.cpython-36.pyc
byte-compiling build/bdist.linux-x86_64/egg/bdgenomics/mango/io/__init__.py to __init__.cpython-36.pyc
byte-compiling build/bdist.linux-x86_64/egg/bdgenomics/mango/pileup/_version.py to _version.cpython-36.pyc
byte-compiling build/bdist.linux-x86_64/egg/bdgenomics/mango/pileup/test/test_types.py to test_types.cpython-36.pyc
byte-compiling build/bdist.linux-x86_64/egg/bdgenomics/mango/pileup/test/test_embed.py to test_embed.cpython-36.pyc
byte-compiling build/bdist.linux-x86_64/egg/bdgenomics/mango/pileup/test/test_notebook.py to test_notebook.cpython-36.pyc
byte-compiling build/bdist.linux-x86_64/egg/bdgenomics/mango/pileup/test/test_application.py to test_application.cpython-36.pyc
byte-compiling build/bdist.linux-x86_64/egg/bdgenomics/mango/pileup/test/__init__.py to __init__.cpython-36.pyc
byte-compiling build/bdist.linux-x86_64/egg/bdgenomics/mango/pileup/pileupViewer.py to pileupViewer.cpython-36.pyc
byte-compiling build/bdist.linux-x86_64/egg/bdgenomics/mango/pileup/sources.py to sources.cpython-36.pyc
byte-compiling build/bdist.linux-x86_64/egg/bdgenomics/mango/pileup/__init__.py to __init__.cpython-36.pyc
byte-compiling build/bdist.linux-x86_64/egg/bdgenomics/mango/pileup/track.py to track.cpython-36.pyc
byte-compiling build/bdist.linux-x86_64/egg/bdgenomics/mango/__init__.py to __init__.cpython-36.pyc
installing package data to build/bdist.linux-x86_64/egg
running install_data
creating build/bdist.linux-x86_64/egg/share
creating build/bdist.linux-x86_64/egg/share/jupyter
creating build/bdist.linux-x86_64/egg/share/jupyter/nbextensions
creating build/bdist.linux-x86_64/egg/share/jupyter/nbextensions/pileup
copying bdgenomics/mango/pileup/static/extension.js -> build/bdist.linux-x86_64/egg/share/jupyter/nbextensions/pileup
copying bdgenomics/mango/pileup/static/index.js -> build/bdist.linux-x86_64/egg/share/jupyter/nbextensions/pileup
copying bdgenomics/mango/pileup/static/index.js.map -> build/bdist.linux-x86_64/egg/share/jupyter/nbextensions/pileup
creating build/bdist.linux-x86_64/egg/EGG-INFO
copying bdgenomics.mango.pileup.egg-info/PKG-INFO -> build/bdist.linux-x86_64/egg/EGG-INFO
copying bdgenomics.mango.pileup.egg-info/SOURCES.txt -> build/bdist.linux-x86_64/egg/EGG-INFO
copying bdgenomics.mango.pileup.egg-info/dependency_links.txt -> build/bdist.linux-x86_64/egg/EGG-INFO
copying bdgenomics.mango.pileup.egg-info/not-zip-safe -> build/bdist.linux-x86_64/egg/EGG-INFO
copying bdgenomics.mango.pileup.egg-info/requires.txt -> build/bdist.linux-x86_64/egg/EGG-INFO
copying bdgenomics.mango.pileup.egg-info/top_level.txt -> build/bdist.linux-x86_64/egg/EGG-INFO
creating 'dist/bdgenomics.mango.pileup-0.0.6a1-py3.6.egg' and adding 'build/bdist.linux-x86_64/egg' to it
removing 'build/bdist.linux-x86_64/egg' (and everything under it)
[INFO] 
[INFO] --- maven-compiler-plugin:3.8.0:compile (default-compile) @ mango-pileup-spark3_2.12 ---
[INFO] No sources to compile
[INFO] 
[INFO] --- maven-resources-plugin:3.1.0:testResources (default-testResources) @ mango-pileup-spark3_2.12 ---
[INFO] Using 'UTF-8' encoding to copy filtered resources.
[INFO] skip non existing resourceDirectory /tmp/mangoTestXx5n6YK/deleteMePleaseThisIsNoLongerNeeded/mango-pileup/src/test/resources
[INFO] 
[INFO] --- scala-maven-plugin:3.2.2:testCompile (scala-test-compile-first) @ mango-pileup-spark3_2.12 ---
[INFO] No sources to compile
[INFO] 
[INFO] --- exec-maven-plugin:1.6.0:exec (test-python) @ mango-pileup-spark3_2.12 ---
pushd examples \
	&& jupyter nbconvert --to python pileup-tutorial.ipynb
/tmp/mangoTestXx5n6YK/deleteMePleaseThisIsNoLongerNeeded/mango-pileup/examples /tmp/mangoTestXx5n6YK/deleteMePleaseThisIsNoLongerNeeded/mango-pileup
[NbConvertApp] Converting notebook pileup-tutorial.ipynb to python
mkdir -p target
python -m pytest -vv --junitxml target/pytest-reports/tests.xml bdgenomics/mango/
============================= test session starts ==============================
platform linux -- Python 3.6.12, pytest-6.2.2, py-1.10.0, pluggy-0.13.1 -- /home/jenkins/.conda/envs/mango-build-db034478-c8f4-476e-bb9a-32c7f9ef3762/bin/python
cachedir: .pytest_cache
rootdir: /tmp/mangoTestXx5n6YK/deleteMePleaseThisIsNoLongerNeeded/mango-pileup
collecting ... collected 32 items

bdgenomics/mango/io/test/test_bed.py::BedFileTest::test_column_type PASSED [  3%]
bdgenomics/mango/io/test/test_bed.py::BedFileTest::test_required_columns PASSED [  6%]
bdgenomics/mango/io/test/test_bed.py::BedFileTest::test_to_json PASSED   [  9%]
bdgenomics/mango/io/test/test_bed.py::BedFileTest::test_validate_num_rows PASSED [ 12%]
bdgenomics/mango/io/test/test_bed.py::BedFileTest::test_visualization PASSED [ 15%]
bdgenomics/mango/io/test/test_vcf.py::VCFFileTest::test_column_type PASSED [ 18%]
bdgenomics/mango/io/test/test_vcf.py::VCFFileTest::test_required_columns PASSED [ 21%]
bdgenomics/mango/io/test/test_vcf.py::VCFFileTest::test_to_json PASSED   [ 25%]
bdgenomics/mango/io/test/test_vcf.py::VCFFileTest::test_visualization PASSED [ 28%]
bdgenomics/mango/pileup/test/test_application.py::MangoVizTest::test_features PASSED [ 31%]
bdgenomics/mango/pileup/test/test_application.py::MangoVizTest::test_genes PASSED [ 34%]
bdgenomics/mango/pileup/test/test_application.py::MangoVizTest::test_genotypes PASSED [ 37%]
bdgenomics/mango/pileup/test/test_application.py::MangoVizTest::test_pileup PASSED [ 40%]
bdgenomics/mango/pileup/test/test_application.py::MangoVizTest::test_toSVG PASSED [ 43%]
bdgenomics/mango/pileup/test/test_application.py::MangoVizTest::test_variants PASSED [ 46%]
bdgenomics/mango/pileup/test/test_application.py::MangoVizTest::test_zoomIn PASSED [ 50%]
bdgenomics/mango/pileup/test/test_application.py::MangoVizTest::test_zoomOut PASSED [ 53%]
bdgenomics/mango/pileup/test/test_embed.py::TestEmbed::test_embed_pileup PASSED [ 56%]
bdgenomics/mango/pileup/test/test_embed.py::TestEmbed::test_embed_data_two_widgets PASSED [ 59%]
bdgenomics/mango/pileup/test/test_embed.py::TestEmbed::test_snippet PASSED [ 62%]
bdgenomics/mango/pileup/test/test_embed.py::TestEmbed::test_minimal_pileup_html PASSED [ 65%]
bdgenomics/mango/pileup/test/test_notebook.py::MangoVizExampleTest::test_notebook_example PASSED [ 68%]
bdgenomics/mango/pileup/test/test_types.py::TestTypes::test_track_invalid_viz_coverage PASSED [ 71%]
bdgenomics/mango/pileup/test/test_types.py::TestTypes::test_track_invalid_viz_features PASSED [ 75%]
bdgenomics/mango/pileup/test/test_types.py::TestTypes::test_track_invalid_viz_genes PASSED [ 78%]
bdgenomics/mango/pileup/test/test_types.py::TestTypes::test_track_invalid_viz_genome PASSED [ 81%]
bdgenomics/mango/pileup/test/test_types.py::TestTypes::test_track_invalid_viz_location PASSED [ 84%]
bdgenomics/mango/pileup/test/test_types.py::TestTypes::test_track_invalid_viz_pileup PASSED [ 87%]
bdgenomics/mango/pileup/test/test_types.py::TestTypes::test_track_invalid_viz_scale PASSED [ 90%]
bdgenomics/mango/pileup/test/test_types.py::TestTypes::test_track_invalid_viz_variants PASSED [ 93%]
bdgenomics/mango/pileup/test/test_types.py::TestTypes::test_track_serialization PASSED [ 96%]
bdgenomics/mango/pileup/test/test_types.py::TestTypes::test_tracks_serialization PASSED [100%]

=============================== warnings summary ===============================
../../../../home/jenkins/.conda/envs/mango-build-db034478-c8f4-476e-bb9a-32c7f9ef3762/lib/python3.6/site-packages/ipywidgets/widgets/widget.py:282
  DeprecationWarning: Widget registration using a string name has been deprecated. Widget registration now uses a plain `@register` decorator.

bdgenomics/mango/io/test/test_bed.py::BedFileTest::test_column_type
bdgenomics/mango/io/test/test_bed.py::BedFileTest::test_required_columns
bdgenomics/mango/io/test/test_bed.py::BedFileTest::test_to_json
bdgenomics/mango/io/test/test_bed.py::BedFileTest::test_validate_num_rows
bdgenomics/mango/io/test/test_bed.py::BedFileTest::test_visualization
  UserWarning: User-defined function verification is still under development in Modin. The function provided is not verified.

bdgenomics/mango/io/test/test_bed.py::BedFileTest::test_column_type
  UserWarning: `Series.<lambda>` defaulting to pandas implementation.
  To request implementation, send an email to feature_requests@modin.org.

bdgenomics/mango/io/test/test_bed.py::BedFileTest::test_required_columns
bdgenomics/mango/io/test/test_bed.py::BedFileTest::test_to_json
bdgenomics/mango/io/test/test_bed.py::BedFileTest::test_validate_num_rows
bdgenomics/mango/io/test/test_bed.py::BedFileTest::test_visualization
  UserWarning: `Series.<lambda>` defaulting to pandas implementation.

bdgenomics/mango/io/test/test_vcf.py::VCFFileTest::test_column_type
bdgenomics/mango/io/test/test_vcf.py::VCFFileTest::test_required_columns
bdgenomics/mango/io/test/test_vcf.py::VCFFileTest::test_to_json
bdgenomics/mango/io/test/test_vcf.py::VCFFileTest::test_visualization
bdgenomics/mango/pileup/test/test_notebook.py::MangoVizExampleTest::test_notebook_example
  UserWarning: Parameters provided defaulting to pandas implementation.

bdgenomics/mango/pileup/test/test_notebook.py::MangoVizExampleTest::test_notebook_example
  FutureWarning: the 'numpy' keyword is deprecated and will be removed in a future version. Please take steps to stop the use of 'numpy'

bdgenomics/mango/pileup/test/test_notebook.py::MangoVizExampleTest::test_notebook_example
  UserWarning: `DataFrame.to_json` defaulting to pandas implementation.

-- Docs: https://docs.pytest.org/en/stable/warnings.html
- generated xml file: /tmp/mangoTestXx5n6YK/deleteMePleaseThisIsNoLongerNeeded/mango-pileup/target/pytest-reports/tests.xml -
======================= 32 passed, 18 warnings in 24.15s =======================
# run lint and flow for js
pushd bdgenomics/mango/js \
	&& npm run test
/tmp/mangoTestXx5n6YK/deleteMePleaseThisIsNoLongerNeeded/mango-pileup/bdgenomics/mango/js /tmp/mangoTestXx5n6YK/deleteMePleaseThisIsNoLongerNeeded/mango-pileup

> bdgenomics.mango.pileup@0.0.6-beta.1 test /tmp/mangoTestXx5n6YK/deleteMePleaseThisIsNoLongerNeeded/mango-pileup/bdgenomics/mango/js
> karma start --single-run --browsers ChromeHeadlessNoSandbox


START:
ℹ 「wdm」: Hash: 9d2c943b68425fd58dd0
Version: webpack 4.46.0
Time: 103ms
Built at: 02/04/2021 7:52:56 PM
ℹ 「wdm」: Compiled successfully.
ℹ 「wdm」: Compiling...
✖ 「wdm」: Hash: 4b582e5973648a1ea313
Version: webpack 4.46.0
Time: 4747ms
Built at: 02/04/2021 7:53:01 PM
            Asset      Size          Chunks             Chunk Names
lib/test/index.js  11.7 MiB  lib/test/index  [emitted]  lib/test/index
Entrypoint lib/test/index = lib/test/index.js
ℹ 「wdm」: Failed to compile.
[./lib/pileupViewer.js] 10.6 KiB {lib/test/index} [built]
[./lib/test/dummy-manager.js] 6.38 KiB {lib/test/index} [built]
[./lib/test/index.js] 531 bytes {lib/test/index} [built]
[./lib/test/pileupViewer-test.js] 1.8 KiB {lib/test/index} [built]
[./lib/test/widget-utils.js] 2.78 KiB {lib/test/index} [built]
[./lib/utils.js] 703 bytes {lib/test/index} [built]
[./node_modules/@jupyter-widgets/base/lib/index.js] 367 bytes {lib/test/index} [built]
[./node_modules/@jupyter-widgets/base/lib/manager-base.js] 20.9 KiB {lib/test/index} [built]
[./node_modules/@jupyter-widgets/base/lib/registry.js] 297 bytes {lib/test/index} [built]
[./node_modules/@jupyter-widgets/controls/lib/index.js] 780 bytes {lib/test/index} [built]
[./node_modules/chai/index.js] 40 bytes {lib/test/index} [built]
[./node_modules/chai/lib/chai.js] 1.23 KiB {lib/test/index} [built]
[./node_modules/pileup/dist/main/pileup.js] 10.7 KiB {lib/test/index} [built]
[./node_modules/underscore/modules/index-all.js] 809 bytes {lib/test/index} [built]
[./package.json] 1.99 KiB {lib/test/index} [built]
    + 928 hidden modules

ERROR in ./lib/test/index.js
Module not found: Error: Can't resolve './utils-test' in '/tmp/mangoTestXx5n6YK/deleteMePleaseThisIsNoLongerNeeded/mango-pileup/bdgenomics/mango/js/lib/test'
 @ ./lib/test/index.js 5:0-23
04 02 2021 19:53:03.696:INFO [karma-server]: Karma v5.2.3 server started at http://localhost:9876/
04 02 2021 19:53:03.698:INFO [launcher]: Launching browsers ChromeHeadlessNoSandbox with concurrency unlimited
04 02 2021 19:53:03.703:INFO [launcher]: Starting browser ChromeHeadless
04 02 2021 19:53:04.772:INFO [Chrome Headless 84.0.4147.135 (Linux x86_64)]: Connected on socket bceo0TxCP_X7Z28cAAAA with id 92381478
04 02 2021 19:53:06.312:WARN [reporter]: SourceMap position not found for trace: Uncaught Error: Cannot find module './utils-test'
at http://localhost:9876/base/lib/test/index.js?ccbea7a2cb4c7a7e6a01152270539ef2bde5785c:355:142

Error: Cannot find module './utils-test'
    at webpackMissingModule (http://localhost:9876/base/lib/test/index.js?ccbea7a2cb4c7a7e6a01152270539ef2bde5785c:355:65)
    at Object../lib/test/index.js (http://localhost:9876/base/lib/test/index.js?ccbea7a2cb4c7a7e6a01152270539ef2bde5785c:355:152)
    at __webpack_require__ (http://localhost:9876/base/lib/test/index.js?ccbea7a2cb4c7a7e6a01152270539ef2bde5785c:20:30)
    at http://localhost:9876/base/lib/test/index.js?ccbea7a2cb4c7a7e6a01152270539ef2bde5785c:84:18
    at http://localhost:9876/base/lib/test/index.js?ccbea7a2cb4c7a7e6a01152270539ef2bde5785c:87:10
04 02 2021 19:53:06.313:WARN [reporter]: SourceMap position not found for trace: Uncaught Error: Cannot find module './utils-test'
at http://localhost:9876/base/lib/test/index.js?ccbea7a2cb4c7a7e6a01152270539ef2bde5785c:355:142

Error: Cannot find module './utils-test'
    at webpackMissingModule (http://localhost:9876/base/lib/test/index.js?ccbea7a2cb4c7a7e6a01152270539ef2bde5785c:355:65)
    at Object../lib/test/index.js (http://localhost:9876/base/lib/test/index.js?ccbea7a2cb4c7a7e6a01152270539ef2bde5785c:355:152)
    at __webpack_require__ (http://localhost:9876/base/lib/test/index.js?ccbea7a2cb4c7a7e6a01152270539ef2bde5785c:20:30)
    at http://localhost:9876/base/lib/test/index.js?ccbea7a2cb4c7a7e6a01152270539ef2bde5785c:84:18
    at http://localhost:9876/base/lib/test/index.js?ccbea7a2cb4c7a7e6a01152270539ef2bde5785c:87:10
Chrome Headless 84.0.4147.135 (Linux x86_64) ERROR
  Uncaught Error: Cannot find module './utils-test'
  at webpack:///lib/test/index.js:5:9 <- lib/test/index.js:355:142
  
  Error: Cannot find module './utils-test'
      at webpackMissingModule (webpack:///lib/test/index.js:5:9 <- lib/test/index.js:355:65)
      at Object../lib/test/index.js (webpack:///lib/test/index.js:5:9 <- lib/test/index.js:355:152)
      at __webpack_require__ (webpack:///webpack/bootstrap:19:1 <- lib/test/index.js:20:30)
      at webpack:///webpack/bootstrap:83:1 <- lib/test/index.js:84:18
      at lib/test/index.js:87:10

04 02 2021 19:53:06.314:WARN [reporter]: SourceMap position not found for trace: Uncaught Error: Cannot find module './utils-test'
at http://localhost:9876/base/lib/test/index.js?ccbea7a2cb4c7a7e6a01152270539ef2bde5785c:355:142

Error: Cannot find module './utils-test'
    at webpackMissingModule (http://localhost:9876/base/lib/test/index.js?ccbea7a2cb4c7a7e6a01152270539ef2bde5785c:355:65)
    at Object../lib/test/index.js (http://localhost:9876/base/lib/test/index.js?ccbea7a2cb4c7a7e6a01152270539ef2bde5785c:355:152)
    at __webpack_require__ (http://localhost:9876/base/lib/test/index.js?ccbea7a2cb4c7a7e6a01152270539ef2bde5785c:20:30)
    at http://localhost:9876/base/lib/test/index.js?ccbea7a2cb4c7a7e6a01152270539ef2bde5785c:84:18
    at http://localhost:9876/base/lib/test/index.js?ccbea7a2cb4c7a7e6a01152270539ef2bde5785c:87:10
Chrome Headless 84.0.4147.135 (Linux x86_64) ERROR
  Uncaught Error: Cannot find module './utils-test'
  at webpack:///lib/test/index.js:5:9 <- lib/test/index.js:355:142
  
  Error: Cannot find module './utils-test'
      at webpackMissingModule (webpack:///lib/test/index.js:5:9 <- lib/test/index.js:355:65)
      at Object../lib/test/index.js (webpack:///lib/test/index.js:5:9 <- lib/test/index.js:355:152)
      at __webpack_require__ (webpack:///webpack/bootstrap:19:1 <- lib/test/index.js:20:30)
      at webpack:///webpack/bootstrap:83:1 <- lib/test/index.js:84:18
      at lib/test/index.js:87:10


Finished in 1.544 secs / 0 secs @ 19:53:06 GMT+0000 (Coordinated Universal Time)

SUMMARY:
✔ 0 tests completed
npm ERR! code ELIFECYCLE
npm ERR! errno 1
npm ERR! bdgenomics.mango.pileup@0.0.6-beta.1 test: `karma start --single-run --browsers ChromeHeadlessNoSandbox`
npm ERR! Exit status 1
npm ERR! 
npm ERR! Failed at the bdgenomics.mango.pileup@0.0.6-beta.1 test script.
npm ERR! This is probably not a problem with npm. There is likely additional logging output above.

npm ERR! A complete log of this run can be found in:
npm ERR!     /home/jenkins/.npm/_logs/2021-02-04T19_53_06_468Z-debug.log
make: *** [test] Error 1
Makefile:84: recipe for target 'test' failed
[ERROR] Command execution failed.
org.apache.commons.exec.ExecuteException: Process exited with an error: 2 (Exit value: 2)
    at org.apache.commons.exec.DefaultExecutor.executeInternal (DefaultExecutor.java:404)
    at org.apache.commons.exec.DefaultExecutor.execute (DefaultExecutor.java:166)
    at org.codehaus.mojo.exec.ExecMojo.executeCommandLine (ExecMojo.java:804)
    at org.codehaus.mojo.exec.ExecMojo.executeCommandLine (ExecMojo.java:751)
    at org.codehaus.mojo.exec.ExecMojo.execute (ExecMojo.java:313)
    at org.apache.maven.plugin.DefaultBuildPluginManager.executeMojo (DefaultBuildPluginManager.java:137)
    at org.apache.maven.lifecycle.internal.MojoExecutor.execute (MojoExecutor.java:210)
    at org.apache.maven.lifecycle.internal.MojoExecutor.execute (MojoExecutor.java:156)
    at org.apache.maven.lifecycle.internal.MojoExecutor.execute (MojoExecutor.java:148)
    at org.apache.maven.lifecycle.internal.LifecycleModuleBuilder.buildProject (LifecycleModuleBuilder.java:117)
    at org.apache.maven.lifecycle.internal.LifecycleModuleBuilder.buildProject (LifecycleModuleBuilder.java:81)
    at org.apache.maven.lifecycle.internal.builder.singlethreaded.SingleThreadedBuilder.build (SingleThreadedBuilder.java:56)
    at org.apache.maven.lifecycle.internal.LifecycleStarter.execute (LifecycleStarter.java:128)
    at org.apache.maven.DefaultMaven.doExecute (DefaultMaven.java:305)
    at org.apache.maven.DefaultMaven.doExecute (DefaultMaven.java:192)
    at org.apache.maven.DefaultMaven.execute (DefaultMaven.java:105)
    at org.apache.maven.cli.MavenCli.execute (MavenCli.java:956)
    at org.apache.maven.cli.MavenCli.doMain (MavenCli.java:288)
    at org.apache.maven.cli.MavenCli.main (MavenCli.java:192)
    at sun.reflect.NativeMethodAccessorImpl.invoke0 (Native Method)
    at sun.reflect.NativeMethodAccessorImpl.invoke (NativeMethodAccessorImpl.java:62)
    at sun.reflect.DelegatingMethodAccessorImpl.invoke (DelegatingMethodAccessorImpl.java:43)
    at java.lang.reflect.Method.invoke (Method.java:498)
    at org.codehaus.plexus.classworlds.launcher.Launcher.launchEnhanced (Launcher.java:289)
    at org.codehaus.plexus.classworlds.launcher.Launcher.launch (Launcher.java:229)
    at org.codehaus.plexus.classworlds.launcher.Launcher.mainWithExitCode (Launcher.java:415)
    at org.codehaus.plexus.classworlds.launcher.Launcher.main (Launcher.java:356)
[INFO] ------------------------------------------------------------------------
[INFO] Reactor Summary for mango_2.12 0.0.6-SNAPSHOT:
[INFO] 
[INFO] Mango_2.12: Python visualization hooks ............. FAILURE [03:47 min]
[INFO] mango_2.12 ......................................... SKIPPED
[INFO] ------------------------------------------------------------------------
[INFO] BUILD FAILURE
[INFO] ------------------------------------------------------------------------
[INFO] Total time:  03:47 min
[INFO] Finished at: 2021-02-04T19:53:06Z
[INFO] ------------------------------------------------------------------------
[ERROR] Failed to execute goal org.codehaus.mojo:exec-maven-plugin:1.6.0:exec (test-python) on project mango-pileup-spark3_2.12: Command execution failed.: Process exited with an error: 2 (Exit value: 2) -> [Help 1]
[ERROR] 
[ERROR] To see the full stack trace of the errors, re-run Maven with the -e switch.
[ERROR] Re-run Maven using the -X switch to enable full debug logging.
[ERROR] 
[ERROR] For more information about the errors and possible solutions, please read the following articles:
[ERROR] [Help 1] http://cwiki.apache.org/confluence/display/MAVEN/MojoExecutionException
clean_up
+ clean_up
+ set +x +v
DeprecationWarning: 'source deactivate' is deprecated. Use 'conda deactivate'.

## Package Plan ##

  environment location: /home/jenkins/.conda/envs/mango-build-db034478-c8f4-476e-bb9a-32c7f9ef3762


The following packages will be REMOVED:

  _libgcc_mutex-0.1-conda_forge
  _openmp_mutex-4.5-1_gnu
  argon2-cffi-20.1.0-py36h8f6f2f9_2
  async_generator-1.10-py_0
  attrs-20.3.0-pyhd3deb0d_0
  backcall-0.2.0-pyh9f0ad1d_0
  backports-1.0-py_2
  backports.functools_lru_cache-1.6.1-py_0
  bleach-3.3.0-pyh44b312d_0
  brotlipy-0.7.0-py36h8f6f2f9_1001
  ca-certificates-2021.1.19-h06a4308_0
  certifi-2020.12.5-py36h06a4308_0
  cffi-1.14.4-py36hc120d54_1
  chardet-4.0.0-py36h5fab9bb_1
  cryptography-3.3.1-py36h0a59100_1
  decorator-4.4.2-py_0
  defusedxml-0.6.0-py_0
  entrypoints-0.3-pyhd8ed1ab_1003
  idna-2.10-pyh9f0ad1d_0
  importlib-metadata-3.4.0-py36h5fab9bb_0
  importlib_metadata-3.4.0-hd8ed1ab_0
  ipykernel-5.4.2-py36he448a4c_0
  ipython-7.16.1-py36he448a4c_2
  ipython_genutils-0.2.0-py_1
  jedi-0.17.2-py36h5fab9bb_1
  jinja2-2.11.3-pyh44b312d_0
  json5-0.9.5-pyh9f0ad1d_0
  jsonschema-3.2.0-py_2
  jupyter_client-6.1.11-pyhd8ed1ab_1
  jupyter_core-4.7.1-py36h5fab9bb_0
  jupyterlab-2.0.1-py_0
  jupyterlab_pygments-0.1.2-pyh9f0ad1d_0
  jupyterlab_server-1.2.0-py_0
  ld_impl_linux-64-2.35.1-hea4e1c9_2
  libffi-3.3-h58526e2_2
  libgcc-ng-9.3.0-h2828fa1_18
  libgomp-9.3.0-h2828fa1_18
  libsodium-1.0.18-h36c2ea0_1
  libstdcxx-ng-9.3.0-h6de172a_18
  markupsafe-1.1.1-py36h8f6f2f9_3
  mistune-0.8.4-py36h8f6f2f9_1003
  nbclient-0.5.1-py_0
  nbconvert-6.0.7-py36h5fab9bb_3
  nbformat-5.1.2-pyhd8ed1ab_1
  ncurses-6.2-h58526e2_4
  nest-asyncio-1.4.3-pyhd8ed1ab_0
  nodejs-10.13.0-he6710b0_0
  notebook-6.2.0-py36h5fab9bb_0
  openssl-1.1.1i-h27cfd23_0
  packaging-20.9-pyh44b312d_0
  pandoc-2.11.4-h7f98852_0
  pandocfilters-1.4.2-py_1
  parso-0.7.1-pyh9f0ad1d_0
  pexpect-4.8.0-pyh9f0ad1d_2
  pickleshare-0.7.5-py_1003
  pip-19.3.1-py36_0
  prometheus_client-0.9.0-pyhd3deb0d_0
  prompt-toolkit-3.0.14-pyha770c72_0
  ptyprocess-0.7.0-pyhd3deb0d_0
  pycparser-2.20-pyh9f0ad1d_2
  pygments-2.7.4-pyhd8ed1ab_0
  pyopenssl-20.0.1-pyhd8ed1ab_0
  pyparsing-2.4.7-pyh9f0ad1d_0
  pyrsistent-0.17.3-py36h8f6f2f9_2
  pysocks-1.7.1-py36h5fab9bb_3
  python-3.6.12-hffdb5ce_0_cpython
  python-dateutil-2.8.1-py_0
  python_abi-3.6-1_cp36m
  pyzmq-22.0.1-py36h81c33ee_0
  readline-8.0-he28a2e2_2
  requests-2.25.1-pyhd3deb0d_0
  send2trash-1.5.0-py_0
  setuptools-49.6.0-py36h5fab9bb_3
  six-1.15.0-pyh9f0ad1d_0
  sqlite-3.34.0-h74cdb3f_0
  terminado-0.9.2-py36h5fab9bb_0
  testpath-0.4.4-py_0
  tk-8.6.10-h21135ba_1
  tornado-6.1-py36h8f6f2f9_1
  traitlets-4.3.3-py36h9f0ad1d_1
  typing_extensions-3.7.4.3-py_0
  urllib3-1.26.3-pyhd8ed1ab_0
  wcwidth-0.2.5-pyh9f0ad1d_2
  webencodings-0.5.1-py_1
  wheel-0.36.2-pyhd3deb0d_0
  xz-5.2.5-h516909a_1
  zeromq-4.3.4-h9c3ff4c_0
  zipp-3.4.0-py_0
  zlib-1.2.11-h516909a_1010


Preparing transaction: ...working... done
Verifying transaction: ...working... done
Executing transaction: ...working... done

Remove all packages in environment /home/jenkins/.conda/envs/mango-build-db034478-c8f4-476e-bb9a-32c7f9ef3762:

Build step 'Execute shell' marked build as failure
Finished: FAILURE