FailedConsole Output

GitHub pull request #63 of commit 919b95962e2e1f52228ea5489147286465037e95.
[EnvInject] - Loading node environment variables.
Building remotely on amp-jenkins-worker-08 (centos spark-test) in workspace /home/jenkins/workspace/snap-prb
Wiping out workspace first.
Cloning the remote Git repository
Cloning repository https://github.com/amplab/snap.git
 > git init /home/jenkins/workspace/snap-prb # timeout=10
Fetching upstream changes from https://github.com/amplab/snap.git
 > git --version # timeout=10
 > git fetch --tags --progress https://github.com/amplab/snap.git +refs/heads/*:refs/remotes/origin/*
 > git config remote.origin.url https://github.com/amplab/snap.git # timeout=10
 > git config --add remote.origin.fetch +refs/heads/*:refs/remotes/origin/* # timeout=10
 > git config remote.origin.url https://github.com/amplab/snap.git # timeout=10
Fetching upstream changes from https://github.com/amplab/snap.git
 > git fetch --tags --progress https://github.com/amplab/snap.git +refs/pull/*:refs/remotes/origin/pr/*
 > git rev-parse 919b95962e2e1f52228ea5489147286465037e95^{commit} # timeout=10
 > git branch -a --contains 919b95962e2e1f52228ea5489147286465037e95 # timeout=10
 > git rev-parse remotes/origin/pr/63/head^{commit} # timeout=10
Checking out Revision 919b95962e2e1f52228ea5489147286465037e95 (origin/pr/63/head)
 > git config core.sparsecheckout # timeout=10
 > git checkout -f 919b95962e2e1f52228ea5489147286465037e95
 > git rev-list fa17fff4104b2679aceaaf14e0fb6c5676fc92af # timeout=10
[snap-prb] $ /bin/sh -xe /tmp/hudson5555011506846433726.sh
+ make
g++ -O3 -Wno-format -MMD -ISNAPLib -msse   -c -o SNAPLib/AlignerContext.o SNAPLib/AlignerContext.cpp
In file included from SNAPLib/VariableSizeMap.h:5,
                 from SNAPLib/DataReader.h:26,
                 from SNAPLib/Read.h:30,
                 from SNAPLib/AlignerOptions.h:30,
                 from SNAPLib/AlignerContext.cpp:29:
SNAPLib/VariableSizeVector.h: In member function 'void VariableSizeVector<V, grow, big>::reserve(_int64)':
SNAPLib/VariableSizeVector.h:88: error: there are no arguments to 'WriteErrorMessage' that depend on a template parameter, so a declaration of 'WriteErrorMessage' must be available
SNAPLib/VariableSizeVector.h:88: note: (if you use '-fpermissive', G++ will accept your code, but allowing the use of an undeclared name is deprecated)
make: *** [SNAPLib/AlignerContext.o] Error 1
Build step 'Execute shell' marked build as failure
ERROR: Failed to set Jenkins Identity header on email.
java.lang.NullPointerException
	at org.jenkinsci.main.modules.instance_identity.InstanceIdentity.get(InstanceIdentity.java:126)
	at jenkins.plugins.mailer.tasks.MimeMessageBuilder.setJenkinsInstanceIdent(MimeMessageBuilder.java:188)
	at jenkins.plugins.mailer.tasks.MimeMessageBuilder.buildMimeMessage(MimeMessageBuilder.java:166)
	at hudson.tasks.MailSender.createEmptyMail(MailSender.java:391)
	at hudson.tasks.MailSender.createFailureMail(MailSender.java:260)
	at hudson.tasks.MailSender.createMail(MailSender.java:178)
	at hudson.tasks.MailSender.run(MailSender.java:107)
	at hudson.tasks.Mailer.perform(Mailer.java:141)
	at hudson.tasks.BuildStepCompatibilityLayer.perform(BuildStepCompatibilityLayer.java:78)
	at hudson.tasks.BuildStepMonitor$1.perform(BuildStepMonitor.java:20)
	at hudson.model.AbstractBuild$AbstractBuildExecution.perform(AbstractBuild.java:782)
	at hudson.model.AbstractBuild$AbstractBuildExecution.performAllBuildSteps(AbstractBuild.java:723)
	at hudson.model.Build$BuildExecution.post2(Build.java:185)
	at hudson.model.AbstractBuild$AbstractBuildExecution.post(AbstractBuild.java:668)
	at hudson.model.Run.execute(Run.java:1763)
	at hudson.model.FreeStyleBuild.run(FreeStyleBuild.java:43)
	at hudson.model.ResourceController.execute(ResourceController.java:98)
	at hudson.model.Executor.run(Executor.java:410)
Sending e-mails to: fnothaft@berkeley.edu
Test FAILed.
Refer to this link for build results (access rights to CI server needed): 
https://amplab.cs.berkeley.edu/jenkins//job/snap-prb/22/
Test FAILed.
Finished: FAILURE