Failed

org.apache.spark.sql.hive.DataSourceWithHiveMetastoreCatalogSuite.Persist non-partitioned parquet relation into metastore as external table

Failing for the past 1 build (Since Failed#1 )
Took 2.2 sec.

Error Message

org.apache.spark.sql.execution.QueryExecutionException: FAILED: SemanticException [Error 10001]: Line 1:14 Table not found 't'

Stacktrace

sbt.ForkMain$ForkError: org.apache.spark.sql.execution.QueryExecutionException: FAILED: SemanticException [Error 10001]: Line 1:14 Table not found 't'
	at org.apache.spark.sql.hive.client.HiveClientImpl$$anonfun$runHive$1.apply(HiveClientImpl.scala:699)
	at org.apache.spark.sql.hive.client.HiveClientImpl$$anonfun$runHive$1.apply(HiveClientImpl.scala:683)
	at org.apache.spark.sql.hive.client.HiveClientImpl$$anonfun$withHiveState$1.apply(HiveClientImpl.scala:272)
	at org.apache.spark.sql.hive.client.HiveClientImpl.liftedTree1$1(HiveClientImpl.scala:210)
	at org.apache.spark.sql.hive.client.HiveClientImpl.retryLocked(HiveClientImpl.scala:209)
	at org.apache.spark.sql.hive.client.HiveClientImpl.withHiveState(HiveClientImpl.scala:255)
	at org.apache.spark.sql.hive.client.HiveClientImpl.runHive(HiveClientImpl.scala:683)
	at org.apache.spark.sql.hive.client.HiveClientImpl.runSqlHive(HiveClientImpl.scala:673)
	at org.apache.spark.sql.hive.DataSourceWithHiveMetastoreCatalogSuite$$anonfun$9$$anonfun$apply$2$$anonfun$apply$mcV$sp$7$$anonfun$apply$3.apply$mcV$sp(HiveMetastoreCatalogSuite.scala:217)
	at org.apache.spark.sql.test.SQLTestUtilsBase$class.withTable(SQLTestUtils.scala:273)
	at org.apache.spark.sql.hive.DataSourceWithHiveMetastoreCatalogSuite.withTable(HiveMetastoreCatalogSuite.scala:139)
	at org.apache.spark.sql.hive.DataSourceWithHiveMetastoreCatalogSuite$$anonfun$9$$anonfun$apply$2$$anonfun$apply$mcV$sp$7.apply(HiveMetastoreCatalogSuite.scala:191)
	at org.apache.spark.sql.hive.DataSourceWithHiveMetastoreCatalogSuite$$anonfun$9$$anonfun$apply$2$$anonfun$apply$mcV$sp$7.apply(HiveMetastoreCatalogSuite.scala:190)
	at org.apache.spark.sql.test.SQLTestUtilsBase$class.withTempPath(SQLTestUtils.scala:179)
	at org.apache.spark.sql.hive.DataSourceWithHiveMetastoreCatalogSuite.withTempPath(HiveMetastoreCatalogSuite.scala:139)
	at org.apache.spark.sql.hive.DataSourceWithHiveMetastoreCatalogSuite$$anonfun$9$$anonfun$apply$2.apply$mcV$sp(HiveMetastoreCatalogSuite.scala:190)
	at org.apache.spark.sql.hive.DataSourceWithHiveMetastoreCatalogSuite$$anonfun$9$$anonfun$apply$2.apply(HiveMetastoreCatalogSuite.scala:190)
	at org.apache.spark.sql.hive.DataSourceWithHiveMetastoreCatalogSuite$$anonfun$9$$anonfun$apply$2.apply(HiveMetastoreCatalogSuite.scala:190)
	at org.scalatest.OutcomeOf$class.outcomeOf(OutcomeOf.scala:85)
	at org.scalatest.OutcomeOf$.outcomeOf(OutcomeOf.scala:104)
	at org.scalatest.Transformer.apply(Transformer.scala:22)
	at org.scalatest.Transformer.apply(Transformer.scala:20)
	at org.scalatest.FunSuiteLike$$anon$1.apply(FunSuiteLike.scala:186)
	at org.apache.spark.SparkFunSuite.withFixture(SparkFunSuite.scala:68)
	at org.scalatest.FunSuiteLike$class.invokeWithFixture$1(FunSuiteLike.scala:183)
	at org.scalatest.FunSuiteLike$$anonfun$runTest$1.apply(FunSuiteLike.scala:196)
	at org.scalatest.FunSuiteLike$$anonfun$runTest$1.apply(FunSuiteLike.scala:196)
	at org.scalatest.SuperEngine.runTestImpl(Engine.scala:289)
	at org.scalatest.FunSuiteLike$class.runTest(FunSuiteLike.scala:196)
	at org.scalatest.FunSuite.runTest(FunSuite.scala:1560)
	at org.scalatest.FunSuiteLike$$anonfun$runTests$1.apply(FunSuiteLike.scala:229)
	at org.scalatest.FunSuiteLike$$anonfun$runTests$1.apply(FunSuiteLike.scala:229)
	at org.scalatest.SuperEngine$$anonfun$traverseSubNodes$1$1.apply(Engine.scala:396)
	at org.scalatest.SuperEngine$$anonfun$traverseSubNodes$1$1.apply(Engine.scala:384)
	at scala.collection.immutable.List.foreach(List.scala:381)
	at org.scalatest.SuperEngine.traverseSubNodes$1(Engine.scala:384)
	at org.scalatest.SuperEngine.org$scalatest$SuperEngine$$runTestsInBranch(Engine.scala:379)
	at org.scalatest.SuperEngine.runTestsImpl(Engine.scala:461)
	at org.scalatest.FunSuiteLike$class.runTests(FunSuiteLike.scala:229)
	at org.scalatest.FunSuite.runTests(FunSuite.scala:1560)
	at org.scalatest.Suite$class.run(Suite.scala:1147)
	at org.scalatest.FunSuite.org$scalatest$FunSuiteLike$$super$run(FunSuite.scala:1560)
	at org.scalatest.FunSuiteLike$$anonfun$run$1.apply(FunSuiteLike.scala:233)
	at org.scalatest.FunSuiteLike$$anonfun$run$1.apply(FunSuiteLike.scala:233)
	at org.scalatest.SuperEngine.runImpl(Engine.scala:521)
	at org.scalatest.FunSuiteLike$class.run(FunSuiteLike.scala:233)
	at org.apache.spark.SparkFunSuite.org$scalatest$BeforeAndAfterAll$$super$run(SparkFunSuite.scala:31)
	at org.scalatest.BeforeAndAfterAll$class.liftedTree1$1(BeforeAndAfterAll.scala:213)
	at org.scalatest.BeforeAndAfterAll$class.run(BeforeAndAfterAll.scala:210)
	at org.apache.spark.SparkFunSuite.run(SparkFunSuite.scala:31)
	at org.scalatest.tools.Framework.org$scalatest$tools$Framework$$runSuite(Framework.scala:314)
	at org.scalatest.tools.Framework$ScalaTestTask.execute(Framework.scala:480)
	at sbt.ForkMain$Run$2.call(ForkMain.java:296)
	at sbt.ForkMain$Run$2.call(ForkMain.java:286)
	at java.util.concurrent.FutureTask.run(FutureTask.java:266)
	at java.util.concurrent.ThreadPoolExecutor.runWorker(ThreadPoolExecutor.java:1142)
	at java.util.concurrent.ThreadPoolExecutor$Worker.run(ThreadPoolExecutor.java:617)
	at java.lang.Thread.run(Thread.java:745)