FailedConsole Output

Skipping 1,268 KB.. Full Log
ry: /home/jenkins/workspace/spark-master-test-k8s/common/network-shuffle/src/main/scala
[INFO] Add Test Source directory: /home/jenkins/workspace/spark-master-test-k8s/common/network-shuffle/src/test/scala
[INFO] 
[INFO] --- maven-dependency-plugin:3.1.1:build-classpath (default-cli) @ spark-network-shuffle_2.12 ---
[INFO] Dependencies classpath:
/home/jenkins/.m2/repository/com/fasterxml/jackson/core/jackson-annotations/2.10.0/jackson-annotations-2.10.0.jar:/home/jenkins/workspace/spark-master-test-k8s/common/network-common/target/spark-network-common_2.12-3.1.0-SNAPSHOT.jar:/home/jenkins/.m2/repository/org/apache/commons/commons-lang3/3.10/commons-lang3-3.10.jar:/home/jenkins/.m2/repository/org/apache/commons/commons-crypto/1.0.0/commons-crypto-1.0.0.jar:/home/jenkins/.m2/repository/org/spark-project/spark/unused/1.0.0/unused-1.0.0.jar:/home/jenkins/.m2/repository/com/fasterxml/jackson/core/jackson-databind/2.10.0/jackson-databind-2.10.0.jar:/home/jenkins/.m2/repository/com/google/code/findbugs/jsr305/3.0.0/jsr305-3.0.0.jar:/home/jenkins/.m2/repository/org/fusesource/leveldbjni/leveldbjni-all/1.8/leveldbjni-all-1.8.jar:/home/jenkins/.m2/repository/com/fasterxml/jackson/core/jackson-core/2.10.0/jackson-core-2.10.0.jar:/home/jenkins/.m2/repository/io/dropwizard/metrics/metrics-core/4.1.1/metrics-core-4.1.1.jar:/home/jenkins/.m2/repository/org/scala-lang/scala-library/2.12.10/scala-library-2.12.10.jar:/home/jenkins/.m2/repository/io/netty/netty-all/4.1.51.Final/netty-all-4.1.51.Final.jar
[INFO] 
[INFO] --- maven-remote-resources-plugin:1.5:process (process-resource-bundles) @ spark-network-shuffle_2.12 ---
[INFO] 
[INFO] --- maven-resources-plugin:2.7:resources (default-resources) @ spark-network-shuffle_2.12 ---
[INFO] Using 'UTF-8' encoding to copy filtered resources.
[INFO] skip non existing resourceDirectory /home/jenkins/workspace/spark-master-test-k8s/common/network-shuffle/src/main/resources
[INFO] Copying 3 resources
[INFO] 
[INFO] --- maven-compiler-plugin:3.8.1:compile (default-compile) @ spark-network-shuffle_2.12 ---
[INFO] Not compiling main sources
[INFO] 
[INFO] --- scala-maven-plugin:4.3.0:compile (scala-compile-first) @ spark-network-shuffle_2.12 ---
[INFO] Using incremental compilation using Mixed compile order
[INFO] Compiler bridge file: /home/jenkins/.sbt/1.0/zinc/org.scala-sbt/org.scala-sbt-compiler-bridge_2.12-1.3.1-bin_2.12.10__52.0-1.3.1_20191012T045515.jar
[INFO] Compiling 30 Java sources to /home/jenkins/workspace/spark-master-test-k8s/common/network-shuffle/target/scala-2.12/classes ...
[INFO] Done compiling.
[INFO] compile in 0.4 s
[INFO] 
[INFO] --- maven-antrun-plugin:1.8:run (create-tmp-dir) @ spark-network-shuffle_2.12 ---
[INFO] Executing tasks

main:
[INFO] Executed tasks
[INFO] 
[INFO] --- maven-resources-plugin:2.7:testResources (default-testResources) @ spark-network-shuffle_2.12 ---
[INFO] Using 'UTF-8' encoding to copy filtered resources.
[INFO] Copying 1 resource
[INFO] Copying 3 resources
[INFO] 
[INFO] --- maven-compiler-plugin:3.8.1:testCompile (default-testCompile) @ spark-network-shuffle_2.12 ---
[INFO] Not compiling test sources
[INFO] 
[INFO] --- maven-dependency-plugin:3.1.1:build-classpath (generate-test-classpath) @ spark-network-shuffle_2.12 ---
[INFO] Dependencies classpath:
/home/jenkins/.m2/repository/org/scala-lang/scala-reflect/2.12.10/scala-reflect-2.12.10.jar:/home/jenkins/.m2/repository/org/scalatestplus/scalatestplus-mockito_2.12/1.0.0-SNAP5/scalatestplus-mockito_2.12-1.0.0-SNAP5.jar:/home/jenkins/.m2/repository/log4j/log4j/1.2.17/log4j-1.2.17.jar:/home/jenkins/.m2/repository/com/novocode/junit-interface/0.11/junit-interface-0.11.jar:/home/jenkins/.m2/repository/net/bytebuddy/byte-buddy-agent/1.9.10/byte-buddy-agent-1.9.10.jar:/home/jenkins/.m2/repository/io/dropwizard/metrics/metrics-core/4.1.1/metrics-core-4.1.1.jar:/home/jenkins/.m2/repository/io/netty/netty-all/4.1.51.Final/netty-all-4.1.51.Final.jar:/home/jenkins/.m2/repository/org/scalatest/scalatest-diagrams_2.12/3.2.0/scalatest-diagrams_2.12-3.2.0.jar:/home/jenkins/.m2/repository/com/fasterxml/jackson/core/jackson-annotations/2.10.0/jackson-annotations-2.10.0.jar:/home/jenkins/.m2/repository/org/seleniumhq/selenium/selenium-chrome-driver/3.141.59/selenium-chrome-driver-3.141.59.jar:/home/jenkins/.m2/repository/com/google/code/findbugs/jsr305/3.0.0/jsr305-3.0.0.jar:/home/jenkins/.m2/repository/org/objenesis/objenesis/2.6/objenesis-2.6.jar:/home/jenkins/.m2/repository/org/seleniumhq/selenium/selenium-opera-driver/3.141.59/selenium-opera-driver-3.141.59.jar:/home/jenkins/.m2/repository/org/fusesource/leveldbjni/leveldbjni-all/1.8/leveldbjni-all-1.8.jar:/home/jenkins/.m2/repository/org/scalatest/scalatest-freespec_2.12/3.2.0/scalatest-freespec_2.12-3.2.0.jar:/home/jenkins/.m2/repository/com/fasterxml/jackson/core/jackson-core/2.10.0/jackson-core-2.10.0.jar:/home/jenkins/.m2/repository/org/scalatest/scalatest-refspec_2.12/3.2.0/scalatest-refspec_2.12-3.2.0.jar:/home/jenkins/.m2/repository/org/apache/commons/commons-crypto/1.0.0/commons-crypto-1.0.0.jar:/home/jenkins/.m2/repository/org/scalatest/scalatest-wordspec_2.12/3.2.0/scalatest-wordspec_2.12-3.2.0.jar:/home/jenkins/.m2/repository/org/scalatestplus/scalatestplus-selenium_2.12/1.0.0-SNAP5/scalatestplus-selenium_2.12-1.0.0-SNAP5.jar:/home/jenkins/.m2/repository/org/scala-sbt/test-interface/1.0/test-interface-1.0.jar:/home/jenkins/.m2/repository/com/squareup/okio/okio/1.14.0/okio-1.14.0.jar:/home/jenkins/.m2/repository/org/hamcrest/hamcrest-core/1.3/hamcrest-core-1.3.jar:/home/jenkins/.m2/repository/org/seleniumhq/selenium/selenium-support/3.141.59/selenium-support-3.141.59.jar:/home/jenkins/.m2/repository/org/scalatest/scalatest-mustmatchers_2.12/3.2.0/scalatest-mustmatchers_2.12-3.2.0.jar:/home/jenkins/.m2/repository/org/scala-lang/modules/scala-xml_2.12/1.2.0/scala-xml_2.12-1.2.0.jar:/home/jenkins/.m2/repository/org/scala-lang/scala-library/2.12.10/scala-library-2.12.10.jar:/home/jenkins/workspace/spark-master-test-k8s/common/network-common/target/spark-network-common_2.12-3.1.0-SNAPSHOT.jar:/home/jenkins/.m2/repository/org/slf4j/slf4j-api/1.7.30/slf4j-api-1.7.30.jar:/home/jenkins/.m2/repository/com/fasterxml/jackson/core/jackson-databind/2.10.0/jackson-databind-2.10.0.jar:/home/jenkins/.m2/repository/com/squareup/okhttp3/okhttp/3.11.0/okhttp-3.11.0.jar:/home/jenkins/.m2/repository/org/seleniumhq/selenium/selenium-remote-driver/3.141.59/selenium-remote-driver-3.141.59.jar:/home/jenkins/.m2/repository/org/scalatest/scalatest_2.12/3.2.0/scalatest_2.12-3.2.0.jar:/home/jenkins/workspace/spark-master-test-k8s/common/tags/target/spark-tags_2.12-3.1.0-SNAPSHOT.jar:/home/jenkins/.m2/repository/org/seleniumhq/selenium/selenium-ie-driver/3.141.59/selenium-ie-driver-3.141.59.jar:/home/jenkins/.m2/repository/org/scalatestplus/scalatestplus-scalacheck_2.12/3.1.0.0-RC2/scalatestplus-scalacheck_2.12-3.1.0.0-RC2.jar:/home/jenkins/.m2/repository/org/scalatest/scalatest-matchers-core_2.12/3.2.0/scalatest-matchers-core_2.12-3.2.0.jar:/home/jenkins/workspace/spark-master-test-k8s/common/network-common/target/spark-network-common_2.12-3.1.0-SNAPSHOT-tests.jar:/home/jenkins/.m2/repository/org/apache/commons/commons-lang3/3.10/commons-lang3-3.10.jar:/home/jenkins/.m2/repository/org/seleniumhq/selenium/selenium-api/3.141.59/selenium-api-3.141.59.jar:/home/jenkins/.m2/repository/org/seleniumhq/selenium/selenium-java/3.141.59/selenium-java-3.141.59.jar:/home/jenkins/.m2/repository/org/seleniumhq/selenium/selenium-edge-driver/3.141.59/selenium-edge-driver-3.141.59.jar:/home/jenkins/.m2/repository/org/apache/commons/commons-exec/1.3/commons-exec-1.3.jar:/home/jenkins/.m2/repository/org/scalacheck/scalacheck_2.12/1.14.2/scalacheck_2.12-1.14.2.jar:/home/jenkins/.m2/repository/org/scalatest/scalatest-flatspec_2.12/3.2.0/scalatest-flatspec_2.12-3.2.0.jar:/home/jenkins/.m2/repository/com/google/guava/guava/14.0.1/guava-14.0.1.jar:/home/jenkins/.m2/repository/org/scalatest/scalatest-funspec_2.12/3.2.0/scalatest-funspec_2.12-3.2.0.jar:/home/jenkins/.m2/repository/org/spark-project/spark/unused/1.0.0/unused-1.0.0.jar:/home/jenkins/.m2/repository/org/scalatest/scalatest-shouldmatchers_2.12/3.2.0/scalatest-shouldmatchers_2.12-3.2.0.jar:/home/jenkins/workspace/spark-master-test-k8s/common/tags/target/spark-tags_2.12-3.1.0-SNAPSHOT-tests.jar:/home/jenkins/.m2/repository/junit/junit/4.12/junit-4.12.jar:/home/jenkins/.m2/repository/org/seleniumhq/selenium/selenium-firefox-driver/3.141.59/selenium-firefox-driver-3.141.59.jar:/home/jenkins/.m2/repository/org/scalactic/scalactic_2.12/3.2.0/scalactic_2.12-3.2.0.jar:/home/jenkins/.m2/repository/org/scalatest/scalatest-propspec_2.12/3.2.0/scalatest-propspec_2.12-3.2.0.jar:/home/jenkins/.m2/repository/org/mockito/mockito-core/3.1.0/mockito-core-3.1.0.jar:/home/jenkins/.m2/repository/net/bytebuddy/byte-buddy/1.9.10/byte-buddy-1.9.10.jar:/home/jenkins/.m2/repository/org/scalatest/scalatest-compatible/3.2.0/scalatest-compatible-3.2.0.jar:/home/jenkins/.m2/repository/org/seleniumhq/selenium/selenium-safari-driver/3.141.59/selenium-safari-driver-3.141.59.jar:/home/jenkins/.m2/repository/org/scalatest/scalatest-funsuite_2.12/3.2.0/scalatest-funsuite_2.12-3.2.0.jar:/home/jenkins/.m2/repository/org/scalatest/scalatest-core_2.12/3.2.0/scalatest-core_2.12-3.2.0.jar:/home/jenkins/.m2/repository/org/scalatest/scalatest-featurespec_2.12/3.2.0/scalatest-featurespec_2.12-3.2.0.jar
[INFO] 
[INFO] --- scala-maven-plugin:4.3.0:testCompile (scala-test-compile-first) @ spark-network-shuffle_2.12 ---
[INFO] Using incremental compilation using Mixed compile order
[INFO] Compiler bridge file: /home/jenkins/.sbt/1.0/zinc/org.scala-sbt/org.scala-sbt-compiler-bridge_2.12-1.3.1-bin_2.12.10__52.0-1.3.1_20191012T045515.jar
[INFO] Compiling 13 Java sources to /home/jenkins/workspace/spark-master-test-k8s/common/network-shuffle/target/scala-2.12/test-classes ...
[INFO] Done compiling.
[INFO] compile in 0.4 s
[INFO] 
[INFO] --- maven-surefire-plugin:3.0.0-M3:test (default-test) @ spark-network-shuffle_2.12 ---
[INFO] 
[INFO] -------------------------------------------------------
[INFO]  T E S T S
[INFO] -------------------------------------------------------
[WARNING] Couldn't load group class 'k8s' in Surefire|Failsafe plugin. The group class is ignored!
[INFO] 
[INFO] Results:
[INFO] 
[INFO] Tests run: 0, Failures: 0, Errors: 0, Skipped: 0
[INFO] 
[INFO] 
[INFO] --- maven-surefire-plugin:3.0.0-M3:test (test) @ spark-network-shuffle_2.12 ---
[INFO] Skipping execution of surefire because it has already been run for this configuration
[INFO] 
[INFO] --- scalatest-maven-plugin:2.0.0:test (test) @ spark-network-shuffle_2.12 ---
Discovery starting.
Discovery completed in 98 milliseconds.
Run starting. Expected test count is: 0
DiscoverySuite:
Run completed in 138 milliseconds.
Total number of tests run: 0
Suites: completed 1, aborted 0
Tests: succeeded 0, failed 0, canceled 0, ignored 0, pending 0
No tests were executed.
[INFO] 
[INFO] --- maven-jar-plugin:3.1.2:test-jar (prepare-test-jar) @ spark-network-shuffle_2.12 ---
[INFO] Building jar: /home/jenkins/workspace/spark-master-test-k8s/common/network-shuffle/target/spark-network-shuffle_2.12-3.1.0-SNAPSHOT-tests.jar
[INFO] 
[INFO] --- maven-jar-plugin:3.1.2:jar (default-jar) @ spark-network-shuffle_2.12 ---
[INFO] Building jar: /home/jenkins/workspace/spark-master-test-k8s/common/network-shuffle/target/spark-network-shuffle_2.12-3.1.0-SNAPSHOT.jar
[INFO] 
[INFO] --- maven-site-plugin:3.5.1:attach-descriptor (attach-descriptor) @ spark-network-shuffle_2.12 ---
[INFO] 
[INFO] --- maven-shade-plugin:3.2.1:shade (default) @ spark-network-shuffle_2.12 ---
[INFO] Excluding org.apache.spark:spark-network-common_2.12:jar:3.1.0-SNAPSHOT from the shaded jar.
[INFO] Excluding org.scala-lang:scala-library:jar:2.12.10 from the shaded jar.
[INFO] Excluding io.netty:netty-all:jar:4.1.51.Final from the shaded jar.
[INFO] Excluding org.apache.commons:commons-lang3:jar:3.10 from the shaded jar.
[INFO] Excluding org.fusesource.leveldbjni:leveldbjni-all:jar:1.8 from the shaded jar.
[INFO] Excluding com.fasterxml.jackson.core:jackson-databind:jar:2.10.0 from the shaded jar.
[INFO] Excluding com.fasterxml.jackson.core:jackson-core:jar:2.10.0 from the shaded jar.
[INFO] Excluding com.fasterxml.jackson.core:jackson-annotations:jar:2.10.0 from the shaded jar.
[INFO] Excluding com.google.code.findbugs:jsr305:jar:3.0.0 from the shaded jar.
[INFO] Excluding org.apache.commons:commons-crypto:jar:1.0.0 from the shaded jar.
[INFO] Excluding io.dropwizard.metrics:metrics-core:jar:4.1.1 from the shaded jar.
[INFO] Including org.spark-project.spark:unused:jar:1.0.0 in the shaded jar.
[INFO] Replacing original artifact with shaded artifact.
[INFO] Replacing /home/jenkins/workspace/spark-master-test-k8s/common/network-shuffle/target/spark-network-shuffle_2.12-3.1.0-SNAPSHOT.jar with /home/jenkins/workspace/spark-master-test-k8s/common/network-shuffle/target/spark-network-shuffle_2.12-3.1.0-SNAPSHOT-shaded.jar
[INFO] Dependency-reduced POM written at: /home/jenkins/workspace/spark-master-test-k8s/common/network-shuffle/dependency-reduced-pom.xml
[INFO] 
[INFO] --- maven-source-plugin:3.1.0:jar-no-fork (create-source-jar) @ spark-network-shuffle_2.12 ---
[INFO] Building jar: /home/jenkins/workspace/spark-master-test-k8s/common/network-shuffle/target/spark-network-shuffle_2.12-3.1.0-SNAPSHOT-sources.jar
[INFO] 
[INFO] --- maven-source-plugin:3.1.0:test-jar-no-fork (create-source-jar) @ spark-network-shuffle_2.12 ---
[INFO] Building jar: /home/jenkins/workspace/spark-master-test-k8s/common/network-shuffle/target/spark-network-shuffle_2.12-3.1.0-SNAPSHOT-test-sources.jar
[INFO] 
[INFO] -----------------< org.apache.spark:spark-unsafe_2.12 >-----------------
[INFO] Building Spark Project Unsafe 3.1.0-SNAPSHOT                       [6/9]
[INFO] --------------------------------[ jar ]---------------------------------
[INFO] 
[INFO] --- maven-enforcer-plugin:3.0.0-M2:enforce (enforce-versions) @ spark-unsafe_2.12 ---
[INFO] 
[INFO] --- maven-enforcer-plugin:3.0.0-M2:enforce (enforce-no-duplicate-dependencies) @ spark-unsafe_2.12 ---
[INFO] 
[INFO] --- mvn-scalafmt_2.12:1.0.3:format (default) @ spark-unsafe_2.12 ---
[WARNING] format.skipSources set, ignoring main directories
[WARNING] format.skipTestSources set, ignoring validateOnly directories
[WARNING] No sources specified, skipping formatting
[INFO] 
[INFO] --- scala-maven-plugin:4.3.0:add-source (eclipse-add-source) @ spark-unsafe_2.12 ---
[INFO] Add Source directory: /home/jenkins/workspace/spark-master-test-k8s/common/unsafe/src/main/scala
[INFO] Add Test Source directory: /home/jenkins/workspace/spark-master-test-k8s/common/unsafe/src/test/scala
[INFO] 
[INFO] --- maven-dependency-plugin:3.1.1:build-classpath (default-cli) @ spark-unsafe_2.12 ---
[INFO] Dependencies classpath:
/home/jenkins/.m2/repository/com/esotericsoftware/kryo-shaded/4.0.2/kryo-shaded-4.0.2.jar:/home/jenkins/.m2/repository/com/esotericsoftware/minlog/1.3.0/minlog-1.3.0.jar:/home/jenkins/.m2/repository/org/spark-project/spark/unused/1.0.0/unused-1.0.0.jar:/home/jenkins/.m2/repository/com/google/code/findbugs/jsr305/3.0.0/jsr305-3.0.0.jar:/home/jenkins/.m2/repository/org/objenesis/objenesis/2.6/objenesis-2.6.jar:/home/jenkins/workspace/spark-master-test-k8s/common/tags/target/spark-tags_2.12-3.1.0-SNAPSHOT.jar:/home/jenkins/.m2/repository/org/apache/xbean/xbean-asm7-shaded/4.15/xbean-asm7-shaded-4.15.jar:/home/jenkins/.m2/repository/com/twitter/chill_2.12/0.9.5/chill_2.12-0.9.5.jar:/home/jenkins/.m2/repository/org/scala-lang/scala-library/2.12.10/scala-library-2.12.10.jar:/home/jenkins/.m2/repository/com/twitter/chill-java/0.9.5/chill-java-0.9.5.jar
[INFO] 
[INFO] --- maven-remote-resources-plugin:1.5:process (process-resource-bundles) @ spark-unsafe_2.12 ---
[INFO] 
[INFO] --- maven-resources-plugin:2.7:resources (default-resources) @ spark-unsafe_2.12 ---
[INFO] Using 'UTF-8' encoding to copy filtered resources.
[INFO] skip non existing resourceDirectory /home/jenkins/workspace/spark-master-test-k8s/common/unsafe/src/main/resources
[INFO] Copying 3 resources
[INFO] 
[INFO] --- maven-compiler-plugin:3.8.1:compile (default-compile) @ spark-unsafe_2.12 ---
[INFO] Not compiling main sources
[INFO] 
[INFO] --- scala-maven-plugin:4.3.0:compile (scala-compile-first) @ spark-unsafe_2.12 ---
[INFO] Using incremental compilation using Mixed compile order
[INFO] Compiler bridge file: /home/jenkins/.sbt/1.0/zinc/org.scala-sbt/org.scala-sbt-compiler-bridge_2.12-1.3.1-bin_2.12.10__52.0-1.3.1_20191012T045515.jar
[INFO] Compiling 18 Java sources to /home/jenkins/workspace/spark-master-test-k8s/common/unsafe/target/scala-2.12/classes ...
[WARNING] [Warn] /home/jenkins/workspace/spark-master-test-k8s/common/unsafe/src/main/java/org/apache/spark/unsafe/Platform.java:26: sun.misc.Unsafe is internal proprietary API and may be removed in a future release
[WARNING] [Warn] /home/jenkins/workspace/spark-master-test-k8s/common/unsafe/src/main/java/org/apache/spark/unsafe/Platform.java:30: sun.misc.Unsafe is internal proprietary API and may be removed in a future release
[WARNING] [Warn] /home/jenkins/workspace/spark-master-test-k8s/common/unsafe/src/main/java/org/apache/spark/unsafe/Platform.java:274: sun.misc.Unsafe is internal proprietary API and may be removed in a future release
[WARNING] [Warn] /home/jenkins/workspace/spark-master-test-k8s/common/unsafe/src/main/java/org/apache/spark/unsafe/Platform.java:276: sun.misc.Unsafe is internal proprietary API and may be removed in a future release
[WARNING] [Warn] /home/jenkins/workspace/spark-master-test-k8s/common/unsafe/src/main/java/org/apache/spark/unsafe/Platform.java:278: sun.misc.Unsafe is internal proprietary API and may be removed in a future release
[INFO] Done compiling.
[INFO] compile in 0.3 s
[INFO] 
[INFO] --- maven-antrun-plugin:1.8:run (create-tmp-dir) @ spark-unsafe_2.12 ---
[INFO] Executing tasks

main:
[INFO] Executed tasks
[INFO] 
[INFO] --- maven-resources-plugin:2.7:testResources (default-testResources) @ spark-unsafe_2.12 ---
[INFO] Using 'UTF-8' encoding to copy filtered resources.
[INFO] skip non existing resourceDirectory /home/jenkins/workspace/spark-master-test-k8s/common/unsafe/src/test/resources
[INFO] Copying 3 resources
[INFO] 
[INFO] --- maven-compiler-plugin:3.8.1:testCompile (default-testCompile) @ spark-unsafe_2.12 ---
[INFO] Not compiling test sources
[INFO] 
[INFO] --- maven-dependency-plugin:3.1.1:build-classpath (generate-test-classpath) @ spark-unsafe_2.12 ---
[INFO] Dependencies classpath:
/home/jenkins/.m2/repository/org/scala-lang/scala-reflect/2.12.10/scala-reflect-2.12.10.jar:/home/jenkins/.m2/repository/org/scalatestplus/scalatestplus-mockito_2.12/1.0.0-SNAP5/scalatestplus-mockito_2.12-1.0.0-SNAP5.jar:/home/jenkins/.m2/repository/com/novocode/junit-interface/0.11/junit-interface-0.11.jar:/home/jenkins/.m2/repository/org/apache/xbean/xbean-asm7-shaded/4.15/xbean-asm7-shaded-4.15.jar:/home/jenkins/.m2/repository/net/bytebuddy/byte-buddy-agent/1.9.10/byte-buddy-agent-1.9.10.jar:/home/jenkins/.m2/repository/org/scalatest/scalatest-diagrams_2.12/3.2.0/scalatest-diagrams_2.12-3.2.0.jar:/home/jenkins/.m2/repository/org/seleniumhq/selenium/selenium-chrome-driver/3.141.59/selenium-chrome-driver-3.141.59.jar:/home/jenkins/.m2/repository/com/google/code/findbugs/jsr305/3.0.0/jsr305-3.0.0.jar:/home/jenkins/.m2/repository/org/objenesis/objenesis/2.6/objenesis-2.6.jar:/home/jenkins/.m2/repository/org/seleniumhq/selenium/selenium-opera-driver/3.141.59/selenium-opera-driver-3.141.59.jar:/home/jenkins/.m2/repository/org/apache/commons/commons-text/1.6/commons-text-1.6.jar:/home/jenkins/.m2/repository/org/scalatest/scalatest-freespec_2.12/3.2.0/scalatest-freespec_2.12-3.2.0.jar:/home/jenkins/.m2/repository/org/scalatest/scalatest-refspec_2.12/3.2.0/scalatest-refspec_2.12-3.2.0.jar:/home/jenkins/.m2/repository/org/scalatest/scalatest-wordspec_2.12/3.2.0/scalatest-wordspec_2.12-3.2.0.jar:/home/jenkins/.m2/repository/org/scalatestplus/scalatestplus-selenium_2.12/1.0.0-SNAP5/scalatestplus-selenium_2.12-1.0.0-SNAP5.jar:/home/jenkins/.m2/repository/org/scala-sbt/test-interface/1.0/test-interface-1.0.jar:/home/jenkins/.m2/repository/com/squareup/okio/okio/1.14.0/okio-1.14.0.jar:/home/jenkins/.m2/repository/org/hamcrest/hamcrest-core/1.3/hamcrest-core-1.3.jar:/home/jenkins/.m2/repository/org/seleniumhq/selenium/selenium-support/3.141.59/selenium-support-3.141.59.jar:/home/jenkins/.m2/repository/org/scalatest/scalatest-mustmatchers_2.12/3.2.0/scalatest-mustmatchers_2.12-3.2.0.jar:/home/jenkins/.m2/repository/org/scala-lang/modules/scala-xml_2.12/1.2.0/scala-xml_2.12-1.2.0.jar:/home/jenkins/.m2/repository/org/scala-lang/scala-library/2.12.10/scala-library-2.12.10.jar:/home/jenkins/.m2/repository/com/esotericsoftware/kryo-shaded/4.0.2/kryo-shaded-4.0.2.jar:/home/jenkins/.m2/repository/com/esotericsoftware/minlog/1.3.0/minlog-1.3.0.jar:/home/jenkins/.m2/repository/org/slf4j/slf4j-api/1.7.30/slf4j-api-1.7.30.jar:/home/jenkins/.m2/repository/com/squareup/okhttp3/okhttp/3.11.0/okhttp-3.11.0.jar:/home/jenkins/.m2/repository/org/seleniumhq/selenium/selenium-remote-driver/3.141.59/selenium-remote-driver-3.141.59.jar:/home/jenkins/.m2/repository/com/twitter/chill-java/0.9.5/chill-java-0.9.5.jar:/home/jenkins/.m2/repository/org/scalatest/scalatest_2.12/3.2.0/scalatest_2.12-3.2.0.jar:/home/jenkins/workspace/spark-master-test-k8s/common/tags/target/spark-tags_2.12-3.1.0-SNAPSHOT.jar:/home/jenkins/.m2/repository/org/seleniumhq/selenium/selenium-ie-driver/3.141.59/selenium-ie-driver-3.141.59.jar:/home/jenkins/.m2/repository/org/scalatestplus/scalatestplus-scalacheck_2.12/3.1.0.0-RC2/scalatestplus-scalacheck_2.12-3.1.0.0-RC2.jar:/home/jenkins/.m2/repository/org/scalatest/scalatest-matchers-core_2.12/3.2.0/scalatest-matchers-core_2.12-3.2.0.jar:/home/jenkins/.m2/repository/org/apache/commons/commons-lang3/3.10/commons-lang3-3.10.jar:/home/jenkins/.m2/repository/org/seleniumhq/selenium/selenium-api/3.141.59/selenium-api-3.141.59.jar:/home/jenkins/.m2/repository/org/seleniumhq/selenium/selenium-java/3.141.59/selenium-java-3.141.59.jar:/home/jenkins/.m2/repository/org/seleniumhq/selenium/selenium-edge-driver/3.141.59/selenium-edge-driver-3.141.59.jar:/home/jenkins/.m2/repository/org/apache/commons/commons-exec/1.3/commons-exec-1.3.jar:/home/jenkins/.m2/repository/org/scalacheck/scalacheck_2.12/1.14.2/scalacheck_2.12-1.14.2.jar:/home/jenkins/.m2/repository/org/scalatest/scalatest-flatspec_2.12/3.2.0/scalatest-flatspec_2.12-3.2.0.jar:/home/jenkins/.m2/repository/com/google/guava/guava/14.0.1/guava-14.0.1.jar:/home/jenkins/.m2/repository/org/scalatest/scalatest-funspec_2.12/3.2.0/scalatest-funspec_2.12-3.2.0.jar:/home/jenkins/.m2/repository/org/spark-project/spark/unused/1.0.0/unused-1.0.0.jar:/home/jenkins/.m2/repository/org/scalatest/scalatest-shouldmatchers_2.12/3.2.0/scalatest-shouldmatchers_2.12-3.2.0.jar:/home/jenkins/workspace/spark-master-test-k8s/common/tags/target/spark-tags_2.12-3.1.0-SNAPSHOT-tests.jar:/home/jenkins/.m2/repository/com/twitter/chill_2.12/0.9.5/chill_2.12-0.9.5.jar:/home/jenkins/.m2/repository/junit/junit/4.12/junit-4.12.jar:/home/jenkins/.m2/repository/org/seleniumhq/selenium/selenium-firefox-driver/3.141.59/selenium-firefox-driver-3.141.59.jar:/home/jenkins/.m2/repository/org/scalactic/scalactic_2.12/3.2.0/scalactic_2.12-3.2.0.jar:/home/jenkins/.m2/repository/org/scalatest/scalatest-propspec_2.12/3.2.0/scalatest-propspec_2.12-3.2.0.jar:/home/jenkins/.m2/repository/org/mockito/mockito-core/3.1.0/mockito-core-3.1.0.jar:/home/jenkins/.m2/repository/net/bytebuddy/byte-buddy/1.9.10/byte-buddy-1.9.10.jar:/home/jenkins/.m2/repository/org/scalatest/scalatest-compatible/3.2.0/scalatest-compatible-3.2.0.jar:/home/jenkins/.m2/repository/org/seleniumhq/selenium/selenium-safari-driver/3.141.59/selenium-safari-driver-3.141.59.jar:/home/jenkins/.m2/repository/org/scalatest/scalatest-funsuite_2.12/3.2.0/scalatest-funsuite_2.12-3.2.0.jar:/home/jenkins/.m2/repository/org/scalatest/scalatest-core_2.12/3.2.0/scalatest-core_2.12-3.2.0.jar:/home/jenkins/.m2/repository/org/scalatest/scalatest-featurespec_2.12/3.2.0/scalatest-featurespec_2.12-3.2.0.jar
[INFO] 
[INFO] --- scala-maven-plugin:4.3.0:testCompile (scala-test-compile-first) @ spark-unsafe_2.12 ---
[INFO] Using incremental compilation using Mixed compile order
[INFO] Compiler bridge file: /home/jenkins/.sbt/1.0/zinc/org.scala-sbt/org.scala-sbt-compiler-bridge_2.12-1.3.1-bin_2.12.10__52.0-1.3.1_20191012T045515.jar
[INFO] Compiling 1 Scala source and 5 Java sources to /home/jenkins/workspace/spark-master-test-k8s/common/unsafe/target/scala-2.12/test-classes ...
[INFO] Done compiling.
[INFO] compile in 7.5 s
[INFO] 
[INFO] --- maven-surefire-plugin:3.0.0-M3:test (default-test) @ spark-unsafe_2.12 ---
[INFO] 
[INFO] -------------------------------------------------------
[INFO]  T E S T S
[INFO] -------------------------------------------------------
[WARNING] Couldn't load group class 'k8s' in Surefire|Failsafe plugin. The group class is ignored!
[INFO] 
[INFO] Results:
[INFO] 
[INFO] Tests run: 0, Failures: 0, Errors: 0, Skipped: 0
[INFO] 
[INFO] 
[INFO] --- maven-surefire-plugin:3.0.0-M3:test (test) @ spark-unsafe_2.12 ---
[INFO] Skipping execution of surefire because it has already been run for this configuration
[INFO] 
[INFO] --- scalatest-maven-plugin:2.0.0:test (test) @ spark-unsafe_2.12 ---
Discovery starting.
Discovery completed in 334 milliseconds.
Run starting. Expected test count is: 0
UTF8StringPropertyCheckSuite:
Run completed in 396 milliseconds.
Total number of tests run: 0
Suites: completed 2, aborted 0
Tests: succeeded 0, failed 0, canceled 0, ignored 0, pending 0
No tests were executed.
[INFO] 
[INFO] --- maven-jar-plugin:3.1.2:test-jar (prepare-test-jar) @ spark-unsafe_2.12 ---
[INFO] Building jar: /home/jenkins/workspace/spark-master-test-k8s/common/unsafe/target/spark-unsafe_2.12-3.1.0-SNAPSHOT-tests.jar
[INFO] 
[INFO] --- maven-jar-plugin:3.1.2:jar (default-jar) @ spark-unsafe_2.12 ---
[INFO] Building jar: /home/jenkins/workspace/spark-master-test-k8s/common/unsafe/target/spark-unsafe_2.12-3.1.0-SNAPSHOT.jar
[INFO] 
[INFO] --- maven-site-plugin:3.5.1:attach-descriptor (attach-descriptor) @ spark-unsafe_2.12 ---
[INFO] 
[INFO] --- maven-shade-plugin:3.2.1:shade (default) @ spark-unsafe_2.12 ---
[INFO] Excluding org.apache.spark:spark-tags_2.12:jar:3.1.0-SNAPSHOT from the shaded jar.
[INFO] Excluding org.scala-lang:scala-library:jar:2.12.10 from the shaded jar.
[INFO] Excluding com.twitter:chill_2.12:jar:0.9.5 from the shaded jar.
[INFO] Excluding com.twitter:chill-java:jar:0.9.5 from the shaded jar.
[INFO] Excluding com.esotericsoftware:kryo-shaded:jar:4.0.2 from the shaded jar.
[INFO] Excluding com.esotericsoftware:minlog:jar:1.3.0 from the shaded jar.
[INFO] Excluding org.apache.xbean:xbean-asm7-shaded:jar:4.15 from the shaded jar.
[INFO] Excluding com.google.code.findbugs:jsr305:jar:3.0.0 from the shaded jar.
[INFO] Excluding org.objenesis:objenesis:jar:2.6 from the shaded jar.
[INFO] Including org.spark-project.spark:unused:jar:1.0.0 in the shaded jar.
[INFO] Replacing original artifact with shaded artifact.
[INFO] Replacing /home/jenkins/workspace/spark-master-test-k8s/common/unsafe/target/spark-unsafe_2.12-3.1.0-SNAPSHOT.jar with /home/jenkins/workspace/spark-master-test-k8s/common/unsafe/target/spark-unsafe_2.12-3.1.0-SNAPSHOT-shaded.jar
[INFO] Dependency-reduced POM written at: /home/jenkins/workspace/spark-master-test-k8s/common/unsafe/dependency-reduced-pom.xml
[INFO] 
[INFO] --- maven-source-plugin:3.1.0:jar-no-fork (create-source-jar) @ spark-unsafe_2.12 ---
[INFO] Building jar: /home/jenkins/workspace/spark-master-test-k8s/common/unsafe/target/spark-unsafe_2.12-3.1.0-SNAPSHOT-sources.jar
[INFO] 
[INFO] --- maven-source-plugin:3.1.0:test-jar-no-fork (create-source-jar) @ spark-unsafe_2.12 ---
[INFO] Building jar: /home/jenkins/workspace/spark-master-test-k8s/common/unsafe/target/spark-unsafe_2.12-3.1.0-SNAPSHOT-test-sources.jar
[INFO] 
[INFO] ----------------< org.apache.spark:spark-launcher_2.12 >----------------
[INFO] Building Spark Project Launcher 3.1.0-SNAPSHOT                     [7/9]
[INFO] --------------------------------[ jar ]---------------------------------
[INFO] 
[INFO] --- maven-enforcer-plugin:3.0.0-M2:enforce (enforce-versions) @ spark-launcher_2.12 ---
[INFO] 
[INFO] --- maven-enforcer-plugin:3.0.0-M2:enforce (enforce-no-duplicate-dependencies) @ spark-launcher_2.12 ---
[INFO] 
[INFO] --- mvn-scalafmt_2.12:1.0.3:format (default) @ spark-launcher_2.12 ---
[WARNING] format.skipSources set, ignoring main directories
[WARNING] format.skipTestSources set, ignoring validateOnly directories
[WARNING] No sources specified, skipping formatting
[INFO] 
[INFO] --- scala-maven-plugin:4.3.0:add-source (eclipse-add-source) @ spark-launcher_2.12 ---
[INFO] Add Source directory: /home/jenkins/workspace/spark-master-test-k8s/launcher/src/main/scala
[INFO] Add Test Source directory: /home/jenkins/workspace/spark-master-test-k8s/launcher/src/test/scala
[INFO] 
[INFO] --- maven-dependency-plugin:3.1.1:build-classpath (default-cli) @ spark-launcher_2.12 ---
[INFO] Dependencies classpath:
/home/jenkins/.m2/repository/com/google/protobuf/protobuf-java/2.5.0/protobuf-java-2.5.0.jar:/home/jenkins/workspace/spark-master-test-k8s/common/tags/target/spark-tags_2.12-3.1.0-SNAPSHOT.jar:/home/jenkins/.m2/repository/org/apache/curator/curator-framework/2.7.1/curator-framework-2.7.1.jar:/home/jenkins/.m2/repository/org/apache/curator/curator-recipes/2.7.1/curator-recipes-2.7.1.jar:/home/jenkins/.m2/repository/javax/xml/bind/jaxb-api/2.2.2/jaxb-api-2.2.2.jar:/home/jenkins/.m2/repository/com/thoughtworks/paranamer/paranamer/2.8/paranamer-2.8.jar:/home/jenkins/.m2/repository/commons-lang/commons-lang/2.6/commons-lang-2.6.jar:/home/jenkins/.m2/repository/org/apache/commons/commons-compress/1.4.1/commons-compress-1.4.1.jar:/home/jenkins/.m2/repository/org/apache/curator/curator-client/2.7.1/curator-client-2.7.1.jar:/home/jenkins/.m2/repository/org/apache/zookeeper/zookeeper/3.4.14/zookeeper-3.4.14.jar:/home/jenkins/.m2/repository/javax/activation/activation/1.1.1/activation-1.1.1.jar:/home/jenkins/.m2/repository/commons-cli/commons-cli/1.2/commons-cli-1.2.jar:/home/jenkins/.m2/repository/commons-codec/commons-codec/1.10/commons-codec-1.10.jar:/home/jenkins/.m2/repository/org/tukaani/xz/1.5/xz-1.5.jar:/home/jenkins/.m2/repository/org/mortbay/jetty/jetty-util/6.1.26/jetty-util-6.1.26.jar:/home/jenkins/.m2/repository/org/apache/yetus/audience-annotations/0.5.0/audience-annotations-0.5.0.jar:/home/jenkins/.m2/repository/org/apache/hadoop/hadoop-yarn-api/2.7.4/hadoop-yarn-api-2.7.4.jar:/home/jenkins/.m2/repository/org/spark-project/spark/unused/1.0.0/unused-1.0.0.jar:/home/jenkins/.m2/repository/commons-io/commons-io/2.4/commons-io-2.4.jar:/home/jenkins/.m2/repository/org/codehaus/jackson/jackson-jaxrs/1.9.13/jackson-jaxrs-1.9.13.jar:/home/jenkins/.m2/repository/javax/xml/stream/stax-api/1.0-2/stax-api-1.0-2.jar:/home/jenkins/.m2/repository/org/scala-lang/scala-library/2.12.10/scala-library-2.12.10.jar:/home/jenkins/.m2/repository/org/apache/hadoop/hadoop-yarn-client/2.7.4/hadoop-yarn-client-2.7.4.jar:/home/jenkins/.m2/repository/org/codehaus/jackson/jackson-xc/1.9.13/jackson-xc-1.9.13.jar:/home/jenkins/.m2/repository/org/codehaus/jackson/jackson-core-asl/1.9.13/jackson-core-asl-1.9.13.jar:/home/jenkins/.m2/repository/org/apache/hadoop/hadoop-yarn-common/2.7.4/hadoop-yarn-common-2.7.4.jar
[INFO] 
[INFO] --- maven-remote-resources-plugin:1.5:process (process-resource-bundles) @ spark-launcher_2.12 ---
[INFO] 
[INFO] --- maven-resources-plugin:2.7:resources (default-resources) @ spark-launcher_2.12 ---
[INFO] Using 'UTF-8' encoding to copy filtered resources.
[INFO] skip non existing resourceDirectory /home/jenkins/workspace/spark-master-test-k8s/launcher/src/main/resources
[INFO] Copying 3 resources
[INFO] 
[INFO] --- maven-compiler-plugin:3.8.1:compile (default-compile) @ spark-launcher_2.12 ---
[INFO] Not compiling main sources
[INFO] 
[INFO] --- scala-maven-plugin:4.3.0:compile (scala-compile-first) @ spark-launcher_2.12 ---
[INFO] Using incremental compilation using Mixed compile order
[INFO] Compiler bridge file: /home/jenkins/.sbt/1.0/zinc/org.scala-sbt/org.scala-sbt-compiler-bridge_2.12-1.3.1-bin_2.12.10__52.0-1.3.1_20191012T045515.jar
[INFO] Compiling 20 Java sources to /home/jenkins/workspace/spark-master-test-k8s/launcher/target/scala-2.12/classes ...
[INFO] Done compiling.
[INFO] compile in 0.4 s
[INFO] 
[INFO] --- maven-antrun-plugin:1.8:run (create-tmp-dir) @ spark-launcher_2.12 ---
[INFO] Executing tasks

main:
[INFO] Executed tasks
[INFO] 
[INFO] --- maven-resources-plugin:2.7:testResources (default-testResources) @ spark-launcher_2.12 ---
[INFO] Using 'UTF-8' encoding to copy filtered resources.
[INFO] Copying 2 resources
[INFO] Copying 3 resources
[INFO] 
[INFO] --- maven-compiler-plugin:3.8.1:testCompile (default-testCompile) @ spark-launcher_2.12 ---
[INFO] Not compiling test sources
[INFO] 
[INFO] --- maven-dependency-plugin:3.1.1:build-classpath (generate-test-classpath) @ spark-launcher_2.12 ---
[INFO] Dependencies classpath:
/home/jenkins/.m2/repository/org/scalatestplus/scalatestplus-mockito_2.12/1.0.0-SNAP5/scalatestplus-mockito_2.12-1.0.0-SNAP5.jar:/home/jenkins/.m2/repository/org/apache/hadoop/hadoop-mapreduce-client-common/2.7.4/hadoop-mapreduce-client-common-2.7.4.jar:/home/jenkins/.m2/repository/org/apache/htrace/htrace-core/3.1.0-incubating/htrace-core-3.1.0-incubating.jar:/home/jenkins/.m2/repository/org/slf4j/slf4j-log4j12/1.7.30/slf4j-log4j12-1.7.30.jar:/home/jenkins/.m2/repository/com/google/protobuf/protobuf-java/2.5.0/protobuf-java-2.5.0.jar:/home/jenkins/.m2/repository/org/apache/hadoop/hadoop-mapreduce-client-jobclient/2.7.4/hadoop-mapreduce-client-jobclient-2.7.4.jar:/home/jenkins/.m2/repository/net/bytebuddy/byte-buddy-agent/1.9.10/byte-buddy-agent-1.9.10.jar:/home/jenkins/.m2/repository/com/thoughtworks/paranamer/paranamer/2.8/paranamer-2.8.jar:/home/jenkins/.m2/repository/io/netty/netty-all/4.1.51.Final/netty-all-4.1.51.Final.jar:/home/jenkins/.m2/repository/org/apache/hadoop/hadoop-client/2.7.4/hadoop-client-2.7.4.jar:/home/jenkins/.m2/repository/com/google/code/findbugs/jsr305/3.0.0/jsr305-3.0.0.jar:/home/jenkins/.m2/repository/org/objenesis/objenesis/2.6/objenesis-2.6.jar:/home/jenkins/.m2/repository/xml-apis/xml-apis/1.4.01/xml-apis-1.4.01.jar:/home/jenkins/.m2/repository/org/tukaani/xz/1.5/xz-1.5.jar:/home/jenkins/.m2/repository/org/scalatest/scalatest-refspec_2.12/3.2.0/scalatest-refspec_2.12-3.2.0.jar:/home/jenkins/.m2/repository/org/apache/hadoop/hadoop-common/2.7.4/hadoop-common-2.7.4.jar:/home/jenkins/.m2/repository/commons-io/commons-io/2.4/commons-io-2.4.jar:/home/jenkins/.m2/repository/org/codehaus/jackson/jackson-jaxrs/1.9.13/jackson-jaxrs-1.9.13.jar:/home/jenkins/.m2/repository/org/scala-lang/scala-library/2.12.10/scala-library-2.12.10.jar:/home/jenkins/.m2/repository/org/apache/hadoop/hadoop-yarn-client/2.7.4/hadoop-yarn-client-2.7.4.jar:/home/jenkins/.m2/repository/org/codehaus/jackson/jackson-core-asl/1.9.13/jackson-core-asl-1.9.13.jar:/home/jenkins/.m2/repository/xerces/xercesImpl/2.12.0/xercesImpl-2.12.0.jar:/home/jenkins/.m2/repository/com/squareup/okhttp3/okhttp/3.11.0/okhttp-3.11.0.jar:/home/jenkins/.m2/repository/org/slf4j/jul-to-slf4j/1.7.30/jul-to-slf4j-1.7.30.jar:/home/jenkins/.m2/repository/commons-net/commons-net/3.1/commons-net-3.1.jar:/home/jenkins/.m2/repository/org/scalatest/scalatest_2.12/3.2.0/scalatest_2.12-3.2.0.jar:/home/jenkins/workspace/spark-master-test-k8s/common/tags/target/spark-tags_2.12-3.1.0-SNAPSHOT.jar:/home/jenkins/.m2/repository/org/seleniumhq/selenium/selenium-ie-driver/3.141.59/selenium-ie-driver-3.141.59.jar:/home/jenkins/.m2/repository/javax/xml/bind/jaxb-api/2.2.2/jaxb-api-2.2.2.jar:/home/jenkins/.m2/repository/org/xerial/snappy/snappy-java/1.1.7.5/snappy-java-1.1.7.5.jar:/home/jenkins/.m2/repository/org/scalatestplus/scalatestplus-scalacheck_2.12/3.1.0.0-RC2/scalatestplus-scalacheck_2.12-3.1.0.0-RC2.jar:/home/jenkins/.m2/repository/org/scalatest/scalatest-matchers-core_2.12/3.2.0/scalatest-matchers-core_2.12-3.2.0.jar:/home/jenkins/.m2/repository/commons-lang/commons-lang/2.6/commons-lang-2.6.jar:/home/jenkins/.m2/repository/org/mortbay/jetty/jetty-sslengine/6.1.26/jetty-sslengine-6.1.26.jar:/home/jenkins/.m2/repository/org/seleniumhq/selenium/selenium-edge-driver/3.141.59/selenium-edge-driver-3.141.59.jar:/home/jenkins/.m2/repository/org/apache/commons/commons-exec/1.3/commons-exec-1.3.jar:/home/jenkins/.m2/repository/org/apache/hadoop/hadoop-auth/2.7.4/hadoop-auth-2.7.4.jar:/home/jenkins/.m2/repository/javax/activation/activation/1.1.1/activation-1.1.1.jar:/home/jenkins/.m2/repository/org/apache/hadoop/hadoop-mapreduce-client-shuffle/2.7.4/hadoop-mapreduce-client-shuffle-2.7.4.jar:/home/jenkins/.m2/repository/org/scalatest/scalatest-flatspec_2.12/3.2.0/scalatest-flatspec_2.12-3.2.0.jar:/home/jenkins/.m2/repository/commons-codec/commons-codec/1.10/commons-codec-1.10.jar:/home/jenkins/.m2/repository/com/google/guava/guava/14.0.1/guava-14.0.1.jar:/home/jenkins/.m2/repository/org/apache/httpcomponents/httpcore/4.4.12/httpcore-4.4.12.jar:/home/jenkins/.m2/repository/commons-beanutils/commons-beanutils/1.9.4/commons-beanutils-1.9.4.jar:/home/jenkins/.m2/repository/org/scalatest/scalatest-funspec_2.12/3.2.0/scalatest-funspec_2.12-3.2.0.jar:/home/jenkins/.m2/repository/org/scalatest/scalatest-shouldmatchers_2.12/3.2.0/scalatest-shouldmatchers_2.12-3.2.0.jar:/home/jenkins/.m2/repository/org/apache/hadoop/hadoop-mapreduce-client-core/2.7.4/hadoop-mapreduce-client-core-2.7.4.jar:/home/jenkins/workspace/spark-master-test-k8s/common/tags/target/spark-tags_2.12-3.1.0-SNAPSHOT-tests.jar:/home/jenkins/.m2/repository/org/apache/commons/commons-math3/3.4.1/commons-math3-3.4.1.jar:/home/jenkins/.m2/repository/javax/xml/stream/stax-api/1.0-2/stax-api-1.0-2.jar:/home/jenkins/.m2/repository/org/codehaus/jackson/jackson-xc/1.9.13/jackson-xc-1.9.13.jar:/home/jenkins/.m2/repository/org/scalatest/scalatest-propspec_2.12/3.2.0/scalatest-propspec_2.12-3.2.0.jar:/home/jenkins/.m2/repository/org/mockito/mockito-core/3.1.0/mockito-core-3.1.0.jar:/home/jenkins/.m2/repository/net/bytebuddy/byte-buddy/1.9.10/byte-buddy-1.9.10.jar:/home/jenkins/.m2/repository/org/scalatest/scalatest-compatible/3.2.0/scalatest-compatible-3.2.0.jar:/home/jenkins/.m2/repository/org/scalatest/scalatest-funsuite_2.12/3.2.0/scalatest-funsuite_2.12-3.2.0.jar:/home/jenkins/.m2/repository/org/scalatest/scalatest-featurespec_2.12/3.2.0/scalatest-featurespec_2.12-3.2.0.jar:/home/jenkins/.m2/repository/org/scala-lang/scala-reflect/2.12.10/scala-reflect-2.12.10.jar:/home/jenkins/.m2/repository/log4j/log4j/1.2.17/log4j-1.2.17.jar:/home/jenkins/.m2/repository/com/novocode/junit-interface/0.11/junit-interface-0.11.jar:/home/jenkins/.m2/repository/org/apache/curator/curator-framework/2.7.1/curator-framework-2.7.1.jar:/home/jenkins/.m2/repository/org/apache/curator/curator-recipes/2.7.1/curator-recipes-2.7.1.jar:/home/jenkins/.m2/repository/org/scalatest/scalatest-diagrams_2.12/3.2.0/scalatest-diagrams_2.12-3.2.0.jar:/home/jenkins/.m2/repository/org/apache/avro/avro/1.8.2/avro-1.8.2.jar:/home/jenkins/.m2/repository/org/apache/commons/commons-compress/1.4.1/commons-compress-1.4.1.jar:/home/jenkins/.m2/repository/org/apache/directory/server/apacheds-kerberos-codec/2.0.0-M15/apacheds-kerberos-codec-2.0.0-M15.jar:/home/jenkins/.m2/repository/org/apache/zookeeper/zookeeper/3.4.14/zookeeper-3.4.14.jar:/home/jenkins/.m2/repository/org/seleniumhq/selenium/selenium-chrome-driver/3.141.59/selenium-chrome-driver-3.141.59.jar:/home/jenkins/.m2/repository/org/seleniumhq/selenium/selenium-opera-driver/3.141.59/selenium-opera-driver-3.141.59.jar:/home/jenkins/.m2/repository/org/scalatest/scalatest-freespec_2.12/3.2.0/scalatest-freespec_2.12-3.2.0.jar:/home/jenkins/.m2/repository/org/mortbay/jetty/jetty-util/6.1.26/jetty-util-6.1.26.jar:/home/jenkins/.m2/repository/org/apache/yetus/audience-annotations/0.5.0/audience-annotations-0.5.0.jar:/home/jenkins/.m2/repository/org/apache/hadoop/hadoop-yarn-api/2.7.4/hadoop-yarn-api-2.7.4.jar:/home/jenkins/.m2/repository/org/scalatest/scalatest-wordspec_2.12/3.2.0/scalatest-wordspec_2.12-3.2.0.jar:/home/jenkins/.m2/repository/org/scalatestplus/scalatestplus-selenium_2.12/1.0.0-SNAP5/scalatestplus-selenium_2.12-1.0.0-SNAP5.jar:/home/jenkins/.m2/repository/org/scala-sbt/test-interface/1.0/test-interface-1.0.jar:/home/jenkins/.m2/repository/com/squareup/okio/okio/1.14.0/okio-1.14.0.jar:/home/jenkins/.m2/repository/org/hamcrest/hamcrest-core/1.3/hamcrest-core-1.3.jar:/home/jenkins/.m2/repository/org/seleniumhq/selenium/selenium-support/3.141.59/selenium-support-3.141.59.jar:/home/jenkins/.m2/repository/javax/servlet/jsp/jsp-api/2.1/jsp-api-2.1.jar:/home/jenkins/.m2/repository/org/apache/hadoop/hadoop-yarn-server-common/2.7.4/hadoop-yarn-server-common-2.7.4.jar:/home/jenkins/.m2/repository/org/scalatest/scalatest-mustmatchers_2.12/3.2.0/scalatest-mustmatchers_2.12-3.2.0.jar:/home/jenkins/.m2/repository/org/scala-lang/modules/scala-xml_2.12/1.2.0/scala-xml_2.12-1.2.0.jar:/home/jenkins/.m2/repository/org/apache/hadoop/hadoop-mapreduce-client-app/2.7.4/hadoop-mapreduce-client-app-2.7.4.jar:/home/jenkins/.m2/repository/org/slf4j/slf4j-api/1.7.30/slf4j-api-1.7.30.jar:/home/jenkins/.m2/repository/xmlenc/xmlenc/0.52/xmlenc-0.52.jar:/home/jenkins/.m2/repository/org/apache/directory/api/api-util/1.0.0-M20/api-util-1.0.0-M20.jar:/home/jenkins/.m2/repository/org/apache/hadoop/hadoop-yarn-common/2.7.4/hadoop-yarn-common-2.7.4.jar:/home/jenkins/.m2/repository/com/google/code/gson/gson/2.2.4/gson-2.2.4.jar:/home/jenkins/.m2/repository/org/apache/directory/api/api-asn1-api/1.0.0-M20/api-asn1-api-1.0.0-M20.jar:/home/jenkins/.m2/repository/org/apache/hadoop/hadoop-annotations/2.7.4/hadoop-annotations-2.7.4.jar:/home/jenkins/.m2/repository/org/seleniumhq/selenium/selenium-remote-driver/3.141.59/selenium-remote-driver-3.141.59.jar:/home/jenkins/.m2/repository/commons-configuration/commons-configuration/1.6/commons-configuration-1.6.jar:/home/jenkins/.m2/repository/commons-digester/commons-digester/1.8/commons-digester-1.8.jar:/home/jenkins/.m2/repository/org/apache/directory/server/apacheds-i18n/2.0.0-M15/apacheds-i18n-2.0.0-M15.jar:/home/jenkins/.m2/repository/org/seleniumhq/selenium/selenium-api/3.141.59/selenium-api-3.141.59.jar:/home/jenkins/.m2/repository/org/apache/curator/curator-client/2.7.1/curator-client-2.7.1.jar:/home/jenkins/.m2/repository/org/apache/hadoop/hadoop-hdfs/2.7.4/hadoop-hdfs-2.7.4.jar:/home/jenkins/.m2/repository/org/seleniumhq/selenium/selenium-java/3.141.59/selenium-java-3.141.59.jar:/home/jenkins/.m2/repository/org/scalacheck/scalacheck_2.12/1.14.2/scalacheck_2.12-1.14.2.jar:/home/jenkins/.m2/repository/commons-cli/commons-cli/1.2/commons-cli-1.2.jar:/home/jenkins/.m2/repository/org/spark-project/spark/unused/1.0.0/unused-1.0.0.jar:/home/jenkins/.m2/repository/commons-collections/commons-collections/3.2.2/commons-collections-3.2.2.jar:/home/jenkins/.m2/repository/junit/junit/4.12/junit-4.12.jar:/home/jenkins/.m2/repository/org/seleniumhq/selenium/selenium-firefox-driver/3.141.59/selenium-firefox-driver-3.141.59.jar:/home/jenkins/.m2/repository/org/scalactic/scalactic_2.12/3.2.0/scalactic_2.12-3.2.0.jar:/home/jenkins/.m2/repository/org/apache/httpcomponents/httpclient/4.5.6/httpclient-4.5.6.jar:/home/jenkins/.m2/repository/org/seleniumhq/selenium/selenium-safari-driver/3.141.59/selenium-safari-driver-3.141.59.jar:/home/jenkins/.m2/repository/commons-httpclient/commons-httpclient/3.1/commons-httpclient-3.1.jar:/home/jenkins/.m2/repository/org/scalatest/scalatest-core_2.12/3.2.0/scalatest-core_2.12-3.2.0.jar
[INFO] 
[INFO] --- scala-maven-plugin:4.3.0:testCompile (scala-test-compile-first) @ spark-launcher_2.12 ---
[INFO] Using incremental compilation using Mixed compile order
[INFO] Compiler bridge file: /home/jenkins/.sbt/1.0/zinc/org.scala-sbt/org.scala-sbt-compiler-bridge_2.12-1.3.1-bin_2.12.10__52.0-1.3.1_20191012T045515.jar
[INFO] Compiling 7 Java sources to /home/jenkins/workspace/spark-master-test-k8s/launcher/target/scala-2.12/test-classes ...
[INFO] Done compiling.
[INFO] compile in 0.4 s
[INFO] 
[INFO] --- maven-surefire-plugin:3.0.0-M3:test (default-test) @ spark-launcher_2.12 ---
[INFO] 
[INFO] -------------------------------------------------------
[INFO]  T E S T S
[INFO] -------------------------------------------------------
[WARNING] Couldn't load group class 'k8s' in Surefire|Failsafe plugin. The group class is ignored!
[INFO] 
[INFO] Results:
[INFO] 
[INFO] Tests run: 0, Failures: 0, Errors: 0, Skipped: 0
[INFO] 
[INFO] 
[INFO] --- maven-surefire-plugin:3.0.0-M3:test (test) @ spark-launcher_2.12 ---
[INFO] Skipping execution of surefire because it has already been run for this configuration
[INFO] 
[INFO] --- scalatest-maven-plugin:2.0.0:test (test) @ spark-launcher_2.12 ---
Discovery starting.
Discovery completed in 108 milliseconds.
Run starting. Expected test count is: 0
DiscoverySuite:
Run completed in 158 milliseconds.
Total number of tests run: 0
Suites: completed 1, aborted 0
Tests: succeeded 0, failed 0, canceled 0, ignored 0, pending 0
No tests were executed.
[INFO] 
[INFO] --- maven-jar-plugin:3.1.2:test-jar (prepare-test-jar) @ spark-launcher_2.12 ---
[INFO] Building jar: /home/jenkins/workspace/spark-master-test-k8s/launcher/target/spark-launcher_2.12-3.1.0-SNAPSHOT-tests.jar
[INFO] 
[INFO] --- maven-jar-plugin:3.1.2:jar (default-jar) @ spark-launcher_2.12 ---
[INFO] Building jar: /home/jenkins/workspace/spark-master-test-k8s/launcher/target/spark-launcher_2.12-3.1.0-SNAPSHOT.jar
[INFO] 
[INFO] --- maven-site-plugin:3.5.1:attach-descriptor (attach-descriptor) @ spark-launcher_2.12 ---
[INFO] 
[INFO] --- maven-shade-plugin:3.2.1:shade (default) @ spark-launcher_2.12 ---
[INFO] Excluding org.apache.spark:spark-tags_2.12:jar:3.1.0-SNAPSHOT from the shaded jar.
[INFO] Excluding org.scala-lang:scala-library:jar:2.12.10 from the shaded jar.
[INFO] Excluding commons-cli:commons-cli:jar:1.2 from the shaded jar.
[INFO] Excluding commons-codec:commons-codec:jar:1.10 from the shaded jar.
[INFO] Excluding commons-io:commons-io:jar:2.4 from the shaded jar.
[INFO] Excluding commons-lang:commons-lang:jar:2.6 from the shaded jar.
[INFO] Excluding org.codehaus.jackson:jackson-core-asl:jar:1.9.13 from the shaded jar.
[INFO] Excluding com.thoughtworks.paranamer:paranamer:jar:2.8 from the shaded jar.
[INFO] Excluding org.tukaani:xz:jar:1.5 from the shaded jar.
[INFO] Excluding com.google.protobuf:protobuf-java:jar:2.5.0 from the shaded jar.
[INFO] Excluding org.apache.curator:curator-framework:jar:2.7.1 from the shaded jar.
[INFO] Excluding org.apache.curator:curator-client:jar:2.7.1 from the shaded jar.
[INFO] Excluding org.apache.curator:curator-recipes:jar:2.7.1 from the shaded jar.
[INFO] Excluding org.apache.zookeeper:zookeeper:jar:3.4.14 from the shaded jar.
[INFO] Excluding org.apache.yetus:audience-annotations:jar:0.5.0 from the shaded jar.
[INFO] Excluding org.apache.commons:commons-compress:jar:1.4.1 from the shaded jar.
[INFO] Excluding org.mortbay.jetty:jetty-util:jar:6.1.26 from the shaded jar.
[INFO] Excluding org.apache.hadoop:hadoop-yarn-client:jar:2.7.4 from the shaded jar.
[INFO] Excluding org.apache.hadoop:hadoop-yarn-api:jar:2.7.4 from the shaded jar.
[INFO] Excluding org.apache.hadoop:hadoop-yarn-common:jar:2.7.4 from the shaded jar.
[INFO] Excluding javax.xml.bind:jaxb-api:jar:2.2.2 from the shaded jar.
[INFO] Excluding javax.xml.stream:stax-api:jar:1.0-2 from the shaded jar.
[INFO] Excluding javax.activation:activation:jar:1.1.1 from the shaded jar.
[INFO] Excluding org.codehaus.jackson:jackson-jaxrs:jar:1.9.13 from the shaded jar.
[INFO] Excluding org.codehaus.jackson:jackson-xc:jar:1.9.13 from the shaded jar.
[INFO] Including org.spark-project.spark:unused:jar:1.0.0 in the shaded jar.
[INFO] Replacing original artifact with shaded artifact.
[INFO] Replacing /home/jenkins/workspace/spark-master-test-k8s/launcher/target/spark-launcher_2.12-3.1.0-SNAPSHOT.jar with /home/jenkins/workspace/spark-master-test-k8s/launcher/target/spark-launcher_2.12-3.1.0-SNAPSHOT-shaded.jar
[INFO] Dependency-reduced POM written at: /home/jenkins/workspace/spark-master-test-k8s/launcher/dependency-reduced-pom.xml
[INFO] 
[INFO] --- maven-source-plugin:3.1.0:jar-no-fork (create-source-jar) @ spark-launcher_2.12 ---
[INFO] Building jar: /home/jenkins/workspace/spark-master-test-k8s/launcher/target/spark-launcher_2.12-3.1.0-SNAPSHOT-sources.jar
[INFO] 
[INFO] --- maven-source-plugin:3.1.0:test-jar-no-fork (create-source-jar) @ spark-launcher_2.12 ---
[INFO] Building jar: /home/jenkins/workspace/spark-master-test-k8s/launcher/target/spark-launcher_2.12-3.1.0-SNAPSHOT-test-sources.jar
[INFO] 
[INFO] ------------------< org.apache.spark:spark-core_2.12 >------------------
[INFO] Building Spark Project Core 3.1.0-SNAPSHOT                         [8/9]
[INFO] --------------------------------[ jar ]---------------------------------
[INFO] 
[INFO] --- maven-enforcer-plugin:3.0.0-M2:enforce (enforce-versions) @ spark-core_2.12 ---
[INFO] 
[INFO] --- maven-enforcer-plugin:3.0.0-M2:enforce (enforce-no-duplicate-dependencies) @ spark-core_2.12 ---
[INFO] 
[INFO] --- mvn-scalafmt_2.12:1.0.3:format (default) @ spark-core_2.12 ---
[WARNING] format.skipSources set, ignoring main directories
[WARNING] format.skipTestSources set, ignoring validateOnly directories
[WARNING] No sources specified, skipping formatting
[INFO] 
[INFO] --- build-helper-maven-plugin:3.2.0:timestamp-property (module-timestamp-property) @ spark-core_2.12 ---
[WARNING] Using platform locale (en_US actually) to format date/time, i.e. build is platform dependent!
[INFO] 
[INFO] --- build-helper-maven-plugin:3.2.0:timestamp-property (local-timestamp-property) @ spark-core_2.12 ---
[WARNING] Using platform locale (en_US actually) to format date/time, i.e. build is platform dependent!
[INFO] 
[INFO] --- scala-maven-plugin:4.3.0:add-source (eclipse-add-source) @ spark-core_2.12 ---
[INFO] Add Source directory: /home/jenkins/workspace/spark-master-test-k8s/core/src/main/scala
[INFO] Add Test Source directory: /home/jenkins/workspace/spark-master-test-k8s/core/src/test/scala
[INFO] 
[INFO] --- maven-dependency-plugin:3.1.1:build-classpath (default-cli) @ spark-core_2.12 ---
[INFO] Dependencies classpath:
/home/jenkins/.m2/repository/net/sf/ehcache/ehcache-core/2.4.4/ehcache-core-2.4.4.jar:/home/jenkins/.m2/repository/org/eclipse/jetty/jetty-servlets/9.4.28.v20200408/jetty-servlets-9.4.28.v20200408.jar:/home/jenkins/.m2/repository/com/clearspring/analytics/stream/2.9.6/stream-2.9.6.jar:/home/jenkins/.m2/repository/org/apache/hadoop/hadoop-mapreduce-client-common/2.7.4/hadoop-mapreduce-client-common-2.7.4.jar:/home/jenkins/.m2/repository/org/glassfish/hk2/external/jakarta.inject/2.6.1/jakarta.inject-2.6.1.jar:/home/jenkins/.m2/repository/org/glassfish/hk2/hk2-locator/2.6.1/hk2-locator-2.6.1.jar:/home/jenkins/.m2/repository/org/apache/htrace/htrace-core/3.1.0-incubating/htrace-core-3.1.0-incubating.jar:/home/jenkins/.m2/repository/com/google/protobuf/protobuf-java/2.5.0/protobuf-java-2.5.0.jar:/home/jenkins/.m2/repository/org/apache/hadoop/hadoop-mapreduce-client-jobclient/2.7.4/hadoop-mapreduce-client-jobclient-2.7.4.jar:/home/jenkins/.m2/repository/org/slf4j/slf4j-log4j12/1.7.30/slf4j-log4j12-1.7.30.jar:/home/jenkins/.m2/repository/org/glassfish/hk2/hk2-utils/2.6.1/hk2-utils-2.6.1.jar:/home/jenkins/.m2/repository/org/apache/commons/commons-compress/1.8.1/commons-compress-1.8.1.jar:/home/jenkins/.m2/repository/com/thoughtworks/paranamer/paranamer/2.8/paranamer-2.8.jar:/home/jenkins/.m2/repository/io/netty/netty-all/4.1.51.Final/netty-all-4.1.51.Final.jar:/home/jenkins/.m2/repository/com/fasterxml/jackson/core/jackson-annotations/2.10.0/jackson-annotations-2.10.0.jar:/home/jenkins/.m2/repository/org/apache/hadoop/hadoop-client/2.7.4/hadoop-client-2.7.4.jar:/home/jenkins/.m2/repository/com/google/code/findbugs/jsr305/3.0.0/jsr305-3.0.0.jar:/home/jenkins/.m2/repository/org/objenesis/objenesis/2.6/objenesis-2.6.jar:/home/jenkins/.m2/repository/org/fusesource/leveldbjni/leveldbjni-all/1.8/leveldbjni-all-1.8.jar:/home/jenkins/.m2/repository/org/apache/commons/commons-text/1.6/commons-text-1.6.jar:/home/jenkins/.m2/repository/com/fasterxml/jackson/core/jackson-core/2.10.0/jackson-core-2.10.0.jar:/home/jenkins/.m2/repository/org/glassfish/jersey/media/jersey-media-jaxb/2.30/jersey-media-jaxb-2.30.jar:/home/jenkins/.m2/repository/com/fasterxml/jackson/module/jackson-module-scala_2.12/2.10.0/jackson-module-scala_2.12-2.10.0.jar:/home/jenkins/.m2/repository/jakarta/ws/rs/jakarta.ws.rs-api/2.1.6/jakarta.ws.rs-api-2.1.6.jar:/home/jenkins/.m2/repository/org/tukaani/xz/1.5/xz-1.5.jar:/home/jenkins/.m2/repository/org/glassfish/hk2/external/aopalliance-repackaged/2.6.1/aopalliance-repackaged-2.6.1.jar:/home/jenkins/.m2/repository/org/json4s/json4s-core_2.12/3.7.0-M5/json4s-core_2.12-3.7.0-M5.jar:/home/jenkins/.m2/repository/org/apache/directory/api/api-ldap-model/1.0.0-M20/api-ldap-model-1.0.0-M20.jar:/home/jenkins/.m2/repository/org/eclipse/jetty/jetty-io/9.4.28.v20200408/jetty-io-9.4.28.v20200408.jar:/home/jenkins/.m2/repository/org/apache/commons/commons-crypto/1.0.0/commons-crypto-1.0.0.jar:/home/jenkins/.m2/repository/org/apache/hadoop/hadoop-common/2.7.4/hadoop-common-2.7.4.jar:/home/jenkins/.m2/repository/org/apache/directory/api/api-i18n/1.0.0-M20/api-i18n-1.0.0-M20.jar:/home/jenkins/.m2/repository/commons-io/commons-io/2.4/commons-io-2.4.jar:/home/jenkins/.m2/repository/org/codehaus/jackson/jackson-jaxrs/1.9.13/jackson-jaxrs-1.9.13.jar:/home/jenkins/.m2/repository/com/fasterxml/jackson/module/jackson-module-paranamer/2.10.0/jackson-module-paranamer-2.10.0.jar:/home/jenkins/.m2/repository/org/apache/hadoop/hadoop-yarn-client/2.7.4/hadoop-yarn-client-2.7.4.jar:/home/jenkins/.m2/repository/org/scala-lang/scala-library/2.12.10/scala-library-2.12.10.jar:/home/jenkins/.m2/repository/com/esotericsoftware/kryo-shaded/4.0.2/kryo-shaded-4.0.2.jar:/home/jenkins/.m2/repository/com/esotericsoftware/minlog/1.3.0/minlog-1.3.0.jar:/home/jenkins/workspace/spark-master-test-k8s/common/network-common/target/spark-network-common_2.12-3.1.0-SNAPSHOT.jar:/home/jenkins/.m2/repository/org/codehaus/jackson/jackson-core-asl/1.9.13/jackson-core-asl-1.9.13.jar:/home/jenkins/.m2/repository/xerces/xercesImpl/2.12.0/xercesImpl-2.12.0.jar:/home/jenkins/.m2/repository/net/sf/py4j/py4j/0.10.9/py4j-0.10.9.jar:/home/jenkins/.m2/repository/com/twitter/chill-java/0.9.5/chill-java-0.9.5.jar:/home/jenkins/workspace/spark-master-test-k8s/common/network-shuffle/target/spark-network-shuffle_2.12-3.1.0-SNAPSHOT.jar:/home/jenkins/.m2/repository/org/slf4j/jul-to-slf4j/1.7.30/jul-to-slf4j-1.7.30.jar:/home/jenkins/.m2/repository/org/json4s/json4s-scalap_2.12/3.7.0-M5/json4s-scalap_2.12-3.7.0-M5.jar:/home/jenkins/.m2/repository/org/eclipse/jetty/jetty-plus/9.4.28.v20200408/jetty-plus-9.4.28.v20200408.jar:/home/jenkins/.m2/repository/commons-net/commons-net/3.1/commons-net-3.1.jar:/home/jenkins/workspace/spark-master-test-k8s/common/tags/target/spark-tags_2.12-3.1.0-SNAPSHOT.jar:/home/jenkins/.m2/repository/org/lz4/lz4-java/1.7.1/lz4-java-1.7.1.jar:/home/jenkins/.m2/repository/javax/xml/bind/jaxb-api/2.2.2/jaxb-api-2.2.2.jar:/home/jenkins/.m2/repository/org/xerial/snappy/snappy-java/1.1.7.5/snappy-java-1.1.7.5.jar:/home/jenkins/.m2/repository/org/json4s/json4s-jackson_2.12/3.7.0-M5/json4s-jackson_2.12-3.7.0-M5.jar:/home/jenkins/.m2/repository/com/github/luben/zstd-jni/1.4.5-4/zstd-jni-1.4.5-4.jar:/home/jenkins/.m2/repository/commons-lang/commons-lang/2.6/commons-lang-2.6.jar:/home/jenkins/.m2/repository/org/eclipse/jetty/jetty-jndi/9.4.28.v20200408/jetty-jndi-9.4.28.v20200408.jar:/home/jenkins/.m2/repository/org/mortbay/jetty/jetty-sslengine/6.1.26/jetty-sslengine-6.1.26.jar:/home/jenkins/.m2/repository/io/dropwizard/metrics/metrics-graphite/4.1.1/metrics-graphite-4.1.1.jar:/home/jenkins/.m2/repository/org/eclipse/jetty/jetty-servlet/9.4.28.v20200408/jetty-servlet-9.4.28.v20200408.jar:/home/jenkins/.m2/repository/org/apache/hadoop/hadoop-auth/2.7.4/hadoop-auth-2.7.4.jar:/home/jenkins/.m2/repository/javax/activation/activation/1.1.1/activation-1.1.1.jar:/home/jenkins/.m2/repository/org/apache/hadoop/hadoop-mapreduce-client-shuffle/2.7.4/hadoop-mapreduce-client-shuffle-2.7.4.jar:/home/jenkins/.m2/repository/commons-codec/commons-codec/1.10/commons-codec-1.10.jar:/home/jenkins/.m2/repository/commons-beanutils/commons-beanutils/1.9.4/commons-beanutils-1.9.4.jar:/home/jenkins/.m2/repository/org/apache/ivy/ivy/2.4.0/ivy-2.4.0.jar:/home/jenkins/.m2/repository/org/apache/hadoop/hadoop-mapreduce-client-core/2.7.4/hadoop-mapreduce-client-core-2.7.4.jar:/home/jenkins/workspace/spark-master-test-k8s/common/kvstore/target/spark-kvstore_2.12-3.1.0-SNAPSHOT.jar:/home/jenkins/.m2/repository/javax/servlet/javax.servlet-api/3.1.0/javax.servlet-api-3.1.0.jar:/home/jenkins/.m2/repository/com/twitter/chill_2.12/0.9.5/chill_2.12-0.9.5.jar:/home/jenkins/.m2/repository/org/apache/commons/commons-math3/3.4.1/commons-math3-3.4.1.jar:/home/jenkins/.m2/repository/net/razorvine/pyrolite/4.30/pyrolite-4.30.jar:/home/jenkins/.m2/repository/javax/xml/stream/stax-api/1.0-2/stax-api-1.0-2.jar:/home/jenkins/.m2/repository/jakarta/validation/jakarta.validation-api/2.0.2/jakarta.validation-api-2.0.2.jar:/home/jenkins/.m2/repository/org/codehaus/jackson/jackson-xc/1.9.13/jackson-xc-1.9.13.jar:/home/jenkins/.m2/repository/org/glassfish/jersey/inject/jersey-hk2/2.30/jersey-hk2-2.30.jar:/home/jenkins/.m2/repository/org/json4s/json4s-ast_2.12/3.7.0-M5/json4s-ast_2.12-3.7.0-M5.jar:/home/jenkins/.m2/repository/org/eclipse/jetty/jetty-http/9.4.28.v20200408/jetty-http-9.4.28.v20200408.jar:/home/jenkins/.m2/repository/org/glassfish/jersey/core/jersey-common/2.30/jersey-common-2.30.jar:/home/jenkins/.m2/repository/oro/oro/2.0.8/oro-2.0.8.jar:/home/jenkins/.m2/repository/org/apache/avro/avro-mapred/1.8.2/avro-mapred-1.8.2-hadoop2.jar:/home/jenkins/.m2/repository/org/scala-lang/scala-reflect/2.12.10/scala-reflect-2.12.10.jar:/home/jenkins/.m2/repository/log4j/log4j/1.2.17/log4j-1.2.17.jar:/home/jenkins/.m2/repository/org/apache/xbean/xbean-asm7-shaded/4.15/xbean-asm7-shaded-4.15.jar:/home/jenkins/.m2/repository/org/apache/curator/curator-framework/2.7.1/curator-framework-2.7.1.jar:/home/jenkins/.m2/repository/org/apache/curator/curator-recipes/2.7.1/curator-recipes-2.7.1.jar:/home/jenkins/.m2/repository/io/dropwizard/metrics/metrics-core/4.1.1/metrics-core-4.1.1.jar:/home/jenkins/.m2/repository/org/eclipse/jetty/jetty-proxy/9.4.28.v20200408/jetty-proxy-9.4.28.v20200408.jar:/home/jenkins/.m2/repository/org/apache/directory/api/api-asn1-ber/1.0.0-M20/api-asn1-ber-1.0.0-M20.jar:/home/jenkins/.m2/repository/org/apache/avro/avro/1.8.2/avro-1.8.2.jar:/home/jenkins/.m2/repository/io/dropwizard/metrics/metrics-json/4.1.1/metrics-json-4.1.1.jar:/home/jenkins/.m2/repository/org/apache/directory/server/apacheds-kerberos-codec/2.0.0-M15/apacheds-kerberos-codec-2.0.0-M15.jar:/home/jenkins/.m2/repository/org/glassfish/hk2/hk2-api/2.6.1/hk2-api-2.6.1.jar:/home/jenkins/.m2/repository/org/apache/zookeeper/zookeeper/3.4.14/zookeeper-3.4.14.jar:/home/jenkins/.m2/repository/org/roaringbitmap/shims/0.9.0/shims-0.9.0.jar:/home/jenkins/.m2/repository/antlr/antlr/2.7.7/antlr-2.7.7.jar:/home/jenkins/.m2/repository/jakarta/annotation/jakarta.annotation-api/1.3.5/jakarta.annotation-api-1.3.5.jar:/home/jenkins/.m2/repository/org/glassfish/hk2/osgi-resource-locator/1.0.3/osgi-resource-locator-1.0.3.jar:/home/jenkins/.m2/repository/org/mortbay/jetty/jetty-util/6.1.26/jetty-util-6.1.26.jar:/home/jenkins/.m2/repository/org/apache/hadoop/hadoop-yarn-api/2.7.4/hadoop-yarn-api-2.7.4.jar:/home/jenkins/.m2/repository/org/apache/yetus/audience-annotations/0.5.0/audience-annotations-0.5.0.jar:/home/jenkins/.m2/repository/io/dropwizard/metrics/metrics-jvm/4.1.1/metrics-jvm-4.1.1.jar:/home/jenkins/.m2/repository/org/codehaus/jackson/jackson-mapper-asl/1.9.13/jackson-mapper-asl-1.9.13.jar:/home/jenkins/.m2/repository/javax/servlet/jsp/jsp-api/2.1/jsp-api-2.1.jar:/home/jenkins/.m2/repository/org/apache/hadoop/hadoop-yarn-server-common/2.7.4/hadoop-yarn-server-common-2.7.4.jar:/home/jenkins/.m2/repository/org/scala-lang/modules/scala-xml_2.12/1.2.0/scala-xml_2.12-1.2.0.jar:/home/jenkins/.m2/repository/org/apache/hadoop/hadoop-mapreduce-client-app/2.7.4/hadoop-mapreduce-client-app-2.7.4.jar:/home/jenkins/.m2/repository/org/apache/avro/avro-ipc/1.8.2/avro-ipc-1.8.2.jar:/home/jenkins/.m2/repository/xmlenc/xmlenc/0.52/xmlenc-0.52.jar:/home/jenkins/.m2/repository/org/slf4j/slf4j-api/1.7.30/slf4j-api-1.7.30.jar:/home/jenkins/.m2/repository/com/ning/compress-lzf/1.0.3/compress-lzf-1.0.3.jar:/home/jenkins/.m2/repository/org/glassfish/jersey/containers/jersey-container-servlet/2.30/jersey-container-servlet-2.30.jar:/home/jenkins/.m2/repository/com/fasterxml/jackson/core/jackson-databind/2.10.0/jackson-databind-2.10.0.jar:/home/jenkins/.m2/repository/org/apache/directory/api/api-util/1.0.0-M20/api-util-1.0.0-M20.jar:/home/jenkins/.m2/repository/org/apache/hadoop/hadoop-yarn-common/2.7.4/hadoop-yarn-common-2.7.4.jar:/home/jenkins/.m2/repository/org/eclipse/jetty/jetty-security/9.4.28.v20200408/jetty-security-9.4.28.v20200408.jar:/home/jenkins/.m2/repository/com/google/code/gson/gson/2.2.4/gson-2.2.4.jar:/home/jenkins/.m2/repository/org/apache/hadoop/hadoop-annotations/2.7.4/hadoop-annotations-2.7.4.jar:/home/jenkins/.m2/repository/org/apache/directory/api/api-asn1-api/1.0.0-M20/api-asn1-api-1.0.0-M20.jar:/home/jenkins/.m2/repository/org/eclipse/jetty/jetty-util/9.4.28.v20200408/jetty-util-9.4.28.v20200408.jar:/home/jenkins/.m2/repository/org/javassist/javassist/3.25.0-GA/javassist-3.25.0-GA.jar:/home/jenkins/.m2/repository/org/glassfish/jersey/containers/jersey-container-servlet-core/2.30/jersey-container-servlet-core-2.30.jar:/home/jenkins/.m2/repository/commons-configuration/commons-configuration/1.6/commons-configuration-1.6.jar:/home/jenkins/.m2/repository/commons-digester/commons-digester/1.8/commons-digester-1.8.jar:/home/jenkins/.m2/repository/org/apache/directory/server/apacheds-i18n/2.0.0-M15/apacheds-i18n-2.0.0-M15.jar:/home/jenkins/.m2/repository/org/apache/commons/commons-lang3/3.10/commons-lang3-3.10.jar:/home/jenkins/.m2/repository/org/apache/curator/curator-client/2.7.1/curator-client-2.7.1.jar:/home/jenkins/.m2/repository/org/apache/hadoop/hadoop-hdfs/2.7.4/hadoop-hdfs-2.7.4.jar:/home/jenkins/.m2/repository/org/eclipse/jetty/jetty-client/9.4.28.v20200408/jetty-client-9.4.28.v20200408.jar:/home/jenkins/.m2/repository/org/roaringbitmap/RoaringBitmap/0.9.0/RoaringBitmap-0.9.0.jar:/home/jenkins/.m2/repository/commons-cli/commons-cli/1.2/commons-cli-1.2.jar:/home/jenkins/workspace/spark-master-test-k8s/common/unsafe/target/spark-unsafe_2.12-3.1.0-SNAPSHOT.jar:/home/jenkins/.m2/repository/org/slf4j/jcl-over-slf4j/1.7.30/jcl-over-slf4j-1.7.30.jar:/home/jenkins/.m2/repository/org/spark-project/spark/unused/1.0.0/unused-1.0.0.jar:/home/jenkins/.m2/repository/org/eclipse/jetty/jetty-server/9.4.28.v20200408/jetty-server-9.4.28.v20200408.jar:/home/jenkins/.m2/repository/org/glassfish/jersey/core/jersey-server/2.30/jersey-server-2.30.jar:/home/jenkins/.m2/repository/io/dropwizard/metrics/metrics-jmx/4.1.1/metrics-jmx-4.1.1.jar:/home/jenkins/.m2/repository/org/glassfish/jersey/core/jersey-client/2.30/jersey-client-2.30.jar:/home/jenkins/.m2/repository/commons-collections/commons-collections/3.2.2/commons-collections-3.2.2.jar:/home/jenkins/workspace/spark-master-test-k8s/launcher/target/spark-launcher_2.12-3.1.0-SNAPSHOT.jar:/home/jenkins/.m2/repository/org/apache/mina/mina-core/2.0.7/mina-core-2.0.7.jar:/home/jenkins/.m2/repository/org/eclipse/jetty/jetty-continuation/9.4.28.v20200408/jetty-continuation-9.4.28.v20200408.jar:/home/jenkins/.m2/repository/commons-httpclient/commons-httpclient/3.1/commons-httpclient-3.1.jar
[INFO] 
[INFO] --- build-helper-maven-plugin:3.2.0:add-source (add-sources) @ spark-core_2.12 ---
[INFO] Source directory: /home/jenkins/workspace/spark-master-test-k8s/core/src/main/scala-2.12 added.
[INFO] 
[INFO] --- maven-remote-resources-plugin:1.5:process (process-resource-bundles) @ spark-core_2.12 ---
[INFO] 
[INFO] --- maven-antrun-plugin:1.8:run (default) @ spark-core_2.12 ---
[INFO] Executing tasks

main:
[INFO] Executed tasks
[INFO] 
[INFO] --- maven-resources-plugin:2.7:resources (default-resources) @ spark-core_2.12 ---
[INFO] Using 'UTF-8' encoding to copy filtered resources.
[INFO] Copying 51 resources
[INFO] Copying 1 resource
[INFO] Copying 3 resources
[INFO] 
[INFO] --- maven-compiler-plugin:3.8.1:compile (default-compile) @ spark-core_2.12 ---
[INFO] Not compiling main sources
[INFO] 
[INFO] --- scala-maven-plugin:4.3.0:compile (scala-compile-first) @ spark-core_2.12 ---
[INFO] Using incremental compilation using Mixed compile order
[INFO] Compiler bridge file: /home/jenkins/.sbt/1.0/zinc/org.scala-sbt/org.scala-sbt-compiler-bridge_2.12-1.3.1-bin_2.12.10__52.0-1.3.1_20191012T045515.jar
[INFO] Compiling 556 Scala sources and 99 Java sources to /home/jenkins/workspace/spark-master-test-k8s/core/target/scala-2.12/classes ...
[INFO] Done compiling.
[INFO] compile in 51.4 s
[INFO] 
[INFO] --- maven-antrun-plugin:1.8:run (create-tmp-dir) @ spark-core_2.12 ---
[INFO] Executing tasks

main:
[INFO] Executed tasks
[INFO] 
[INFO] --- maven-resources-plugin:2.7:testResources (default-testResources) @ spark-core_2.12 ---
[INFO] Using 'UTF-8' encoding to copy filtered resources.
[INFO] Copying 84 resources
[INFO] Copying 3 resources
[INFO] 
[INFO] --- maven-compiler-plugin:3.8.1:testCompile (default-testCompile) @ spark-core_2.12 ---
[INFO] Not compiling test sources
[INFO] 
[INFO] --- maven-dependency-plugin:3.1.1:build-classpath (generate-test-classpath) @ spark-core_2.12 ---
[INFO] Dependencies classpath:
/home/jenkins/.m2/repository/org/eclipse/jetty/jetty-servlets/9.4.28.v20200408/jetty-servlets-9.4.28.v20200408.jar:/home/jenkins/.m2/repository/org/apache/directory/server/apacheds-core/2.0.0-M15/apacheds-core-2.0.0-M15.jar:/home/jenkins/.m2/repository/org/glassfish/hk2/external/jakarta.inject/2.6.1/jakarta.inject-2.6.1.jar:/home/jenkins/.m2/repository/org/apache/htrace/htrace-core/3.1.0-incubating/htrace-core-3.1.0-incubating.jar:/home/jenkins/.m2/repository/com/google/protobuf/protobuf-java/2.5.0/protobuf-java-2.5.0.jar:/home/jenkins/.m2/repository/org/apache/hadoop/hadoop-mapreduce-client-jobclient/2.7.4/hadoop-mapreduce-client-jobclient-2.7.4.jar:/home/jenkins/.m2/repository/net/bytebuddy/byte-buddy-agent/1.9.10/byte-buddy-agent-1.9.10.jar:/home/jenkins/.m2/repository/org/apache/commons/commons-compress/1.8.1/commons-compress-1.8.1.jar:/home/jenkins/.m2/repository/jakarta/servlet/jakarta.servlet-api/4.0.3/jakarta.servlet-api-4.0.3.jar:/home/jenkins/.m2/repository/com/google/code/findbugs/jsr305/3.0.0/jsr305-3.0.0.jar:/home/jenkins/.m2/repository/org/glassfish/jersey/media/jersey-media-jaxb/2.30/jersey-media-jaxb-2.30.jar:/home/jenkins/.m2/repository/com/fasterxml/jackson/module/jackson-module-scala_2.12/2.10.0/jackson-module-scala_2.12-2.10.0.jar:/home/jenkins/.m2/repository/org/apache/commons/commons-math/2.2/commons-math-2.2.jar:/home/jenkins/.m2/repository/org/apache/httpcomponents/httpmime/4.5.6/httpmime-4.5.6.jar:/home/jenkins/.m2/repository/org/json4s/json4s-core_2.12/3.7.0-M5/json4s-core_2.12-3.7.0-M5.jar:/home/jenkins/.m2/repository/org/apache/directory/api/api-ldap-model/1.0.0-M20/api-ldap-model-1.0.0-M20.jar:/home/jenkins/.m2/repository/org/scalatest/scalatest-refspec_2.12/3.2.0/scalatest-refspec_2.12-3.2.0.jar:/home/jenkins/.m2/repository/org/eclipse/jetty/jetty-io/9.4.28.v20200408/jetty-io-9.4.28.v20200408.jar:/home/jenkins/.m2/repository/org/apache/commons/commons-crypto/1.0.0/commons-crypto-1.0.0.jar:/home/jenkins/.m2/repository/org/apache/directory/api/api-i18n/1.0.0-M20/api-i18n-1.0.0-M20.jar:/home/jenkins/.m2/repository/org/apache/directory/server/apacheds-interceptors-authn/2.0.0-M15/apacheds-interceptors-authn-2.0.0-M15.jar:/home/jenkins/.m2/repository/org/apache/directory/server/apacheds-jdbm-partition/2.0.0-M15/apacheds-jdbm-partition-2.0.0-M15.jar:/home/jenkins/.m2/repository/org/codehaus/jackson/jackson-jaxrs/1.9.13/jackson-jaxrs-1.9.13.jar:/home/jenkins/.m2/repository/org/scala-lang/scala-library/2.12.10/scala-library-2.12.10.jar:/home/jenkins/workspace/spark-master-test-k8s/common/network-common/target/spark-network-common_2.12-3.1.0-SNAPSHOT.jar:/home/jenkins/.m2/repository/bouncycastle/bcprov-jdk15/140/bcprov-jdk15-140.jar:/home/jenkins/.m2/repository/xerces/xercesImpl/2.12.0/xercesImpl-2.12.0.jar:/home/jenkins/.m2/repository/com/twitter/chill-java/0.9.5/chill-java-0.9.5.jar:/home/jenkins/.m2/repository/commons-net/commons-net/3.1/commons-net-3.1.jar:/home/jenkins/.m2/repository/org/eclipse/jetty/websocket/websocket-common/9.4.28.v20200408/websocket-common-9.4.28.v20200408.jar:/home/jenkins/workspace/spark-master-test-k8s/common/tags/target/spark-tags_2.12-3.1.0-SNAPSHOT.jar:/home/jenkins/.m2/repository/org/apache/directory/api/api-ldap-client-api/1.0.0-M20/api-ldap-client-api-1.0.0-M20.jar:/home/jenkins/.m2/repository/org/scalatestplus/scalatestplus-scalacheck_2.12/3.1.0.0-RC2/scalatestplus-scalacheck_2.12-3.1.0.0-RC2.jar:/home/jenkins/.m2/repository/commons-lang/commons-lang/2.6/commons-lang-2.6.jar:/home/jenkins/.m2/repository/org/glassfish/jersey/test-framework/jersey-test-framework-core/2.30/jersey-test-framework-core-2.30.jar:/home/jenkins/.m2/repository/org/seleniumhq/selenium/selenium-edge-driver/3.141.59/selenium-edge-driver-3.141.59.jar:/home/jenkins/.m2/repository/org/apache/commons/commons-exec/1.3/commons-exec-1.3.jar:/home/jenkins/.m2/repository/org/apache/hadoop/hadoop-auth/2.7.4/hadoop-auth-2.7.4.jar:/home/jenkins/.m2/repository/javax/activation/activation/1.1.1/activation-1.1.1.jar:/home/jenkins/.m2/repository/org/apache/hadoop/hadoop-mapreduce-client-shuffle/2.7.4/hadoop-mapreduce-client-shuffle-2.7.4.jar:/home/jenkins/.m2/repository/org/scalatest/scalatest-flatspec_2.12/3.2.0/scalatest-flatspec_2.12-3.2.0.jar:/home/jenkins/.m2/repository/org/simpleframework/simple-transport/6.0.1/simple-transport-6.0.1.jar:/home/jenkins/.m2/repository/org/apache/directory/api/api-ldap-extras-util/1.0.0-M20/api-ldap-extras-util-1.0.0-M20.jar:/home/jenkins/.m2/repository/commons-beanutils/commons-beanutils/1.9.4/commons-beanutils-1.9.4.jar:/home/jenkins/.m2/repository/org/apache/ivy/ivy/2.4.0/ivy-2.4.0.jar:/home/jenkins/.m2/repository/org/scalatest/scalatest-funspec_2.12/3.2.0/scalatest-funspec_2.12-3.2.0.jar:/home/jenkins/.m2/repository/org/scalatest/scalatest-shouldmatchers_2.12/3.2.0/scalatest-shouldmatchers_2.12-3.2.0.jar:/home/jenkins/.m2/repository/org/apache/directory/api/api-ldap-extras-aci/1.0.0-M20/api-ldap-extras-aci-1.0.0-M20.jar:/home/jenkins/.m2/repository/com/twitter/chill_2.12/0.9.5/chill_2.12-0.9.5.jar:/home/jenkins/workspace/spark-master-test-k8s/common/tags/target/spark-tags_2.12-3.1.0-SNAPSHOT-tests.jar:/home/jenkins/.m2/repository/net/razorvine/pyrolite/4.30/pyrolite-4.30.jar:/home/jenkins/.m2/repository/org/apache/directory/jdbm/apacheds-jdbm1/2.0.0-M2/apacheds-jdbm1-2.0.0-M2.jar:/home/jenkins/.m2/repository/jakarta/validation/jakarta.validation-api/2.0.2/jakarta.validation-api-2.0.2.jar:/home/jenkins/.m2/repository/org/glassfish/jersey/inject/jersey-hk2/2.30/jersey-hk2-2.30.jar:/home/jenkins/.m2/repository/org/apache/curator/curator-test/2.7.1/curator-test-2.7.1.jar:/home/jenkins/.m2/repository/org/json4s/json4s-ast_2.12/3.7.0-M5/json4s-ast_2.12-3.7.0-M5.jar:/home/jenkins/.m2/repository/net/bytebuddy/byte-buddy/1.9.10/byte-buddy-1.9.10.jar:/home/jenkins/.m2/repository/org/scalatest/scalatest-compatible/3.2.0/scalatest-compatible-3.2.0.jar:/home/jenkins/.m2/repository/org/scalatest/scalatest-funsuite_2.12/3.2.0/scalatest-funsuite_2.12-3.2.0.jar:/home/jenkins/.m2/repository/org/apache/avro/avro-mapred/1.8.2/avro-mapred-1.8.2-hadoop2.jar:/home/jenkins/.m2/repository/org/apache/directory/server/apacheds-interceptors-normalization/2.0.0-M15/apacheds-interceptors-normalization-2.0.0-M15.jar:/home/jenkins/.m2/repository/org/apache/directory/server/apacheds-core-shared/2.0.0-M15/apacheds-core-shared-2.0.0-M15.jar:/home/jenkins/.m2/repository/org/scalatest/scalatest-featurespec_2.12/3.2.0/scalatest-featurespec_2.12-3.2.0.jar:/home/jenkins/.m2/repository/org/scala-lang/scala-reflect/2.12.10/scala-reflect-2.12.10.jar:/home/jenkins/.m2/repository/log4j/log4j/1.2.17/log4j-1.2.17.jar:/home/jenkins/.m2/repository/org/apache/hadoop/hadoop-minikdc/2.7.4/hadoop-minikdc-2.7.4.jar:/home/jenkins/.m2/repository/org/apache/curator/curator-framework/2.7.1/curator-framework-2.7.1.jar:/home/jenkins/.m2/repository/org/apache/curator/curator-recipes/2.7.1/curator-recipes-2.7.1.jar:/home/jenkins/.m2/repository/io/dropwizard/metrics/metrics-core/4.1.1/metrics-core-4.1.1.jar:/home/jenkins/.m2/repository/org/apache/directory/server/apacheds-interceptor-kerberos/2.0.0-M15/apacheds-interceptor-kerberos-2.0.0-M15.jar:/home/jenkins/.m2/repository/org/eclipse/jetty/jetty-proxy/9.4.28.v20200408/jetty-proxy-9.4.28.v20200408.jar:/home/jenkins/.m2/repository/com/shapesecurity/salvation/2.7.1/salvation-2.7.1.jar:/home/jenkins/.m2/repository/org/apache/avro/avro/1.8.2/avro-1.8.2.jar:/home/jenkins/.m2/repository/io/dropwizard/metrics/metrics-json/4.1.1/metrics-json-4.1.1.jar:/home/jenkins/.m2/repository/org/apache/directory/server/apacheds-kerberos-codec/2.0.0-M15/apacheds-kerberos-codec-2.0.0-M15.jar:/home/jenkins/.m2/repository/org/roaringbitmap/shims/0.9.0/shims-0.9.0.jar:/home/jenkins/.m2/repository/antlr/antlr/2.7.7/antlr-2.7.7.jar:/home/jenkins/.m2/repository/org/scalatest/scalatest-freespec_2.12/3.2.0/scalatest-freespec_2.12-3.2.0.jar:/home/jenkins/.m2/repository/org/eclipse/jetty/jetty-webapp/9.4.28.v20200408/jetty-webapp-9.4.28.v20200408.jar:/home/jenkins/.m2/repository/org/glassfish/hk2/osgi-resource-locator/1.0.3/osgi-resource-locator-1.0.3.jar:/home/jenkins/.m2/repository/org/scala-sbt/test-interface/1.0/test-interface-1.0.jar:/home/jenkins/.m2/repository/com/squareup/okio/okio/1.14.0/okio-1.14.0.jar:/home/jenkins/.m2/repository/org/codehaus/jackson/jackson-mapper-asl/1.9.13/jackson-mapper-asl-1.9.13.jar:/home/jenkins/.m2/repository/javax/servlet/jsp/jsp-api/2.1/jsp-api-2.1.jar:/home/jenkins/.m2/repository/org/scalatest/scalatest-mustmatchers_2.12/3.2.0/scalatest-mustmatchers_2.12-3.2.0.jar:/home/jenkins/.m2/repository/org/slf4j/slf4j-api/1.7.30/slf4j-api-1.7.30.jar:/home/jenkins/.m2/repository/com/ning/compress-lzf/1.0.3/compress-lzf-1.0.3.jar:/home/jenkins/.m2/repository/org/glassfish/jersey/containers/jersey-container-servlet/2.30/jersey-container-servlet-2.30.jar:/home/jenkins/.m2/repository/org/glassfish/jersey/containers/jersey-container-simple-http/2.30/jersey-container-simple-http-2.30.jar:/home/jenkins/.m2/repository/org/apache/directory/server/apacheds-interceptors-authz/2.0.0-M15/apacheds-interceptors-authz-2.0.0-M15.jar:/home/jenkins/.m2/repository/org/eclipse/jetty/jetty-security/9.4.28.v20200408/jetty-security-9.4.28.v20200408.jar:/home/jenkins/.m2/repository/org/apache/derby/derby/10.12.1.1/derby-10.12.1.1.jar:/home/jenkins/.m2/repository/com/google/code/gson/gson/2.2.4/gson-2.2.4.jar:/home/jenkins/.m2/repository/org/apache/hadoop/hadoop-annotations/2.7.4/hadoop-annotations-2.7.4.jar:/home/jenkins/.m2/repository/org/seleniumhq/selenium/selenium-remote-driver/3.141.59/selenium-remote-driver-3.141.59.jar:/home/jenkins/.m2/repository/org/javassist/javassist/3.25.0-GA/javassist-3.25.0-GA.jar:/home/jenkins/.m2/repository/org/apache/directory/server/apacheds-protocol-shared/2.0.0-M15/apacheds-protocol-shared-2.0.0-M15.jar:/home/jenkins/.m2/repository/org/glassfish/jersey/containers/jersey-container-servlet-core/2.30/jersey-container-servlet-core-2.30.jar:/home/jenkins/.m2/repository/commons-configuration/commons-configuration/1.6/commons-configuration-1.6.jar:/home/jenkins/.m2/repository/commons-digester/commons-digester/1.8/commons-digester-1.8.jar:/home/jenkins/.m2/repository/org/apache/directory/server/apacheds-i18n/2.0.0-M15/apacheds-i18n-2.0.0-M15.jar:/home/jenkins/.m2/repository/org/glassfish/jersey/test-framework/providers/jersey-test-framework-provider-simple/2.30/jersey-test-framework-provider-simple-2.30.jar:/home/jenkins/.m2/repository/org/apache/curator/curator-client/2.7.1/curator-client-2.7.1.jar:/home/jenkins/.m2/repository/org/apache/hadoop/hadoop-hdfs/2.7.4/hadoop-hdfs-2.7.4.jar:/home/jenkins/.m2/repository/org/eclipse/jetty/jetty-client/9.4.28.v20200408/jetty-client-9.4.28.v20200408.jar:/home/jenkins/.m2/repository/org/scalacheck/scalacheck_2.12/1.14.2/scalacheck_2.12-1.14.2.jar:/home/jenkins/.m2/repository/commons-cli/commons-cli/1.2/commons-cli-1.2.jar:/home/jenkins/workspace/spark-master-test-k8s/common/unsafe/target/spark-unsafe_2.12-3.1.0-SNAPSHOT.jar:/home/jenkins/.m2/repository/org/eclipse/jetty/jetty-xml/9.4.28.v20200408/jetty-xml-9.4.28.v20200408.jar:/home/jenkins/.m2/repository/org/spark-project/spark/unused/1.0.0/unused-1.0.0.jar:/home/jenkins/.m2/repository/org/apache/directory/api/api-ldap-extras-codec-api/1.0.0-M20/api-ldap-extras-codec-api-1.0.0-M20.jar:/home/jenkins/.m2/repository/org/eclipse/jetty/jetty-server/9.4.28.v20200408/jetty-server-9.4.28.v20200408.jar:/home/jenkins/.m2/repository/commons-collections/commons-collections/3.2.2/commons-collections-3.2.2.jar:/home/jenkins/workspace/spark-master-test-k8s/launcher/target/spark-launcher_2.12-3.1.0-SNAPSHOT.jar:/home/jenkins/.m2/repository/org/apache/directory/api/api-ldap-codec-core/1.0.0-M20/api-ldap-codec-core-1.0.0-M20.jar:/home/jenkins/.m2/repository/org/scalactic/scalactic_2.12/3.2.0/scalactic_2.12-3.2.0.jar:/home/jenkins/.m2/repository/org/apache/httpcomponents/httpclient/4.5.6/httpclient-4.5.6.jar:/home/jenkins/.m2/repository/org/eclipse/jetty/websocket/websocket-api/9.4.28.v20200408/websocket-api-9.4.28.v20200408.jar:/home/jenkins/.m2/repository/org/apache/directory/server/apacheds-interceptors-trigger/2.0.0-M15/apacheds-interceptors-trigger-2.0.0-M15.jar:/home/jenkins/.m2/repository/org/apache/directory/api/api-all/1.0.0-M20/api-all-1.0.0-M20.jar:/home/jenkins/.m2/repository/commons-httpclient/commons-httpclient/3.1/commons-httpclient-3.1.jar:/home/jenkins/.m2/repository/net/sf/ehcache/ehcache-core/2.4.4/ehcache-core-2.4.4.jar:/home/jenkins/.m2/repository/org/scalatestplus/scalatestplus-mockito_2.12/1.0.0-SNAP5/scalatestplus-mockito_2.12-1.0.0-SNAP5.jar:/home/jenkins/.m2/repository/com/clearspring/analytics/stream/2.9.6/stream-2.9.6.jar:/home/jenkins/.m2/repository/org/apache/hadoop/hadoop-mapreduce-client-common/2.7.4/hadoop-mapreduce-client-common-2.7.4.jar:/home/jenkins/.m2/repository/org/glassfish/hk2/hk2-locator/2.6.1/hk2-locator-2.6.1.jar:/home/jenkins/.m2/repository/org/slf4j/slf4j-log4j12/1.7.30/slf4j-log4j12-1.7.30.jar:/home/jenkins/.m2/repository/org/glassfish/hk2/hk2-utils/2.6.1/hk2-utils-2.6.1.jar:/home/jenkins/.m2/repository/org/seleniumhq/selenium/htmlunit-driver/2.40.0/htmlunit-driver-2.40.0.jar:/home/jenkins/.m2/repository/org/apache/directory/server/apacheds-interceptors-changelog/2.0.0-M15/apacheds-interceptors-changelog-2.0.0-M15.jar:/home/jenkins/.m2/repository/com/thoughtworks/paranamer/paranamer/2.8/paranamer-2.8.jar:/home/jenkins/.m2/repository/io/netty/netty-all/4.1.51.Final/netty-all-4.1.51.Final.jar:/home/jenkins/.m2/repository/com/fasterxml/jackson/core/jackson-annotations/2.10.0/jackson-annotations-2.10.0.jar:/home/jenkins/.m2/repository/org/apache/hadoop/hadoop-client/2.7.4/hadoop-client-2.7.4.jar:/home/jenkins/.m2/repository/org/objenesis/objenesis/2.6/objenesis-2.6.jar:/home/jenkins/.m2/repository/org/fusesource/leveldbjni/leveldbjni-all/1.8/leveldbjni-all-1.8.jar:/home/jenkins/.m2/repository/xml-apis/xml-apis/1.4.01/xml-apis-1.4.01.jar:/home/jenkins/.m2/repository/org/apache/commons/commons-text/1.6/commons-text-1.6.jar:/home/jenkins/.m2/repository/com/fasterxml/jackson/core/jackson-core/2.10.0/jackson-core-2.10.0.jar:/home/jenkins/.m2/repository/jakarta/ws/rs/jakarta.ws.rs-api/2.1.6/jakarta.ws.rs-api-2.1.6.jar:/home/jenkins/.m2/repository/org/tukaani/xz/1.5/xz-1.5.jar:/home/jenkins/.m2/repository/org/glassfish/hk2/external/aopalliance-repackaged/2.6.1/aopalliance-repackaged-2.6.1.jar:/home/jenkins/.m2/repository/org/apache/directory/server/apacheds-core-constants/2.0.0-M15/apacheds-core-constants-2.0.0-M15.jar:/home/jenkins/.m2/repository/org/apache/hadoop/hadoop-common/2.7.4/hadoop-common-2.7.4.jar:/home/jenkins/.m2/repository/commons-io/commons-io/2.4/commons-io-2.4.jar:/home/jenkins/.m2/repository/org/apache/directory/server/apacheds-protocol-ldap/2.0.0-M15/apacheds-protocol-ldap-2.0.0-M15.jar:/home/jenkins/.m2/repository/xalan/serializer/2.7.2/serializer-2.7.2.jar:/home/jenkins/.m2/repository/com/fasterxml/jackson/module/jackson-module-paranamer/2.10.0/jackson-module-paranamer-2.10.0.jar:/home/jenkins/.m2/repository/org/apache/hadoop/hadoop-yarn-client/2.7.4/hadoop-yarn-client-2.7.4.jar:/home/jenkins/.m2/repository/org/apache/directory/api/api-ldap-extras-codec/1.0.0-M20/api-ldap-extras-codec-1.0.0-M20.jar:/home/jenkins/.m2/repository/com/esotericsoftware/kryo-shaded/4.0.2/kryo-shaded-4.0.2.jar:/home/jenkins/.m2/repository/com/esotericsoftware/minlog/1.3.0/minlog-1.3.0.jar:/home/jenkins/.m2/repository/xalan/xalan/2.7.2/xalan-2.7.2.jar:/home/jenkins/.m2/repository/org/apache/directory/server/apacheds-interceptors-schema/2.0.0-M15/apacheds-interceptors-schema-2.0.0-M15.jar:/home/jenkins/.m2/repository/org/codehaus/jackson/jackson-core-asl/1.9.13/jackson-core-asl-1.9.13.jar:/home/jenkins/.m2/repository/net/sf/py4j/py4j/0.10.9/py4j-0.10.9.jar:/home/jenkins/.m2/repository/com/squareup/okhttp3/okhttp/3.11.0/okhttp-3.11.0.jar:/home/jenkins/workspace/spark-master-test-k8s/common/network-shuffle/target/spark-network-shuffle_2.12-3.1.0-SNAPSHOT.jar:/home/jenkins/.m2/repository/org/slf4j/jul-to-slf4j/1.7.30/jul-to-slf4j-1.7.30.jar:/home/jenkins/.m2/repository/org/json4s/json4s-scalap_2.12/3.7.0-M5/json4s-scalap_2.12-3.7.0-M5.jar:/home/jenkins/.m2/repository/org/eclipse/jetty/jetty-plus/9.4.28.v20200408/jetty-plus-9.4.28.v20200408.jar:/home/jenkins/.m2/repository/org/scalatest/scalatest_2.12/3.2.0/scalatest_2.12-3.2.0.jar:/home/jenkins/.m2/repository/org/seleniumhq/selenium/selenium-ie-driver/3.141.59/selenium-ie-driver-3.141.59.jar:/home/jenkins/.m2/repository/org/lz4/lz4-java/1.7.1/lz4-java-1.7.1.jar:/home/jenkins/.m2/repository/javax/xml/bind/jaxb-api/2.2.2/jaxb-api-2.2.2.jar:/home/jenkins/.m2/repository/org/xerial/snappy/snappy-java/1.1.7.5/snappy-java-1.1.7.5.jar:/home/jenkins/.m2/repository/org/json4s/json4s-jackson_2.12/3.7.0-M5/json4s-jackson_2.12-3.7.0-M5.jar:/home/jenkins/.m2/repository/com/github/luben/zstd-jni/1.4.5-4/zstd-jni-1.4.5-4.jar:/home/jenkins/.m2/repository/org/scalatest/scalatest-matchers-core_2.12/3.2.0/scalatest-matchers-core_2.12-3.2.0.jar:/home/jenkins/.m2/repository/org/eclipse/jetty/jetty-jndi/9.4.28.v20200408/jetty-jndi-9.4.28.v20200408.jar:/home/jenkins/.m2/repository/org/mortbay/jetty/jetty-sslengine/6.1.26/jetty-sslengine-6.1.26.jar:/home/jenkins/.m2/repository/io/dropwizard/metrics/metrics-graphite/4.1.1/metrics-graphite-4.1.1.jar:/home/jenkins/.m2/repository/org/eclipse/jetty/jetty-servlet/9.4.28.v20200408/jetty-servlet-9.4.28.v20200408.jar:/home/jenkins/.m2/repository/net/sourceforge/htmlunit/htmlunit-core-js/2.40.0/htmlunit-core-js-2.40.0.jar:/home/jenkins/.m2/repository/org/apache/directory/mavibot/mavibot/1.0.0-M1/mavibot-1.0.0-M1.jar:/home/jenkins/.m2/repository/commons-codec/commons-codec/1.10/commons-codec-1.10.jar:/home/jenkins/.m2/repository/com/google/guava/guava/14.0.1/guava-14.0.1.jar:/home/jenkins/.m2/repository/org/apache/httpcomponents/httpcore/4.4.12/httpcore-4.4.12.jar:/home/jenkins/.m2/repository/org/apache/hadoop/hadoop-mapreduce-client-core/2.7.4/hadoop-mapreduce-client-core-2.7.4.jar:/home/jenkins/workspace/spark-master-test-k8s/common/kvstore/target/spark-kvstore_2.12-3.1.0-SNAPSHOT.jar:/home/jenkins/.m2/repository/javax/servlet/javax.servlet-api/3.1.0/javax.servlet-api-3.1.0.jar:/home/jenkins/.m2/repository/net/sourceforge/htmlunit/htmlunit/2.40.0/htmlunit-2.40.0.jar:/home/jenkins/.m2/repository/org/apache/directory/server/apacheds-xdbm-partition/2.0.0-M15/apacheds-xdbm-partition-2.0.0-M15.jar:/home/jenkins/.m2/repository/org/apache/commons/commons-math3/3.4.1/commons-math3-3.4.1.jar:/home/jenkins/.m2/repository/javax/xml/stream/stax-api/1.0-2/stax-api-1.0-2.jar:/home/jenkins/.m2/repository/org/codehaus/jackson/jackson-xc/1.9.13/jackson-xc-1.9.13.jar:/home/jenkins/.m2/repository/org/apache/directory/server/apacheds-core-avl/2.0.0-M15/apacheds-core-avl-2.0.0-M15.jar:/home/jenkins/.m2/repository/org/apache/directory/api/api-ldap-extras-trigger/1.0.0-M20/api-ldap-extras-trigger-1.0.0-M20.jar:/home/jenkins/.m2/repository/org/scalatest/scalatest-propspec_2.12/3.2.0/scalatest-propspec_2.12-3.2.0.jar:/home/jenkins/.m2/repository/org/mockito/mockito-core/3.1.0/mockito-core-3.1.0.jar:/home/jenkins/.m2/repository/org/eclipse/jetty/jetty-http/9.4.28.v20200408/jetty-http-9.4.28.v20200408.jar:/home/jenkins/.m2/repository/org/glassfish/jersey/core/jersey-common/2.30/jersey-common-2.30.jar:/home/jenkins/.m2/repository/org/apache/directory/api/api-ldap-extras-sp/1.0.0-M20/api-ldap-extras-sp-1.0.0-M20.jar:/home/jenkins/.m2/repository/oro/oro/2.0.8/oro-2.0.8.jar:/home/jenkins/.m2/repository/com/novocode/junit-interface/0.11/junit-interface-0.11.jar:/home/jenkins/.m2/repository/org/apache/xbean/xbean-asm7-shaded/4.15/xbean-asm7-shaded-4.15.jar:/home/jenkins/.m2/repository/org/hamcrest/hamcrest-library/1.3/hamcrest-library-1.3.jar:/home/jenkins/.m2/repository/org/scalatest/scalatest-diagrams_2.12/3.2.0/scalatest-diagrams_2.12-3.2.0.jar:/home/jenkins/.m2/repository/org/simpleframework/simple-common/6.0.1/simple-common-6.0.1.jar:/home/jenkins/.m2/repository/org/apache/directory/api/api-asn1-ber/1.0.0-M20/api-asn1-ber-1.0.0-M20.jar:/home/jenkins/.m2/repository/org/glassfish/hk2/hk2-api/2.6.1/hk2-api-2.6.1.jar:/home/jenkins/.m2/repository/org/apache/zookeeper/zookeeper/3.4.14/zookeeper-3.4.14.jar:/home/jenkins/.m2/repository/org/seleniumhq/selenium/selenium-chrome-driver/3.141.59/selenium-chrome-driver-3.141.59.jar:/home/jenkins/.m2/repository/org/seleniumhq/selenium/selenium-opera-driver/3.141.59/selenium-opera-driver-3.141.59.jar:/home/jenkins/.m2/repository/jakarta/annotation/jakarta.annotation-api/1.3.5/jakarta.annotation-api-1.3.5.jar:/home/jenkins/.m2/repository/org/apache/directory/server/apacheds-mavibot-partition/2.0.0-M15/apacheds-mavibot-partition-2.0.0-M15.jar:/home/jenkins/.m2/repository/org/mortbay/jetty/jetty-util/6.1.26/jetty-util-6.1.26.jar:/home/jenkins/.m2/repository/org/apache/hadoop/hadoop-yarn-api/2.7.4/hadoop-yarn-api-2.7.4.jar:/home/jenkins/.m2/repository/org/apache/yetus/audience-annotations/0.5.0/audience-annotations-0.5.0.jar:/home/jenkins/.m2/repository/org/scalatest/scalatest-wordspec_2.12/3.2.0/scalatest-wordspec_2.12-3.2.0.jar:/home/jenkins/.m2/repository/io/dropwizard/metrics/metrics-jvm/4.1.1/metrics-jvm-4.1.1.jar:/home/jenkins/.m2/repository/org/scalatestplus/scalatestplus-selenium_2.12/1.0.0-SNAP5/scalatestplus-selenium_2.12-1.0.0-SNAP5.jar:/home/jenkins/.m2/repository/org/apache/directory/server/apacheds-core-api/2.0.0-M15/apacheds-core-api-2.0.0-M15.jar:/home/jenkins/.m2/repository/org/hamcrest/hamcrest-core/1.3/hamcrest-core-1.3.jar:/home/jenkins/.m2/repository/org/simpleframework/simple-http/6.0.1/simple-http-6.0.1.jar:/home/jenkins/.m2/repository/org/seleniumhq/selenium/selenium-support/3.141.59/selenium-support-3.141.59.jar:/home/jenkins/.m2/repository/org/apache/hadoop/hadoop-yarn-server-common/2.7.4/hadoop-yarn-server-common-2.7.4.jar:/home/jenkins/.m2/repository/org/scala-lang/modules/scala-xml_2.12/1.2.0/scala-xml_2.12-1.2.0.jar:/home/jenkins/.m2/repository/org/apache/directory/server/apacheds-interceptors-subtree/2.0.0-M15/apacheds-interceptors-subtree-2.0.0-M15.jar:/home/jenkins/.m2/repository/org/apache/hadoop/hadoop-mapreduce-client-app/2.7.4/hadoop-mapreduce-client-app-2.7.4.jar:/home/jenkins/.m2/repository/org/apache/avro/avro-ipc/1.8.2/avro-ipc-1.8.2.jar:/home/jenkins/.m2/repository/xmlenc/xmlenc/0.52/xmlenc-0.52.jar:/home/jenkins/.m2/repository/com/fasterxml/jackson/core/jackson-databind/2.10.0/jackson-databind-2.10.0.jar:/home/jenkins/.m2/repository/org/apache/directory/api/api-util/1.0.0-M20/api-util-1.0.0-M20.jar:/home/jenkins/.m2/repository/org/apache/directory/server/apacheds-interceptors-referral/2.0.0-M15/apacheds-interceptors-referral-2.0.0-M15.jar:/home/jenkins/.m2/repository/org/apache/hadoop/hadoop-yarn-common/2.7.4/hadoop-yarn-common-2.7.4.jar:/home/jenkins/.m2/repository/org/apache/directory/api/api-asn1-api/1.0.0-M20/api-asn1-api-1.0.0-M20.jar:/home/jenkins/workspace/spark-master-test-k8s/launcher/target/spark-launcher_2.12-3.1.0-SNAPSHOT-tests.jar:/home/jenkins/.m2/repository/org/eclipse/jetty/jetty-util/9.4.28.v20200408/jetty-util-9.4.28.v20200408.jar:/home/jenkins/.m2/repository/org/apache/directory/server/apacheds-protocol-kerberos/2.0.0-M15/apacheds-protocol-kerberos-2.0.0-M15.jar:/home/jenkins/.m2/repository/org/brotli/dec/0.1.2/dec-0.1.2.jar:/home/jenkins/.m2/repository/net/sourceforge/htmlunit/neko-htmlunit/2.40.0/neko-htmlunit-2.40.0.jar:/home/jenkins/.m2/repository/org/apache/commons/commons-lang3/3.10/commons-lang3-3.10.jar:/home/jenkins/.m2/repository/org/apache/directory/server/apacheds-ldif-partition/2.0.0-M15/apacheds-ldif-partition-2.0.0-M15.jar:/home/jenkins/.m2/repository/org/apache/directory/server/apacheds-interceptors-admin/2.0.0-M15/apacheds-interceptors-admin-2.0.0-M15.jar:/home/jenkins/.m2/repository/commons-pool/commons-pool/1.6/commons-pool-1.6.jar:/home/jenkins/.m2/repository/org/seleniumhq/selenium/selenium-api/3.141.59/selenium-api-3.141.59.jar:/home/jenkins/.m2/repository/org/seleniumhq/selenium/selenium-java/3.141.59/selenium-java-3.141.59.jar:/home/jenkins/.m2/repository/org/roaringbitmap/RoaringBitmap/0.9.0/RoaringBitmap-0.9.0.jar:/home/jenkins/.m2/repository/org/apache/directory/server/apacheds-interceptors-collective/2.0.0-M15/apacheds-interceptors-collective-2.0.0-M15.jar:/home/jenkins/.m2/repository/org/apache/directory/server/apacheds-interceptors-event/2.0.0-M15/apacheds-interceptors-event-2.0.0-M15.jar:/home/jenkins/.m2/repository/org/slf4j/jcl-over-slf4j/1.7.30/jcl-over-slf4j-1.7.30.jar:/home/jenkins/.m2/repository/org/apache/directory/server/apacheds-interceptors-exception/2.0.0-M15/apacheds-interceptors-exception-2.0.0-M15.jar:/home/jenkins/.m2/repository/org/glassfish/jersey/core/jersey-server/2.30/jersey-server-2.30.jar:/home/jenkins/.m2/repository/io/dropwizard/metrics/metrics-jmx/4.1.1/metrics-jmx-4.1.1.jar:/home/jenkins/.m2/repository/org/glassfish/jersey/core/jersey-client/2.30/jersey-client-2.30.jar:/home/jenkins/.m2/repository/org/apache/directory/server/apacheds-interceptors-operational/2.0.0-M15/apacheds-interceptors-operational-2.0.0-M15.jar:/home/jenkins/workspace/spark-master-test-k8s/common/network-shuffle/target/spark-network-shuffle_2.12-3.1.0-SNAPSHOT-tests.jar:/home/jenkins/.m2/repository/junit/junit/4.12/junit-4.12.jar:/home/jenkins/.m2/repository/org/apache/mina/mina-core/2.0.7/mina-core-2.0.7.jar:/home/jenkins/.m2/repository/org/seleniumhq/selenium/selenium-firefox-driver/3.141.59/selenium-firefox-driver-3.141.59.jar:/home/jenkins/.m2/repository/commons-logging/commons-logging/1.1.3/commons-logging-1.1.3.jar:/home/jenkins/.m2/repository/org/seleniumhq/selenium/selenium-safari-driver/3.141.59/selenium-safari-driver-3.141.59.jar:/home/jenkins/.m2/repository/org/eclipse/jetty/websocket/websocket-client/9.4.28.v20200408/websocket-client-9.4.28.v20200408.jar:/home/jenkins/.m2/repository/org/apache/directory/server/apacheds-interceptors-journal/2.0.0-M15/apacheds-interceptors-journal-2.0.0-M15.jar:/home/jenkins/.m2/repository/net/sourceforge/htmlunit/htmlunit-cssparser/1.5.0/htmlunit-cssparser-1.5.0.jar:/home/jenkins/.m2/repository/org/eclipse/jetty/jetty-continuation/9.4.28.v20200408/jetty-continuation-9.4.28.v20200408.jar:/home/jenkins/.m2/repository/org/scalatest/scalatest-core_2.12/3.2.0/scalatest-core_2.12-3.2.0.jar
[INFO] 
[INFO] --- scala-maven-plugin:4.3.0:testCompile (scala-test-compile-first) @ spark-core_2.12 ---
[INFO] Using incremental compilation using Mixed compile order
[INFO] Compiler bridge file: /home/jenkins/.sbt/1.0/zinc/org.scala-sbt/org.scala-sbt-compiler-bridge_2.12-1.3.1-bin_2.12.10__52.0-1.3.1_20191012T045515.jar
[INFO] Compiling 293 Scala sources and 27 Java sources to /home/jenkins/workspace/spark-master-test-k8s/core/target/scala-2.12/test-classes ...
[WARNING] [Warn] /home/jenkins/workspace/spark-master-test-k8s/core/src/test/scala/org/apache/spark/storage/BlockManagerSuite.scala:225: value rpcEnv does nothing other than call itself recursively
[WARNING] [Warn] /home/jenkins/workspace/spark-master-test-k8s/core/src/test/scala/org/apache/spark/storage/BlockManagerSuite.scala:239: value rpcEnv does nothing other than call itself recursively
[WARNING] two warnings found
[INFO] Done compiling.
[INFO] compile in 58.9 s
[INFO] 
[INFO] --- maven-surefire-plugin:3.0.0-M3:test (default-test) @ spark-core_2.12 ---
[INFO] 
[INFO] -------------------------------------------------------
[INFO]  T E S T S
[INFO] -------------------------------------------------------
[WARNING] Couldn't load group class 'k8s' in Surefire|Failsafe plugin. The group class is ignored!
[INFO] 
[INFO] Results:
[INFO] 
[INFO] Tests run: 0, Failures: 0, Errors: 0, Skipped: 0
[INFO] 
[INFO] 
[INFO] --- maven-surefire-plugin:3.0.0-M3:test (test) @ spark-core_2.12 ---
[INFO] Skipping execution of surefire because it has already been run for this configuration
[INFO] 
[INFO] --- scalatest-maven-plugin:2.0.0:test (test) @ spark-core_2.12 ---
Discovery starting.
Discovery completed in 7 seconds, 31 milliseconds.
Run starting. Expected test count is: 0
ExternalSorterSuite:
DAGSchedulerSuite:
FsHistoryProviderSuite:
RDDSuite:
ExecutorSuite:
SerDeUtilSuite:
UtilsSuite:
PagedDataSourceSuite:
CheckpointStorageSuite:
SortingSuite:
RpcAddressSuite:
JavaSerializerSuite:
LocalDirsSuite:
TaskContextSuite:
HistoryServerSuite:
NextIteratorSuite:
ParallelCollectionSplitSuite:
UISeleniumSuite:
HadoopDelegationTokenManagerSuite:
RollingEventLogFilesWriterSuite:
RandomBlockReplicationPolicyBehavior:
RDDCleanerSuite:
LocalDiskShuffleMapOutputWriterSuite:
TestMemoryManagerSuite:
ResourceProfileManagerSuite:
ExecutorRunnerTest:
BlockTransferServiceSuite:
EventLoggingListenerSuite:
PluginContainerSuite:
DriverRunnerTest:
PrefixComparatorsSuite:
NettyBlockTransferSecuritySuite:
CommandUtilsSuite:
PairRDDFunctionsSuite:
RBackendSuite:
PrimitiveVectorSuite:
MetricsConfigSuite:
PartiallySerializedBlockSuite:
SparkContextSchedulerCreationSuite:
SerializationDebuggerSuite:
LoggingSuite:
NettyRpcHandlerSuite:
SamplingUtilsSuite:
TimeStampedHashMapSuite:
RandomSamplerSuite:
ChunkedByteBufferOutputStreamSuite:
ProcfsMetricsGetterSuite:
GraphiteSinkSuite:
SparkSubmitUtilsSuite:
BasicEventFilterBuilderSuite:
ImplicitOrderingSuite:
TaskMetricsSuite:
ExternalShuffleServiceSuite:
ClosureCleanerSuite:
UnpersistSuite:
PeriodicRDDCheckpointerSuite:
TaskSetManagerSuite:
BlockManagerBasicStrategyReplicationSuite:
BlockManagerMasterSuite:
RDDOperationGraphSuite:
ShuffleExternalSorterSuite:
ChunkedByteBufferSuite:
HistoryServerDiskManagerSuite:
PythonBroadcastSuite:
KeyLockSuite:
NettyBlockTransferServiceSuite:
BasicSchedulerIntegrationSuite:
JobWaiterSuite:
RDDBarrierSuite:
UninterruptibleThreadSuite:
BlockManagerDecommissionUnitSuite:
DriverSuite:
CompactBufferSuite:
MapStatusSuite:
BlockInfoManagerSuite:
StoragePageSuite:
TaskSchedulerImplSuite:
SparkConfSuite:
ShuffleBlockFetcherIteratorSuite:
ConfigEntrySuite:
WorkerSuite:
BlockManagerSuite:
PythonRunnerSuite:
SortShuffleWriterSuite:
CryptoStreamUtilsSuite:
StatsdSinkSuite:
FileCommitProtocolInstantiationSuite:
CompletionIteratorSuite:
LauncherBackendSuite:
LogPageSuite:
UnifiedMemoryManagerSuite:
UnsafeKryoSerializerSuite:
NettyRpcAddressSuite:
ExternalShuffleServiceMetricsSuite:
BitSetSuite:
AsyncRDDActionsSuite:
StagePageSuite:
BarrierStageOnSubmittedSuite:
BlockManagerInfoSuite:
HistoryServerArgumentsSuite:
HttpSecurityFilterSuite:
MetricsSystemSuite:
JobCancellationSuite:
PartitioningSuite:
SecurityManagerSuite:
UISuite:
SSLOptionsSuite:
SparkListenerWithClusterSuite:
RollingEventLogFilesReaderSuite:
ExecutorMonitorSuite:
SparkUncaughtExceptionHandlerSuite:
InputOutputMetricsSuite:
OutputCommitCoordinatorIntegrationSuite:
BasicEventFilterSuite:
StandaloneRestSubmitSuite:
DriverLoggerSuite:
OutputCommitCoordinatorSuite:
SortShuffleSuite:
SumEvaluatorSuite:
MapOutputTrackerSuite:
HadoopFSDelegationTokenProviderSuite:
WholeTextFileInputFormatSuite:
BlockManagerProactiveReplicationSuite:
SparkListenerSuite:
VersionUtilsSuite:
SizeTrackerSuite:
SortShuffleManagerSuite:
KryoSerializerAutoResetDisabledSuite:
SparkTransportConfSuite:
CompressionCodecSuite:
ChunkedByteBufferFileRegionSuite:
XORShiftRandomSuite:
CoarseGrainedSchedulerBackendSuite:
AppendOnlyMapSuite:
ConfigReaderSuite:
ThreadUtilsSuite:
SocketAuthHelperSuite:
RDDOperationScopeSuite:
ShuffleDriverComponentsSuite:
KryoSerializerDistributedSuite:
OpenHashMapSuite:
OpenHashSetSuite:
AccumulatorSuite:
SparkContextInfoSuite:
ExecutorAllocationManagerSuite:
MemoryStoreSuite:
ResourceProfileSuite:
SparkSubmitSuite:
DecommissionWorkerSuite:
RPackageUtilsSuite:
TaskDescriptionSuite:
BlockManagerDecommissionIntegrationSuite:
MeanEvaluatorSuite:
TopologyMapperSuite:
ShuffleNettySuite:
CountEvaluatorSuite:
SingleFileEventLogFileReaderSuite:
ChromeUISeleniumSuite:
KryoSerializerSuite:
BlacklistTrackerSuite:
FailureSuite:
PartitionwiseSampledRDDSuite:
JdbcRDDSuite:
FileSuite:
ShuffleOldFetchProtocolSuite:
SparkContextSuite:
SourceConfigSuite:
DiskBlockObjectWriterSuite:
ThreadingSuite:
PythonRDDSuite:
ShuffleDependencySuite:
ResourceInformationSuite:
JVMObjectTrackerSuite:
ClosureCleanerSuite2:
PartitionPruningRDDSuite:
SimpleDateParamSuite:
StorageSuite:
CausedBySuite:
JavaUtilsSuite:
EventLogFileCompactorSuite:
FileAppenderSuite:
BypassMergeSortShuffleWriterSuite:
DistributedSuite:
FutureActionSuite:
LocalCheckpointSuite:
SingleEventLogFileWriterSuite:
WorkerWatcherSuite:
ExternalShuffleServiceDbSuite:
CoarseGrainedExecutorBackendSuite:
NettyRpcEnvSuite:
ResourceDiscoveryPluginSuite:
PagedTableSuite:
ClientSuite:
BlockIdSuite:
PrometheusServletSuite:
PartiallyUnrolledIteratorSuite:
KryoSerializerResizableOutputSuite:
BlockManagerReplicationSuite:
BarrierTaskContextSuite:
BlockStoreShuffleReaderSuite:
WholeTextFileRecordReaderSuite:
SubmitRestProtocolSuite:
ChromeUIHistoryServerSuite:
FlatmapIteratorSuite:
SizeEstimatorSuite:
ElementTrackingStoreSuite:
WorkerDecommissionSuite:
PipedRDDSuite:
AccumulatorV2Suite:
InboxSuite:
MasterWebUISuite:
RadixSortSuite:
DiskBlockManagerSuite:
WorkerArgumentsTest:
StatusTrackerSuite:
PrimitiveKeyOpenHashMapSuite:
ApplicationCacheSuite:
StandaloneDynamicAllocationSuite:
ResourceUtilsSuite:
ExternalClusterManagerSuite:
LogUrlsStandaloneSuite:
AppClientSuite:
InternalAccumulatorSuite:
JsonProtocolSuite:
BroadcastSuite:
TaskSetBlacklistSuite:
SerializerPropertiesSuite:
EventLoopSuite:
ZippedPartitionsSuite:
DiskStoreSuite:
LiveEntitySuite:
DoubleRDDSuite:
AppStatusStoreSuite:
SorterSuite:
MedianHeapSuite:
PoolSuite:
DistributionSuite:
ContextCleanerSuite:
JsonProtocolSuite:
HeartbeatReceiverSuite:
AccumulatorSourceSuite:
UninterruptibleThreadRunnerSuite:
ExecutorResourceInfoSuite:
ReplayListenerSuite:
UIUtilsSuite:
MutableURLClassLoaderSuite:
CheckpointSuite:
AppStatusUtilsSuite:
WorkerDecommissionExtendedSuite:
IndexShuffleBlockResolverSuite:
TaskResultGetterSuite:
TopologyAwareBlockReplicationPolicyBehavior:
PersistenceEngineSuite:
MasterSuite:
ExternalAppendOnlyMapSuite:
AdaptiveSchedulingSuite:
GenericAvroSerializerSuite:
BlacklistIntegrationSuite:
AppStatusListenerSuite:
BoundedPriorityQueueSuite:
ProactiveClosureSerializationSuite:
Run completed in 7 seconds, 343 milliseconds.
Total number of tests run: 0
Suites: completed 262, aborted 0
Tests: succeeded 0, failed 0, canceled 0, ignored 0, pending 0
No tests were executed.
[INFO] 
[INFO] --- maven-jar-plugin:3.1.2:test-jar (prepare-test-jar) @ spark-core_2.12 ---
[INFO] Building jar: /home/jenkins/workspace/spark-master-test-k8s/core/target/spark-core_2.12-3.1.0-SNAPSHOT-tests.jar
[INFO] 
[INFO] --- maven-jar-plugin:3.1.2:jar (default-jar) @ spark-core_2.12 ---
[INFO] Building jar: /home/jenkins/workspace/spark-master-test-k8s/core/target/spark-core_2.12-3.1.0-SNAPSHOT.jar
[INFO] 
[INFO] --- maven-site-plugin:3.5.1:attach-descriptor (attach-descriptor) @ spark-core_2.12 ---
[INFO] 
[INFO] --- maven-dependency-plugin:3.1.1:copy-dependencies (copy-dependencies) @ spark-core_2.12 ---
[INFO] 
[INFO] --- maven-shade-plugin:3.2.1:shade (default) @ spark-core_2.12 ---
[INFO] Excluding com.thoughtworks.paranamer:paranamer:jar:2.8 from the shaded jar.
[INFO] Excluding org.apache.avro:avro:jar:1.8.2 from the shaded jar.
[INFO] Excluding org.codehaus.jackson:jackson-core-asl:jar:1.9.13 from the shaded jar.
[INFO] Excluding org.codehaus.jackson:jackson-mapper-asl:jar:1.9.13 from the shaded jar.
[INFO] Excluding org.apache.commons:commons-compress:jar:1.8.1 from the shaded jar.
[INFO] Excluding org.tukaani:xz:jar:1.5 from the shaded jar.
[INFO] Excluding org.apache.avro:avro-mapred:jar:hadoop2:1.8.2 from the shaded jar.
[INFO] Excluding org.apache.avro:avro-ipc:jar:1.8.2 from the shaded jar.
[INFO] Excluding commons-codec:commons-codec:jar:1.10 from the shaded jar.
[INFO] Excluding com.twitter:chill_2.12:jar:0.9.5 from the shaded jar.
[INFO] Excluding com.esotericsoftware:kryo-shaded:jar:4.0.2 from the shaded jar.
[INFO] Excluding com.esotericsoftware:minlog:jar:1.3.0 from the shaded jar.
[INFO] Excluding com.twitter:chill-java:jar:0.9.5 from the shaded jar.
[INFO] Excluding org.apache.xbean:xbean-asm7-shaded:jar:4.15 from the shaded jar.
[INFO] Excluding org.apache.hadoop:hadoop-client:jar:2.7.4 from the shaded jar.
[INFO] Excluding org.apache.hadoop:hadoop-common:jar:2.7.4 from the shaded jar.
[INFO] Excluding commons-cli:commons-cli:jar:1.2 from the shaded jar.
[INFO] Excluding xmlenc:xmlenc:jar:0.52 from the shaded jar.
[INFO] Excluding commons-httpclient:commons-httpclient:jar:3.1 from the shaded jar.
[INFO] Excluding commons-collections:commons-collections:jar:3.2.2 from the shaded jar.
[INFO] Excluding org.mortbay.jetty:jetty-sslengine:jar:6.1.26 from the shaded jar.
[INFO] Excluding javax.servlet.jsp:jsp-api:jar:2.1 from the shaded jar.
[INFO] Excluding commons-lang:commons-lang:jar:2.6 from the shaded jar.
[INFO] Excluding commons-configuration:commons-configuration:jar:1.6 from the shaded jar.
[INFO] Excluding commons-digester:commons-digester:jar:1.8 from the shaded jar.
[INFO] Excluding commons-beanutils:commons-beanutils:jar:1.9.4 from the shaded jar.
[INFO] Excluding com.google.protobuf:protobuf-java:jar:2.5.0 from the shaded jar.
[INFO] Excluding com.google.code.gson:gson:jar:2.2.4 from the shaded jar.
[INFO] Excluding org.apache.hadoop:hadoop-auth:jar:2.7.4 from the shaded jar.
[INFO] Excluding org.apache.curator:curator-client:jar:2.7.1 from the shaded jar.
[INFO] Excluding org.apache.htrace:htrace-core:jar:3.1.0-incubating from the shaded jar.
[INFO] Excluding org.apache.hadoop:hadoop-hdfs:jar:2.7.4 from the shaded jar.
[INFO] Excluding org.mortbay.jetty:jetty-util:jar:6.1.26 from the shaded jar.
[INFO] Excluding xerces:xercesImpl:jar:2.12.0 from the shaded jar.
[INFO] Excluding org.apache.hadoop:hadoop-mapreduce-client-app:jar:2.7.4 from the shaded jar.
[INFO] Excluding org.apache.hadoop:hadoop-mapreduce-client-common:jar:2.7.4 from the shaded jar.
[INFO] Excluding org.apache.hadoop:hadoop-yarn-client:jar:2.7.4 from the shaded jar.
[INFO] Excluding org.apache.hadoop:hadoop-yarn-server-common:jar:2.7.4 from the shaded jar.
[INFO] Excluding org.apache.hadoop:hadoop-mapreduce-client-shuffle:jar:2.7.4 from the shaded jar.
[INFO] Excluding org.apache.hadoop:hadoop-yarn-api:jar:2.7.4 from the shaded jar.
[INFO] Excluding org.apache.hadoop:hadoop-mapreduce-client-core:jar:2.7.4 from the shaded jar.
[INFO] Excluding org.apache.hadoop:hadoop-yarn-common:jar:2.7.4 from the shaded jar.
[INFO] Excluding javax.xml.bind:jaxb-api:jar:2.2.2 from the shaded jar.
[INFO] Excluding javax.xml.stream:stax-api:jar:1.0-2 from the shaded jar.
[INFO] Excluding org.codehaus.jackson:jackson-jaxrs:jar:1.9.13 from the shaded jar.
[INFO] Excluding org.codehaus.jackson:jackson-xc:jar:1.9.13 from the shaded jar.
[INFO] Excluding org.apache.hadoop:hadoop-mapreduce-client-jobclient:jar:2.7.4 from the shaded jar.
[INFO] Excluding org.apache.hadoop:hadoop-annotations:jar:2.7.4 from the shaded jar.
[INFO] Excluding org.apache.spark:spark-launcher_2.12:jar:3.1.0-SNAPSHOT from the shaded jar.
[INFO] Excluding org.apache.spark:spark-kvstore_2.12:jar:3.1.0-SNAPSHOT from the shaded jar.
[INFO] Excluding org.fusesource.leveldbjni:leveldbjni-all:jar:1.8 from the shaded jar.
[INFO] Excluding com.fasterxml.jackson.core:jackson-core:jar:2.10.0 from the shaded jar.
[INFO] Excluding com.fasterxml.jackson.core:jackson-annotations:jar:2.10.0 from the shaded jar.
[INFO] Excluding org.apache.spark:spark-network-common_2.12:jar:3.1.0-SNAPSHOT from the shaded jar.
[INFO] Excluding org.apache.spark:spark-network-shuffle_2.12:jar:3.1.0-SNAPSHOT from the shaded jar.
[INFO] Excluding org.apache.spark:spark-unsafe_2.12:jar:3.1.0-SNAPSHOT from the shaded jar.
[INFO] Excluding javax.activation:activation:jar:1.1.1 from the shaded jar.
[INFO] Excluding org.apache.curator:curator-recipes:jar:2.7.1 from the shaded jar.
[INFO] Excluding org.apache.curator:curator-framework:jar:2.7.1 from the shaded jar.
[INFO] Excluding org.apache.zookeeper:zookeeper:jar:3.4.14 from the shaded jar.
[INFO] Excluding org.apache.yetus:audience-annotations:jar:0.5.0 from the shaded jar.
[INFO] Including org.eclipse.jetty:jetty-plus:jar:9.4.28.v20200408 in the shaded jar.
[INFO] Excluding org.eclipse.jetty:jetty-jndi:jar:9.4.28.v20200408 from the shaded jar.
[INFO] Including org.eclipse.jetty:jetty-security:jar:9.4.28.v20200408 in the shaded jar.
[INFO] Including org.eclipse.jetty:jetty-util:jar:9.4.28.v20200408 in the shaded jar.
[INFO] Including org.eclipse.jetty:jetty-server:jar:9.4.28.v20200408 in the shaded jar.
[INFO] Including org.eclipse.jetty:jetty-io:jar:9.4.28.v20200408 in the shaded jar.
[INFO] Including org.eclipse.jetty:jetty-http:jar:9.4.28.v20200408 in the shaded jar.
[INFO] Including org.eclipse.jetty:jetty-continuation:jar:9.4.28.v20200408 in the shaded jar.
[INFO] Including org.eclipse.jetty:jetty-servlet:jar:9.4.28.v20200408 in the shaded jar.
[INFO] Including org.eclipse.jetty:jetty-proxy:jar:9.4.28.v20200408 in the shaded jar.
[INFO] Including org.eclipse.jetty:jetty-client:jar:9.4.28.v20200408 in the shaded jar.
[INFO] Including org.eclipse.jetty:jetty-servlets:jar:9.4.28.v20200408 in the shaded jar.
[INFO] Excluding javax.servlet:javax.servlet-api:jar:3.1.0 from the shaded jar.
[INFO] Excluding org.apache.commons:commons-lang3:jar:3.10 from the shaded jar.
[INFO] Excluding org.apache.commons:commons-math3:jar:3.4.1 from the shaded jar.
[INFO] Excluding org.apache.commons:commons-text:jar:1.6 from the shaded jar.
[INFO] Excluding com.google.code.findbugs:jsr305:jar:3.0.0 from the shaded jar.
[INFO] Excluding org.slf4j:slf4j-api:jar:1.7.30 from the shaded jar.
[INFO] Excluding org.slf4j:jul-to-slf4j:jar:1.7.30 from the shaded jar.
[INFO] Excluding org.slf4j:jcl-over-slf4j:jar:1.7.30 from the shaded jar.
[INFO] Excluding log4j:log4j:jar:1.2.17 from the shaded jar.
[INFO] Excluding org.slf4j:slf4j-log4j12:jar:1.7.30 from the shaded jar.
[INFO] Excluding com.ning:compress-lzf:jar:1.0.3 from the shaded jar.
[INFO] Excluding org.xerial.snappy:snappy-java:jar:1.1.7.5 from the shaded jar.
[INFO] Excluding org.lz4:lz4-java:jar:1.7.1 from the shaded jar.
[INFO] Excluding com.github.luben:zstd-jni:jar:1.4.5-4 from the shaded jar.
[INFO] Excluding org.roaringbitmap:RoaringBitmap:jar:0.9.0 from the shaded jar.
[INFO] Excluding org.roaringbitmap:shims:jar:0.9.0 from the shaded jar.
[INFO] Excluding commons-net:commons-net:jar:3.1 from the shaded jar.
[INFO] Excluding org.scala-lang.modules:scala-xml_2.12:jar:1.2.0 from the shaded jar.
[INFO] Excluding org.scala-lang:scala-library:jar:2.12.10 from the shaded jar.
[INFO] Excluding org.scala-lang:scala-reflect:jar:2.12.10 from the shaded jar.
[INFO] Excluding org.json4s:json4s-jackson_2.12:jar:3.7.0-M5 from the shaded jar.
[INFO] Excluding org.json4s:json4s-core_2.12:jar:3.7.0-M5 from the shaded jar.
[INFO] Excluding org.json4s:json4s-ast_2.12:jar:3.7.0-M5 from the shaded jar.
[INFO] Excluding org.json4s:json4s-scalap_2.12:jar:3.7.0-M5 from the shaded jar.
[INFO] Excluding org.glassfish.jersey.core:jersey-client:jar:2.30 from the shaded jar.
[INFO] Excluding jakarta.ws.rs:jakarta.ws.rs-api:jar:2.1.6 from the shaded jar.
[INFO] Excluding org.glassfish.hk2.external:jakarta.inject:jar:2.6.1 from the shaded jar.
[INFO] Excluding org.glassfish.jersey.core:jersey-common:jar:2.30 from the shaded jar.
[INFO] Excluding jakarta.annotation:jakarta.annotation-api:jar:1.3.5 from the shaded jar.
[INFO] Excluding org.glassfish.hk2:osgi-resource-locator:jar:1.0.3 from the shaded jar.
[INFO] Excluding org.glassfish.jersey.core:jersey-server:jar:2.30 from the shaded jar.
[INFO] Excluding org.glassfish.jersey.media:jersey-media-jaxb:jar:2.30 from the shaded jar.
[INFO] Excluding jakarta.validation:jakarta.validation-api:jar:2.0.2 from the shaded jar.
[INFO] Excluding org.glassfish.jersey.containers:jersey-container-servlet:jar:2.30 from the shaded jar.
[INFO] Excluding org.glassfish.jersey.containers:jersey-container-servlet-core:jar:2.30 from the shaded jar.
[INFO] Excluding org.glassfish.jersey.inject:jersey-hk2:jar:2.30 from the shaded jar.
[INFO] Excluding org.glassfish.hk2:hk2-locator:jar:2.6.1 from the shaded jar.
[INFO] Excluding org.glassfish.hk2.external:aopalliance-repackaged:jar:2.6.1 from the shaded jar.
[INFO] Excluding org.glassfish.hk2:hk2-api:jar:2.6.1 from the shaded jar.
[INFO] Excluding org.glassfish.hk2:hk2-utils:jar:2.6.1 from the shaded jar.
[INFO] Excluding org.javassist:javassist:jar:3.25.0-GA from the shaded jar.
[INFO] Excluding io.netty:netty-all:jar:4.1.51.Final from the shaded jar.
[INFO] Excluding com.clearspring.analytics:stream:jar:2.9.6 from the shaded jar.
[INFO] Excluding io.dropwizard.metrics:metrics-core:jar:4.1.1 from the shaded jar.
[INFO] Excluding io.dropwizard.metrics:metrics-jvm:jar:4.1.1 from the shaded jar.
[INFO] Excluding io.dropwizard.metrics:metrics-json:jar:4.1.1 from the shaded jar.
[INFO] Excluding io.dropwizard.metrics:metrics-graphite:jar:4.1.1 from the shaded jar.
[INFO] Excluding io.dropwizard.metrics:metrics-jmx:jar:4.1.1 from the shaded jar.
[INFO] Excluding com.fasterxml.jackson.core:jackson-databind:jar:2.10.0 from the shaded jar.
[INFO] Excluding com.fasterxml.jackson.module:jackson-module-scala_2.12:jar:2.10.0 from the shaded jar.
[INFO] Excluding com.fasterxml.jackson.module:jackson-module-paranamer:jar:2.10.0 from the shaded jar.
[INFO] Excluding org.apache.ivy:ivy:jar:2.4.0 from the shaded jar.
[INFO] Excluding oro:oro:jar:2.0.8 from the shaded jar.
[INFO] Excluding commons-io:commons-io:jar:2.4 from the shaded jar.
[INFO] Excluding org.objenesis:objenesis:jar:2.6 from the shaded jar.
[INFO] Excluding org.apache.directory.server:apacheds-i18n:jar:2.0.0-M15 from the shaded jar.
[INFO] Excluding org.apache.directory.api:api-i18n:jar:1.0.0-M20 from the shaded jar.
[INFO] Excluding org.apache.directory.api:api-asn1-api:jar:1.0.0-M20 from the shaded jar.
[INFO] Excluding org.apache.directory.api:api-ldap-model:jar:1.0.0-M20 from the shaded jar.
[INFO] Excluding org.apache.directory.api:api-util:jar:1.0.0-M20 from the shaded jar.
[INFO] Excluding org.apache.mina:mina-core:jar:2.0.7 from the shaded jar.
[INFO] Excluding net.sf.ehcache:ehcache-core:jar:2.4.4 from the shaded jar.
[INFO] Excluding org.apache.directory.server:apacheds-kerberos-codec:jar:2.0.0-M15 from the shaded jar.
[INFO] Excluding antlr:antlr:jar:2.7.7 from the shaded jar.
[INFO] Excluding org.apache.directory.api:api-asn1-ber:jar:1.0.0-M20 from the shaded jar.
[INFO] Excluding net.razorvine:pyrolite:jar:4.30 from the shaded jar.
[INFO] Excluding net.sf.py4j:py4j:jar:0.10.9 from the shaded jar.
[INFO] Excluding org.apache.spark:spark-tags_2.12:jar:3.1.0-SNAPSHOT from the shaded jar.
[INFO] Excluding org.apache.commons:commons-crypto:jar:1.0.0 from the shaded jar.
[INFO] Including org.spark-project.spark:unused:jar:1.0.0 in the shaded jar.
[INFO] Replacing original artifact with shaded artifact.
[INFO] Replacing /home/jenkins/workspace/spark-master-test-k8s/core/target/spark-core_2.12-3.1.0-SNAPSHOT.jar with /home/jenkins/workspace/spark-master-test-k8s/core/target/spark-core_2.12-3.1.0-SNAPSHOT-shaded.jar
[INFO] Dependency-reduced POM written at: /home/jenkins/workspace/spark-master-test-k8s/core/dependency-reduced-pom.xml
[INFO] 
[INFO] --- maven-source-plugin:3.1.0:jar-no-fork (create-source-jar) @ spark-core_2.12 ---
[INFO] Building jar: /home/jenkins/workspace/spark-master-test-k8s/core/target/spark-core_2.12-3.1.0-SNAPSHOT-sources.jar
[INFO] 
[INFO] --- maven-source-plugin:3.1.0:test-jar-no-fork (create-source-jar) @ spark-core_2.12 ---
[INFO] Building jar: /home/jenkins/workspace/spark-master-test-k8s/core/target/spark-core_2.12-3.1.0-SNAPSHOT-test-sources.jar
[INFO] 
[INFO] ------< org.apache.spark:spark-kubernetes-integration-tests_2.12 >------
[INFO] Building Spark Project Kubernetes Integration Tests 3.1.0-SNAPSHOT [9/9]
[INFO] --------------------------------[ jar ]---------------------------------
[INFO] 
[INFO] --- maven-enforcer-plugin:3.0.0-M2:enforce (enforce-versions) @ spark-kubernetes-integration-tests_2.12 ---
[INFO] 
[INFO] --- maven-enforcer-plugin:3.0.0-M2:enforce (enforce-no-duplicate-dependencies) @ spark-kubernetes-integration-tests_2.12 ---
[INFO] 
[INFO] --- mvn-scalafmt_2.12:1.0.3:format (default) @ spark-kubernetes-integration-tests_2.12 ---
[WARNING] format.skipSources set, ignoring main directories
[WARNING] format.skipTestSources set, ignoring validateOnly directories
[WARNING] No sources specified, skipping formatting
[INFO] 
[INFO] --- scala-maven-plugin:4.3.0:add-source (eclipse-add-source) @ spark-kubernetes-integration-tests_2.12 ---
[INFO] Add Source directory: /home/jenkins/workspace/spark-master-test-k8s/resource-managers/kubernetes/integration-tests/src/main/scala
[INFO] Add Test Source directory: /home/jenkins/workspace/spark-master-test-k8s/resource-managers/kubernetes/integration-tests/src/test/scala
[INFO] 
[INFO] --- maven-dependency-plugin:3.1.1:build-classpath (default-cli) @ spark-kubernetes-integration-tests_2.12 ---
[INFO] Dependencies classpath:
/home/jenkins/.m2/repository/com/clearspring/analytics/stream/2.9.6/stream-2.9.6.jar:/home/jenkins/.m2/repository/org/apache/hadoop/hadoop-mapreduce-client-common/2.7.4/hadoop-mapreduce-client-common-2.7.4.jar:/home/jenkins/.m2/repository/org/glassfish/hk2/external/jakarta.inject/2.6.1/jakarta.inject-2.6.1.jar:/home/jenkins/.m2/repository/org/glassfish/hk2/hk2-locator/2.6.1/hk2-locator-2.6.1.jar:/home/jenkins/.m2/repository/org/apache/htrace/htrace-core/3.1.0-incubating/htrace-core-3.1.0-incubating.jar:/home/jenkins/.m2/repository/com/google/protobuf/protobuf-java/2.5.0/protobuf-java-2.5.0.jar:/home/jenkins/.m2/repository/org/apache/hadoop/hadoop-mapreduce-client-jobclient/2.7.4/hadoop-mapreduce-client-jobclient-2.7.4.jar:/home/jenkins/.m2/repository/org/slf4j/slf4j-log4j12/1.7.30/slf4j-log4j12-1.7.30.jar:/home/jenkins/.m2/repository/org/glassfish/hk2/hk2-utils/2.6.1/hk2-utils-2.6.1.jar:/home/jenkins/.m2/repository/org/apache/commons/commons-compress/1.8.1/commons-compress-1.8.1.jar:/home/jenkins/.m2/repository/com/thoughtworks/paranamer/paranamer/2.8/paranamer-2.8.jar:/home/jenkins/.m2/repository/io/netty/netty-all/4.1.51.Final/netty-all-4.1.51.Final.jar:/home/jenkins/.m2/repository/com/fasterxml/jackson/core/jackson-annotations/2.10.0/jackson-annotations-2.10.0.jar:/home/jenkins/.m2/repository/org/apache/hadoop/hadoop-client/2.7.4/hadoop-client-2.7.4.jar:/home/jenkins/.m2/repository/com/google/code/findbugs/jsr305/3.0.0/jsr305-3.0.0.jar:/home/jenkins/.m2/repository/org/objenesis/objenesis/2.6/objenesis-2.6.jar:/home/jenkins/.m2/repository/xml-apis/xml-apis/1.4.01/xml-apis-1.4.01.jar:/home/jenkins/.m2/repository/org/fusesource/leveldbjni/leveldbjni-all/1.8/leveldbjni-all-1.8.jar:/home/jenkins/.m2/repository/org/apache/commons/commons-text/1.6/commons-text-1.6.jar:/home/jenkins/.m2/repository/org/glassfish/jersey/media/jersey-media-jaxb/2.30/jersey-media-jaxb-2.30.jar:/home/jenkins/.m2/repository/com/fasterxml/jackson/module/jackson-module-scala_2.12/2.10.0/jackson-module-scala_2.12-2.10.0.jar:/home/jenkins/.m2/repository/com/fasterxml/jackson/core/jackson-core/2.10.0/jackson-core-2.10.0.jar:/home/jenkins/.m2/repository/jakarta/ws/rs/jakarta.ws.rs-api/2.1.6/jakarta.ws.rs-api-2.1.6.jar:/home/jenkins/.m2/repository/org/tukaani/xz/1.5/xz-1.5.jar:/home/jenkins/.m2/repository/org/glassfish/hk2/external/aopalliance-repackaged/2.6.1/aopalliance-repackaged-2.6.1.jar:/home/jenkins/.m2/repository/io/fabric8/kubernetes-model/4.9.2/kubernetes-model-4.9.2.jar:/home/jenkins/.m2/repository/org/json4s/json4s-core_2.12/3.7.0-M5/json4s-core_2.12-3.7.0-M5.jar:/home/jenkins/.m2/repository/org/apache/commons/commons-crypto/1.0.0/commons-crypto-1.0.0.jar:/home/jenkins/.m2/repository/org/apache/hadoop/hadoop-common/2.7.4/hadoop-common-2.7.4.jar:/home/jenkins/.m2/repository/commons-io/commons-io/2.4/commons-io-2.4.jar:/home/jenkins/.m2/repository/com/fasterxml/jackson/module/jackson-module-jaxb-annotations/2.10.0/jackson-module-jaxb-annotations-2.10.0.jar:/home/jenkins/.m2/repository/org/codehaus/jackson/jackson-jaxrs/1.9.13/jackson-jaxrs-1.9.13.jar:/home/jenkins/.m2/repository/com/fasterxml/jackson/module/jackson-module-paranamer/2.10.0/jackson-module-paranamer-2.10.0.jar:/home/jenkins/.m2/repository/org/apache/hadoop/hadoop-yarn-client/2.7.4/hadoop-yarn-client-2.7.4.jar:/home/jenkins/.m2/repository/org/scala-lang/scala-library/2.12.10/scala-library-2.12.10.jar:/home/jenkins/.m2/repository/com/esotericsoftware/kryo-shaded/4.0.2/kryo-shaded-4.0.2.jar:/home/jenkins/.m2/repository/com/esotericsoftware/minlog/1.3.0/minlog-1.3.0.jar:/home/jenkins/workspace/spark-master-test-k8s/common/network-common/target/spark-network-common_2.12-3.1.0-SNAPSHOT.jar:/home/jenkins/.m2/repository/org/codehaus/jackson/jackson-core-asl/1.9.13/jackson-core-asl-1.9.13.jar:/home/jenkins/.m2/repository/xerces/xercesImpl/2.12.0/xercesImpl-2.12.0.jar:/home/jenkins/.m2/repository/net/sf/py4j/py4j/0.10.9/py4j-0.10.9.jar:/home/jenkins/.m2/repository/com/github/mifmif/generex/1.0.2/generex-1.0.2.jar:/home/jenkins/.m2/repository/com/twitter/chill-java/0.9.5/chill-java-0.9.5.jar:/home/jenkins/workspace/spark-master-test-k8s/common/network-shuffle/target/spark-network-shuffle_2.12-3.1.0-SNAPSHOT.jar:/home/jenkins/.m2/repository/org/slf4j/jul-to-slf4j/1.7.30/jul-to-slf4j-1.7.30.jar:/home/jenkins/.m2/repository/org/json4s/json4s-scalap_2.12/3.7.0-M5/json4s-scalap_2.12-3.7.0-M5.jar:/home/jenkins/.m2/repository/com/squareup/okhttp3/logging-interceptor/3.12.6/logging-interceptor-3.12.6.jar:/home/jenkins/.m2/repository/com/fasterxml/jackson/dataformat/jackson-dataformat-yaml/2.10.3/jackson-dataformat-yaml-2.10.3.jar:/home/jenkins/.m2/repository/commons-net/commons-net/3.1/commons-net-3.1.jar:/home/jenkins/workspace/spark-master-test-k8s/common/tags/target/spark-tags_2.12-3.1.0-SNAPSHOT.jar:/home/jenkins/.m2/repository/org/lz4/lz4-java/1.7.1/lz4-java-1.7.1.jar:/home/jenkins/.m2/repository/javax/xml/bind/jaxb-api/2.2.2/jaxb-api-2.2.2.jar:/home/jenkins/.m2/repository/org/xerial/snappy/snappy-java/1.1.7.5/snappy-java-1.1.7.5.jar:/home/jenkins/.m2/repository/org/json4s/json4s-jackson_2.12/3.7.0-M5/json4s-jackson_2.12-3.7.0-M5.jar:/home/jenkins/.m2/repository/com/github/luben/zstd-jni/1.4.5-4/zstd-jni-1.4.5-4.jar:/home/jenkins/.m2/repository/commons-lang/commons-lang/2.6/commons-lang-2.6.jar:/home/jenkins/.m2/repository/org/mortbay/jetty/jetty-sslengine/6.1.26/jetty-sslengine-6.1.26.jar:/home/jenkins/.m2/repository/io/dropwizard/metrics/metrics-graphite/4.1.1/metrics-graphite-4.1.1.jar:/home/jenkins/.m2/repository/io/fabric8/kubernetes-model-common/4.9.2/kubernetes-model-common-4.9.2.jar:/home/jenkins/.m2/repository/org/apache/hadoop/hadoop-auth/2.7.4/hadoop-auth-2.7.4.jar:/home/jenkins/.m2/repository/javax/activation/activation/1.1.1/activation-1.1.1.jar:/home/jenkins/.m2/repository/org/apache/hadoop/hadoop-mapreduce-client-shuffle/2.7.4/hadoop-mapreduce-client-shuffle-2.7.4.jar:/home/jenkins/.m2/repository/commons-codec/commons-codec/1.10/commons-codec-1.10.jar:/home/jenkins/.m2/repository/org/apache/httpcomponents/httpcore/4.4.12/httpcore-4.4.12.jar:/home/jenkins/.m2/repository/io/fabric8/zjsonpatch/0.3.0/zjsonpatch-0.3.0.jar:/home/jenkins/.m2/repository/commons-beanutils/commons-beanutils/1.9.4/commons-beanutils-1.9.4.jar:/home/jenkins/.m2/repository/org/apache/ivy/ivy/2.4.0/ivy-2.4.0.jar:/home/jenkins/.m2/repository/com/squareup/okhttp3/okhttp/3.12.6/okhttp-3.12.6.jar:/home/jenkins/.m2/repository/org/apache/hadoop/hadoop-mapreduce-client-core/2.7.4/hadoop-mapreduce-client-core-2.7.4.jar:/home/jenkins/workspace/spark-master-test-k8s/common/kvstore/target/spark-kvstore_2.12-3.1.0-SNAPSHOT.jar:/home/jenkins/.m2/repository/javax/servlet/javax.servlet-api/3.1.0/javax.servlet-api-3.1.0.jar:/home/jenkins/.m2/repository/com/twitter/chill_2.12/0.9.5/chill_2.12-0.9.5.jar:/home/jenkins/.m2/repository/org/apache/commons/commons-math3/3.4.1/commons-math3-3.4.1.jar:/home/jenkins/workspace/spark-master-test-k8s/common/tags/target/spark-tags_2.12-3.1.0-SNAPSHOT-tests.jar:/home/jenkins/.m2/repository/net/razorvine/pyrolite/4.30/pyrolite-4.30.jar:/home/jenkins/.m2/repository/javax/xml/stream/stax-api/1.0-2/stax-api-1.0-2.jar:/home/jenkins/.m2/repository/jakarta/validation/jakarta.validation-api/2.0.2/jakarta.validation-api-2.0.2.jar:/home/jenkins/.m2/repository/org/codehaus/jackson/jackson-xc/1.9.13/jackson-xc-1.9.13.jar:/home/jenkins/.m2/repository/org/glassfish/jersey/inject/jersey-hk2/2.30/jersey-hk2-2.30.jar:/home/jenkins/.m2/repository/org/json4s/json4s-ast_2.12/3.7.0-M5/json4s-ast_2.12-3.7.0-M5.jar:/home/jenkins/.m2/repository/org/glassfish/jersey/core/jersey-common/2.30/jersey-common-2.30.jar:/home/jenkins/.m2/repository/oro/oro/2.0.8/oro-2.0.8.jar:/home/jenkins/.m2/repository/org/apache/avro/avro-mapred/1.8.2/avro-mapred-1.8.2-hadoop2.jar:/home/jenkins/.m2/repository/org/scala-lang/scala-reflect/2.12.10/scala-reflect-2.12.10.jar:/home/jenkins/.m2/repository/log4j/log4j/1.2.17/log4j-1.2.17.jar:/home/jenkins/workspace/spark-master-test-k8s/core/target/spark-core_2.12-3.1.0-SNAPSHOT.jar:/home/jenkins/.m2/repository/org/apache/xbean/xbean-asm7-shaded/4.15/xbean-asm7-shaded-4.15.jar:/home/jenkins/.m2/repository/org/apache/curator/curator-framework/2.7.1/curator-framework-2.7.1.jar:/home/jenkins/.m2/repository/org/apache/curator/curator-recipes/2.7.1/curator-recipes-2.7.1.jar:/home/jenkins/.m2/repository/io/dropwizard/metrics/metrics-core/4.1.1/metrics-core-4.1.1.jar:/home/jenkins/.m2/repository/com/squareup/okio/okio/1.15.0/okio-1.15.0.jar:/home/jenkins/.m2/repository/org/apache/avro/avro/1.8.2/avro-1.8.2.jar:/home/jenkins/.m2/repository/org/yaml/snakeyaml/1.24/snakeyaml-1.24.jar:/home/jenkins/.m2/repository/org/apache/directory/server/apacheds-kerberos-codec/2.0.0-M15/apacheds-kerberos-codec-2.0.0-M15.jar:/home/jenkins/.m2/repository/io/dropwizard/metrics/metrics-json/4.1.1/metrics-json-4.1.1.jar:/home/jenkins/.m2/repository/org/glassfish/hk2/hk2-api/2.6.1/hk2-api-2.6.1.jar:/home/jenkins/.m2/repository/org/apache/zookeeper/zookeeper/3.4.14/zookeeper-3.4.14.jar:/home/jenkins/.m2/repository/org/roaringbitmap/shims/0.9.0/shims-0.9.0.jar:/home/jenkins/.m2/repository/jakarta/annotation/jakarta.annotation-api/1.3.5/jakarta.annotation-api-1.3.5.jar:/home/jenkins/.m2/repository/org/glassfish/hk2/osgi-resource-locator/1.0.3/osgi-resource-locator-1.0.3.jar:/home/jenkins/.m2/repository/org/mortbay/jetty/jetty-util/6.1.26/jetty-util-6.1.26.jar:/home/jenkins/.m2/repository/org/apache/hadoop/hadoop-yarn-api/2.7.4/hadoop-yarn-api-2.7.4.jar:/home/jenkins/.m2/repository/org/apache/yetus/audience-annotations/0.5.0/audience-annotations-0.5.0.jar:/home/jenkins/.m2/repository/io/dropwizard/metrics/metrics-jvm/4.1.1/metrics-jvm-4.1.1.jar:/home/jenkins/.m2/repository/org/codehaus/jackson/jackson-mapper-asl/1.9.13/jackson-mapper-asl-1.9.13.jar:/home/jenkins/.m2/repository/javax/servlet/jsp/jsp-api/2.1/jsp-api-2.1.jar:/home/jenkins/.m2/repository/org/apache/hadoop/hadoop-yarn-server-common/2.7.4/hadoop-yarn-server-common-2.7.4.jar:/home/jenkins/.m2/repository/org/scala-lang/modules/scala-xml_2.12/1.2.0/scala-xml_2.12-1.2.0.jar:/home/jenkins/.m2/repository/org/apache/hadoop/hadoop-mapreduce-client-app/2.7.4/hadoop-mapreduce-client-app-2.7.4.jar:/home/jenkins/.m2/repository/jakarta/activation/jakarta.activation-api/1.2.1/jakarta.activation-api-1.2.1.jar:/home/jenkins/.m2/repository/org/apache/avro/avro-ipc/1.8.2/avro-ipc-1.8.2.jar:/home/jenkins/.m2/repository/xmlenc/xmlenc/0.52/xmlenc-0.52.jar:/home/jenkins/.m2/repository/org/slf4j/slf4j-api/1.7.30/slf4j-api-1.7.30.jar:/home/jenkins/.m2/repository/com/ning/compress-lzf/1.0.3/compress-lzf-1.0.3.jar:/home/jenkins/.m2/repository/org/glassfish/jersey/containers/jersey-container-servlet/2.30/jersey-container-servlet-2.30.jar:/home/jenkins/.m2/repository/org/apache/directory/api/api-util/1.0.0-M20/api-util-1.0.0-M20.jar:/home/jenkins/.m2/repository/com/fasterxml/jackson/core/jackson-databind/2.10.0/jackson-databind-2.10.0.jar:/home/jenkins/.m2/repository/org/apache/hadoop/hadoop-yarn-common/2.7.4/hadoop-yarn-common-2.7.4.jar:/home/jenkins/.m2/repository/com/fasterxml/jackson/datatype/jackson-datatype-jsr310/2.10.3/jackson-datatype-jsr310-2.10.3.jar:/home/jenkins/.m2/repository/com/google/code/gson/gson/2.2.4/gson-2.2.4.jar:/home/jenkins/.m2/repository/org/apache/directory/api/api-asn1-api/1.0.0-M20/api-asn1-api-1.0.0-M20.jar:/home/jenkins/.m2/repository/org/apache/hadoop/hadoop-annotations/2.7.4/hadoop-annotations-2.7.4.jar:/home/jenkins/.m2/repository/org/javassist/javassist/3.25.0-GA/javassist-3.25.0-GA.jar:/home/jenkins/.m2/repository/org/glassfish/jersey/containers/jersey-container-servlet-core/2.30/jersey-container-servlet-core-2.30.jar:/home/jenkins/.m2/repository/commons-configuration/commons-configuration/1.6/commons-configuration-1.6.jar:/home/jenkins/.m2/repository/commons-digester/commons-digester/1.8/commons-digester-1.8.jar:/home/jenkins/.m2/repository/org/apache/directory/server/apacheds-i18n/2.0.0-M15/apacheds-i18n-2.0.0-M15.jar:/home/jenkins/.m2/repository/io/fabric8/kubernetes-client/4.9.2/kubernetes-client-4.9.2.jar:/home/jenkins/.m2/repository/dk/brics/automaton/automaton/1.11-8/automaton-1.11-8.jar:/home/jenkins/.m2/repository/org/apache/commons/commons-lang3/3.10/commons-lang3-3.10.jar:/home/jenkins/.m2/repository/org/apache/curator/curator-client/2.7.1/curator-client-2.7.1.jar:/home/jenkins/.m2/repository/org/apache/hadoop/hadoop-hdfs/2.7.4/hadoop-hdfs-2.7.4.jar:/home/jenkins/.m2/repository/org/roaringbitmap/RoaringBitmap/0.9.0/RoaringBitmap-0.9.0.jar:/home/jenkins/.m2/repository/commons-cli/commons-cli/1.2/commons-cli-1.2.jar:/home/jenkins/.m2/repository/jakarta/xml/bind/jakarta.xml.bind-api/2.3.2/jakarta.xml.bind-api-2.3.2.jar:/home/jenkins/workspace/spark-master-test-k8s/common/unsafe/target/spark-unsafe_2.12-3.1.0-SNAPSHOT.jar:/home/jenkins/.m2/repository/org/slf4j/jcl-over-slf4j/1.7.30/jcl-over-slf4j-1.7.30.jar:/home/jenkins/.m2/repository/org/spark-project/spark/unused/1.0.0/unused-1.0.0.jar:/home/jenkins/.m2/repository/org/glassfish/jersey/core/jersey-server/2.30/jersey-server-2.30.jar:/home/jenkins/.m2/repository/io/dropwizard/metrics/metrics-jmx/4.1.1/metrics-jmx-4.1.1.jar:/home/jenkins/.m2/repository/org/glassfish/jersey/core/jersey-client/2.30/jersey-client-2.30.jar:/home/jenkins/.m2/repository/commons-collections/commons-collections/3.2.2/commons-collections-3.2.2.jar:/home/jenkins/workspace/spark-master-test-k8s/launcher/target/spark-launcher_2.12-3.1.0-SNAPSHOT.jar:/home/jenkins/.m2/repository/commons-logging/commons-logging/1.1.3/commons-logging-1.1.3.jar:/home/jenkins/.m2/repository/org/apache/httpcomponents/httpclient/4.5.6/httpclient-4.5.6.jar:/home/jenkins/.m2/repository/commons-httpclient/commons-httpclient/3.1/commons-httpclient-3.1.jar
[INFO] 
[INFO] --- maven-remote-resources-plugin:1.5:process (process-resource-bundles) @ spark-kubernetes-integration-tests_2.12 ---
[INFO] 
[INFO] --- maven-resources-plugin:2.7:resources (default-resources) @ spark-kubernetes-integration-tests_2.12 ---
[INFO] Using 'UTF-8' encoding to copy filtered resources.
[INFO] skip non existing resourceDirectory /home/jenkins/workspace/spark-master-test-k8s/resource-managers/kubernetes/integration-tests/src/main/resources
[INFO] Copying 3 resources
[INFO] 
[INFO] --- maven-compiler-plugin:3.8.1:compile (default-compile) @ spark-kubernetes-integration-tests_2.12 ---
[INFO] Not compiling main sources
[INFO] 
[INFO] --- scala-maven-plugin:4.3.0:compile (scala-compile-first) @ spark-kubernetes-integration-tests_2.12 ---
[INFO] compile in 0.0 s
[INFO] No sources to compile
[INFO] 
[INFO] --- maven-antrun-plugin:1.8:run (create-tmp-dir) @ spark-kubernetes-integration-tests_2.12 ---
[INFO] Executing tasks

main:
    [mkdir] Created dir: /home/jenkins/workspace/spark-master-test-k8s/resource-managers/kubernetes/integration-tests/target/tmp
[INFO] Executed tasks
[INFO] 
[INFO] --- maven-resources-plugin:2.7:testResources (default-testResources) @ spark-kubernetes-integration-tests_2.12 ---
[INFO] Using 'UTF-8' encoding to copy filtered resources.
[INFO] Copying 3 resources
[INFO] Copying 3 resources
[INFO] 
[INFO] --- maven-compiler-plugin:3.8.1:testCompile (default-testCompile) @ spark-kubernetes-integration-tests_2.12 ---
[INFO] Not compiling test sources
[INFO] 
[INFO] --- maven-dependency-plugin:3.1.1:build-classpath (generate-test-classpath) @ spark-kubernetes-integration-tests_2.12 ---
[INFO] Dependencies classpath:
/home/jenkins/.m2/repository/org/eclipse/jetty/jetty-servlets/9.4.28.v20200408/jetty-servlets-9.4.28.v20200408.jar:/home/jenkins/.m2/repository/org/glassfish/hk2/external/jakarta.inject/2.6.1/jakarta.inject-2.6.1.jar:/home/jenkins/.m2/repository/org/apache/htrace/htrace-core/3.1.0-incubating/htrace-core-3.1.0-incubating.jar:/home/jenkins/.m2/repository/com/google/protobuf/protobuf-java/2.5.0/protobuf-java-2.5.0.jar:/home/jenkins/.m2/repository/org/apache/hadoop/hadoop-mapreduce-client-jobclient/2.7.4/hadoop-mapreduce-client-jobclient-2.7.4.jar:/home/jenkins/.m2/repository/net/bytebuddy/byte-buddy-agent/1.9.10/byte-buddy-agent-1.9.10.jar:/home/jenkins/.m2/repository/org/apache/commons/commons-compress/1.8.1/commons-compress-1.8.1.jar:/home/jenkins/.m2/repository/com/google/code/findbugs/jsr305/3.0.0/jsr305-3.0.0.jar:/home/jenkins/.m2/repository/org/glassfish/jersey/media/jersey-media-jaxb/2.30/jersey-media-jaxb-2.30.jar:/home/jenkins/.m2/repository/com/fasterxml/jackson/module/jackson-module-scala_2.12/2.10.0/jackson-module-scala_2.12-2.10.0.jar:/home/jenkins/.m2/repository/org/json4s/json4s-core_2.12/3.7.0-M5/json4s-core_2.12-3.7.0-M5.jar:/home/jenkins/.m2/repository/org/scalatest/scalatest-refspec_2.12/3.2.0/scalatest-refspec_2.12-3.2.0.jar:/home/jenkins/.m2/repository/org/eclipse/jetty/jetty-io/9.4.28.v20200408/jetty-io-9.4.28.v20200408.jar:/home/jenkins/.m2/repository/org/apache/commons/commons-crypto/1.0.0/commons-crypto-1.0.0.jar:/home/jenkins/.m2/repository/com/fasterxml/jackson/module/jackson-module-jaxb-annotations/2.10.0/jackson-module-jaxb-annotations-2.10.0.jar:/home/jenkins/.m2/repository/org/codehaus/jackson/jackson-jaxrs/1.9.13/jackson-jaxrs-1.9.13.jar:/home/jenkins/.m2/repository/org/scala-lang/scala-library/2.12.10/scala-library-2.12.10.jar:/home/jenkins/.m2/repository/com/amazonaws/aws-java-sdk/1.7.4/aws-java-sdk-1.7.4.jar:/home/jenkins/workspace/spark-master-test-k8s/common/network-common/target/spark-network-common_2.12-3.1.0-SNAPSHOT.jar:/home/jenkins/.m2/repository/xerces/xercesImpl/2.12.0/xercesImpl-2.12.0.jar:/home/jenkins/.m2/repository/com/twitter/chill-java/0.9.5/chill-java-0.9.5.jar:/home/jenkins/.m2/repository/com/squareup/okhttp3/logging-interceptor/3.12.6/logging-interceptor-3.12.6.jar:/home/jenkins/.m2/repository/com/fasterxml/jackson/dataformat/jackson-dataformat-yaml/2.10.3/jackson-dataformat-yaml-2.10.3.jar:/home/jenkins/.m2/repository/commons-net/commons-net/3.1/commons-net-3.1.jar:/home/jenkins/workspace/spark-master-test-k8s/common/tags/target/spark-tags_2.12-3.1.0-SNAPSHOT.jar:/home/jenkins/.m2/repository/org/scalatestplus/scalatestplus-scalacheck_2.12/3.1.0.0-RC2/scalatestplus-scalacheck_2.12-3.1.0.0-RC2.jar:/home/jenkins/.m2/repository/commons-lang/commons-lang/2.6/commons-lang-2.6.jar:/home/jenkins/.m2/repository/joda-time/joda-time/2.10.5/joda-time-2.10.5.jar:/home/jenkins/.m2/repository/org/seleniumhq/selenium/selenium-edge-driver/3.141.59/selenium-edge-driver-3.141.59.jar:/home/jenkins/.m2/repository/io/fabric8/kubernetes-model-common/4.9.2/kubernetes-model-common-4.9.2.jar:/home/jenkins/.m2/repository/org/apache/commons/commons-exec/1.3/commons-exec-1.3.jar:/home/jenkins/.m2/repository/org/apache/hadoop/hadoop-auth/2.7.4/hadoop-auth-2.7.4.jar:/home/jenkins/.m2/repository/javax/activation/activation/1.1.1/activation-1.1.1.jar:/home/jenkins/.m2/repository/org/apache/hadoop/hadoop-mapreduce-client-shuffle/2.7.4/hadoop-mapreduce-client-shuffle-2.7.4.jar:/home/jenkins/.m2/repository/org/scalatest/scalatest-flatspec_2.12/3.2.0/scalatest-flatspec_2.12-3.2.0.jar:/home/jenkins/.m2/repository/commons-beanutils/commons-beanutils/1.9.4/commons-beanutils-1.9.4.jar:/home/jenkins/.m2/repository/org/apache/ivy/ivy/2.4.0/ivy-2.4.0.jar:/home/jenkins/.m2/repository/org/scalatest/scalatest-funspec_2.12/3.2.0/scalatest-funspec_2.12-3.2.0.jar:/home/jenkins/.m2/repository/org/scalatest/scalatest-shouldmatchers_2.12/3.2.0/scalatest-shouldmatchers_2.12-3.2.0.jar:/home/jenkins/.m2/repository/com/twitter/chill_2.12/0.9.5/chill_2.12-0.9.5.jar:/home/jenkins/workspace/spark-master-test-k8s/common/tags/target/spark-tags_2.12-3.1.0-SNAPSHOT-tests.jar:/home/jenkins/.m2/repository/net/razorvine/pyrolite/4.30/pyrolite-4.30.jar:/home/jenkins/.m2/repository/jakarta/validation/jakarta.validation-api/2.0.2/jakarta.validation-api-2.0.2.jar:/home/jenkins/.m2/repository/org/glassfish/jersey/inject/jersey-hk2/2.30/jersey-hk2-2.30.jar:/home/jenkins/.m2/repository/org/json4s/json4s-ast_2.12/3.7.0-M5/json4s-ast_2.12-3.7.0-M5.jar:/home/jenkins/.m2/repository/org/scalatest/scalatest-compatible/3.2.0/scalatest-compatible-3.2.0.jar:/home/jenkins/.m2/repository/net/bytebuddy/byte-buddy/1.9.10/byte-buddy-1.9.10.jar:/home/jenkins/.m2/repository/org/scalatest/scalatest-funsuite_2.12/3.2.0/scalatest-funsuite_2.12-3.2.0.jar:/home/jenkins/.m2/repository/org/apache/avro/avro-mapred/1.8.2/avro-mapred-1.8.2-hadoop2.jar:/home/jenkins/.m2/repository/org/scalatest/scalatest-featurespec_2.12/3.2.0/scalatest-featurespec_2.12-3.2.0.jar:/home/jenkins/.m2/repository/org/scala-lang/scala-reflect/2.12.10/scala-reflect-2.12.10.jar:/home/jenkins/.m2/repository/log4j/log4j/1.2.17/log4j-1.2.17.jar:/home/jenkins/.m2/repository/org/apache/curator/curator-framework/2.7.1/curator-framework-2.7.1.jar:/home/jenkins/.m2/repository/org/apache/curator/curator-recipes/2.7.1/curator-recipes-2.7.1.jar:/home/jenkins/.m2/repository/io/dropwizard/metrics/metrics-core/4.1.1/metrics-core-4.1.1.jar:/home/jenkins/.m2/repository/org/eclipse/jetty/jetty-proxy/9.4.28.v20200408/jetty-proxy-9.4.28.v20200408.jar:/home/jenkins/.m2/repository/org/apache/avro/avro/1.8.2/avro-1.8.2.jar:/home/jenkins/.m2/repository/org/yaml/snakeyaml/1.24/snakeyaml-1.24.jar:/home/jenkins/.m2/repository/org/apache/directory/server/apacheds-kerberos-codec/2.0.0-M15/apacheds-kerberos-codec-2.0.0-M15.jar:/home/jenkins/.m2/repository/io/dropwizard/metrics/metrics-json/4.1.1/metrics-json-4.1.1.jar:/home/jenkins/.m2/repository/org/roaringbitmap/shims/0.9.0/shims-0.9.0.jar:/home/jenkins/.m2/repository/org/scalatest/scalatest-freespec_2.12/3.2.0/scalatest-freespec_2.12-3.2.0.jar:/home/jenkins/.m2/repository/org/eclipse/jetty/jetty-webapp/9.4.28.v20200408/jetty-webapp-9.4.28.v20200408.jar:/home/jenkins/.m2/repository/org/glassfish/hk2/osgi-resource-locator/1.0.3/osgi-resource-locator-1.0.3.jar:/home/jenkins/.m2/repository/org/scala-sbt/test-interface/1.0/test-interface-1.0.jar:/home/jenkins/.m2/repository/org/codehaus/jackson/jackson-mapper-asl/1.9.13/jackson-mapper-asl-1.9.13.jar:/home/jenkins/.m2/repository/javax/servlet/jsp/jsp-api/2.1/jsp-api-2.1.jar:/home/jenkins/.m2/repository/org/scalatest/scalatest-mustmatchers_2.12/3.2.0/scalatest-mustmatchers_2.12-3.2.0.jar:/home/jenkins/.m2/repository/jakarta/activation/jakarta.activation-api/1.2.1/jakarta.activation-api-1.2.1.jar:/home/jenkins/.m2/repository/org/slf4j/slf4j-api/1.7.30/slf4j-api-1.7.30.jar:/home/jenkins/.m2/repository/com/ning/compress-lzf/1.0.3/compress-lzf-1.0.3.jar:/home/jenkins/.m2/repository/org/glassfish/jersey/containers/jersey-container-servlet/2.30/jersey-container-servlet-2.30.jar:/home/jenkins/.m2/repository/org/eclipse/jetty/jetty-security/9.4.28.v20200408/jetty-security-9.4.28.v20200408.jar:/home/jenkins/.m2/repository/com/fasterxml/jackson/datatype/jackson-datatype-jsr310/2.10.3/jackson-datatype-jsr310-2.10.3.jar:/home/jenkins/.m2/repository/com/google/code/gson/gson/2.2.4/gson-2.2.4.jar:/home/jenkins/.m2/repository/org/apache/hadoop/hadoop-annotations/2.7.4/hadoop-annotations-2.7.4.jar:/home/jenkins/.m2/repository/org/seleniumhq/selenium/selenium-remote-driver/3.141.59/selenium-remote-driver-3.141.59.jar:/home/jenkins/.m2/repository/org/javassist/javassist/3.25.0-GA/javassist-3.25.0-GA.jar:/home/jenkins/.m2/repository/org/glassfish/jersey/containers/jersey-container-servlet-core/2.30/jersey-container-servlet-core-2.30.jar:/home/jenkins/.m2/repository/commons-configuration/commons-configuration/1.6/commons-configuration-1.6.jar:/home/jenkins/.m2/repository/commons-digester/commons-digester/1.8/commons-digester-1.8.jar:/home/jenkins/.m2/repository/org/apache/directory/server/apacheds-i18n/2.0.0-M15/apacheds-i18n-2.0.0-M15.jar:/home/jenkins/.m2/repository/io/fabric8/kubernetes-client/4.9.2/kubernetes-client-4.9.2.jar:/home/jenkins/.m2/repository/dk/brics/automaton/automaton/1.11-8/automaton-1.11-8.jar:/home/jenkins/.m2/repository/org/apache/curator/curator-client/2.7.1/curator-client-2.7.1.jar:/home/jenkins/.m2/repository/org/apache/hadoop/hadoop-hdfs/2.7.4/hadoop-hdfs-2.7.4.jar:/home/jenkins/.m2/repository/org/eclipse/jetty/jetty-client/9.4.28.v20200408/jetty-client-9.4.28.v20200408.jar:/home/jenkins/.m2/repository/org/scalacheck/scalacheck_2.12/1.14.2/scalacheck_2.12-1.14.2.jar:/home/jenkins/.m2/repository/commons-cli/commons-cli/1.2/commons-cli-1.2.jar:/home/jenkins/workspace/spark-master-test-k8s/common/unsafe/target/spark-unsafe_2.12-3.1.0-SNAPSHOT.jar:/home/jenkins/.m2/repository/org/eclipse/jetty/jetty-xml/9.4.28.v20200408/jetty-xml-9.4.28.v20200408.jar:/home/jenkins/.m2/repository/org/spark-project/spark/unused/1.0.0/unused-1.0.0.jar:/home/jenkins/.m2/repository/org/eclipse/jetty/jetty-server/9.4.28.v20200408/jetty-server-9.4.28.v20200408.jar:/home/jenkins/.m2/repository/commons-collections/commons-collections/3.2.2/commons-collections-3.2.2.jar:/home/jenkins/workspace/spark-master-test-k8s/launcher/target/spark-launcher_2.12-3.1.0-SNAPSHOT.jar:/home/jenkins/.m2/repository/org/scalactic/scalactic_2.12/3.2.0/scalactic_2.12-3.2.0.jar:/home/jenkins/.m2/repository/org/apache/httpcomponents/httpclient/4.5.6/httpclient-4.5.6.jar:/home/jenkins/.m2/repository/commons-httpclient/commons-httpclient/3.1/commons-httpclient-3.1.jar:/home/jenkins/.m2/repository/org/scalatestplus/scalatestplus-mockito_2.12/1.0.0-SNAP5/scalatestplus-mockito_2.12-1.0.0-SNAP5.jar:/home/jenkins/.m2/repository/com/clearspring/analytics/stream/2.9.6/stream-2.9.6.jar:/home/jenkins/.m2/repository/org/apache/hadoop/hadoop-mapreduce-client-common/2.7.4/hadoop-mapreduce-client-common-2.7.4.jar:/home/jenkins/.m2/repository/org/glassfish/hk2/hk2-locator/2.6.1/hk2-locator-2.6.1.jar:/home/jenkins/.m2/repository/org/slf4j/slf4j-log4j12/1.7.30/slf4j-log4j12-1.7.30.jar:/home/jenkins/.m2/repository/org/glassfish/hk2/hk2-utils/2.6.1/hk2-utils-2.6.1.jar:/home/jenkins/.m2/repository/com/thoughtworks/paranamer/paranamer/2.8/paranamer-2.8.jar:/home/jenkins/.m2/repository/io/netty/netty-all/4.1.51.Final/netty-all-4.1.51.Final.jar:/home/jenkins/.m2/repository/com/fasterxml/jackson/core/jackson-annotations/2.10.0/jackson-annotations-2.10.0.jar:/home/jenkins/.m2/repository/org/apache/hadoop/hadoop-client/2.7.4/hadoop-client-2.7.4.jar:/home/jenkins/.m2/repository/org/objenesis/objenesis/2.6/objenesis-2.6.jar:/home/jenkins/.m2/repository/xml-apis/xml-apis/1.4.01/xml-apis-1.4.01.jar:/home/jenkins/.m2/repository/org/fusesource/leveldbjni/leveldbjni-all/1.8/leveldbjni-all-1.8.jar:/home/jenkins/.m2/repository/org/apache/commons/commons-text/1.6/commons-text-1.6.jar:/home/jenkins/.m2/repository/com/fasterxml/jackson/core/jackson-core/2.10.0/jackson-core-2.10.0.jar:/home/jenkins/.m2/repository/jakarta/ws/rs/jakarta.ws.rs-api/2.1.6/jakarta.ws.rs-api-2.1.6.jar:/home/jenkins/.m2/repository/org/tukaani/xz/1.5/xz-1.5.jar:/home/jenkins/.m2/repository/org/glassfish/hk2/external/aopalliance-repackaged/2.6.1/aopalliance-repackaged-2.6.1.jar:/home/jenkins/.m2/repository/io/fabric8/kubernetes-model/4.9.2/kubernetes-model-4.9.2.jar:/home/jenkins/.m2/repository/org/apache/hadoop/hadoop-common/2.7.4/hadoop-common-2.7.4.jar:/home/jenkins/.m2/repository/commons-io/commons-io/2.4/commons-io-2.4.jar:/home/jenkins/.m2/repository/com/fasterxml/jackson/module/jackson-module-paranamer/2.10.0/jackson-module-paranamer-2.10.0.jar:/home/jenkins/.m2/repository/org/apache/hadoop/hadoop-yarn-client/2.7.4/hadoop-yarn-client-2.7.4.jar:/home/jenkins/.m2/repository/com/esotericsoftware/kryo-shaded/4.0.2/kryo-shaded-4.0.2.jar:/home/jenkins/.m2/repository/com/esotericsoftware/minlog/1.3.0/minlog-1.3.0.jar:/home/jenkins/.m2/repository/org/codehaus/jackson/jackson-core-asl/1.9.13/jackson-core-asl-1.9.13.jar:/home/jenkins/.m2/repository/net/sf/py4j/py4j/0.10.9/py4j-0.10.9.jar:/home/jenkins/.m2/repository/com/github/mifmif/generex/1.0.2/generex-1.0.2.jar:/home/jenkins/workspace/spark-master-test-k8s/common/network-shuffle/target/spark-network-shuffle_2.12-3.1.0-SNAPSHOT.jar:/home/jenkins/.m2/repository/org/slf4j/jul-to-slf4j/1.7.30/jul-to-slf4j-1.7.30.jar:/home/jenkins/.m2/repository/org/json4s/json4s-scalap_2.12/3.7.0-M5/json4s-scalap_2.12-3.7.0-M5.jar:/home/jenkins/.m2/repository/org/eclipse/jetty/jetty-plus/9.4.28.v20200408/jetty-plus-9.4.28.v20200408.jar:/home/jenkins/.m2/repository/org/scalatest/scalatest_2.12/3.2.0/scalatest_2.12-3.2.0.jar:/home/jenkins/.m2/repository/org/seleniumhq/selenium/selenium-ie-driver/3.141.59/selenium-ie-driver-3.141.59.jar:/home/jenkins/.m2/repository/org/lz4/lz4-java/1.7.1/lz4-java-1.7.1.jar:/home/jenkins/.m2/repository/javax/xml/bind/jaxb-api/2.2.2/jaxb-api-2.2.2.jar:/home/jenkins/.m2/repository/org/xerial/snappy/snappy-java/1.1.7.5/snappy-java-1.1.7.5.jar:/home/jenkins/.m2/repository/org/json4s/json4s-jackson_2.12/3.7.0-M5/json4s-jackson_2.12-3.7.0-M5.jar:/home/jenkins/.m2/repository/com/github/luben/zstd-jni/1.4.5-4/zstd-jni-1.4.5-4.jar:/home/jenkins/.m2/repository/org/scalatest/scalatest-matchers-core_2.12/3.2.0/scalatest-matchers-core_2.12-3.2.0.jar:/home/jenkins/.m2/repository/org/eclipse/jetty/jetty-jndi/9.4.28.v20200408/jetty-jndi-9.4.28.v20200408.jar:/home/jenkins/.m2/repository/org/mortbay/jetty/jetty-sslengine/6.1.26/jetty-sslengine-6.1.26.jar:/home/jenkins/.m2/repository/io/dropwizard/metrics/metrics-graphite/4.1.1/metrics-graphite-4.1.1.jar:/home/jenkins/.m2/repository/org/eclipse/jetty/jetty-servlet/9.4.28.v20200408/jetty-servlet-9.4.28.v20200408.jar:/home/jenkins/.m2/repository/commons-codec/commons-codec/1.10/commons-codec-1.10.jar:/home/jenkins/.m2/repository/com/google/guava/guava/14.0.1/guava-14.0.1.jar:/home/jenkins/.m2/repository/org/apache/httpcomponents/httpcore/4.4.12/httpcore-4.4.12.jar:/home/jenkins/.m2/repository/io/fabric8/zjsonpatch/0.3.0/zjsonpatch-0.3.0.jar:/home/jenkins/.m2/repository/com/squareup/okhttp3/okhttp/3.12.6/okhttp-3.12.6.jar:/home/jenkins/.m2/repository/org/apache/hadoop/hadoop-mapreduce-client-core/2.7.4/hadoop-mapreduce-client-core-2.7.4.jar:/home/jenkins/workspace/spark-master-test-k8s/common/kvstore/target/spark-kvstore_2.12-3.1.0-SNAPSHOT.jar:/home/jenkins/.m2/repository/javax/servlet/javax.servlet-api/3.1.0/javax.servlet-api-3.1.0.jar:/home/jenkins/.m2/repository/org/apache/commons/commons-math3/3.4.1/commons-math3-3.4.1.jar:/home/jenkins/.m2/repository/javax/xml/stream/stax-api/1.0-2/stax-api-1.0-2.jar:/home/jenkins/.m2/repository/org/codehaus/jackson/jackson-xc/1.9.13/jackson-xc-1.9.13.jar:/home/jenkins/.m2/repository/org/scalatest/scalatest-propspec_2.12/3.2.0/scalatest-propspec_2.12-3.2.0.jar:/home/jenkins/.m2/repository/org/mockito/mockito-core/3.1.0/mockito-core-3.1.0.jar:/home/jenkins/.m2/repository/org/eclipse/jetty/jetty-http/9.4.28.v20200408/jetty-http-9.4.28.v20200408.jar:/home/jenkins/.m2/repository/org/glassfish/jersey/core/jersey-common/2.30/jersey-common-2.30.jar:/home/jenkins/.m2/repository/oro/oro/2.0.8/oro-2.0.8.jar:/home/jenkins/.m2/repository/com/novocode/junit-interface/0.11/junit-interface-0.11.jar:/home/jenkins/workspace/spark-master-test-k8s/core/target/spark-core_2.12-3.1.0-SNAPSHOT.jar:/home/jenkins/.m2/repository/org/apache/xbean/xbean-asm7-shaded/4.15/xbean-asm7-shaded-4.15.jar:/home/jenkins/.m2/repository/com/squareup/okio/okio/1.15.0/okio-1.15.0.jar:/home/jenkins/.m2/repository/org/scalatest/scalatest-diagrams_2.12/3.2.0/scalatest-diagrams_2.12-3.2.0.jar:/home/jenkins/.m2/repository/org/glassfish/hk2/hk2-api/2.6.1/hk2-api-2.6.1.jar:/home/jenkins/.m2/repository/org/apache/zookeeper/zookeeper/3.4.14/zookeeper-3.4.14.jar:/home/jenkins/.m2/repository/org/seleniumhq/selenium/selenium-chrome-driver/3.141.59/selenium-chrome-driver-3.141.59.jar:/home/jenkins/.m2/repository/org/seleniumhq/selenium/selenium-opera-driver/3.141.59/selenium-opera-driver-3.141.59.jar:/home/jenkins/.m2/repository/jakarta/annotation/jakarta.annotation-api/1.3.5/jakarta.annotation-api-1.3.5.jar:/home/jenkins/.m2/repository/org/mortbay/jetty/jetty-util/6.1.26/jetty-util-6.1.26.jar:/home/jenkins/.m2/repository/org/apache/hadoop/hadoop-yarn-api/2.7.4/hadoop-yarn-api-2.7.4.jar:/home/jenkins/.m2/repository/org/apache/yetus/audience-annotations/0.5.0/audience-annotations-0.5.0.jar:/home/jenkins/.m2/repository/org/scalatest/scalatest-wordspec_2.12/3.2.0/scalatest-wordspec_2.12-3.2.0.jar:/home/jenkins/.m2/repository/io/dropwizard/metrics/metrics-jvm/4.1.1/metrics-jvm-4.1.1.jar:/home/jenkins/.m2/repository/org/scalatestplus/scalatestplus-selenium_2.12/1.0.0-SNAP5/scalatestplus-selenium_2.12-1.0.0-SNAP5.jar:/home/jenkins/.m2/repository/org/hamcrest/hamcrest-core/1.3/hamcrest-core-1.3.jar:/home/jenkins/.m2/repository/org/seleniumhq/selenium/selenium-support/3.141.59/selenium-support-3.141.59.jar:/home/jenkins/.m2/repository/org/apache/hadoop/hadoop-yarn-server-common/2.7.4/hadoop-yarn-server-common-2.7.4.jar:/home/jenkins/workspace/spark-master-test-k8s/core/target/spark-core_2.12-3.1.0-SNAPSHOT-tests.jar:/home/jenkins/.m2/repository/org/scala-lang/modules/scala-xml_2.12/1.2.0/scala-xml_2.12-1.2.0.jar:/home/jenkins/.m2/repository/org/apache/hadoop/hadoop-mapreduce-client-app/2.7.4/hadoop-mapreduce-client-app-2.7.4.jar:/home/jenkins/.m2/repository/org/apache/avro/avro-ipc/1.8.2/avro-ipc-1.8.2.jar:/home/jenkins/.m2/repository/xmlenc/xmlenc/0.52/xmlenc-0.52.jar:/home/jenkins/.m2/repository/org/apache/directory/api/api-util/1.0.0-M20/api-util-1.0.0-M20.jar:/home/jenkins/.m2/repository/com/fasterxml/jackson/core/jackson-databind/2.10.0/jackson-databind-2.10.0.jar:/home/jenkins/.m2/repository/org/apache/hadoop/hadoop-yarn-common/2.7.4/hadoop-yarn-common-2.7.4.jar:/home/jenkins/.m2/repository/org/apache/directory/api/api-asn1-api/1.0.0-M20/api-asn1-api-1.0.0-M20.jar:/home/jenkins/.m2/repository/org/eclipse/jetty/jetty-util/9.4.28.v20200408/jetty-util-9.4.28.v20200408.jar:/home/jenkins/.m2/repository/org/apache/commons/commons-lang3/3.10/commons-lang3-3.10.jar:/home/jenkins/.m2/repository/org/seleniumhq/selenium/selenium-api/3.141.59/selenium-api-3.141.59.jar:/home/jenkins/.m2/repository/org/seleniumhq/selenium/selenium-java/3.141.59/selenium-java-3.141.59.jar:/home/jenkins/.m2/repository/org/roaringbitmap/RoaringBitmap/0.9.0/RoaringBitmap-0.9.0.jar:/home/jenkins/.m2/repository/jakarta/xml/bind/jakarta.xml.bind-api/2.3.2/jakarta.xml.bind-api-2.3.2.jar:/home/jenkins/.m2/repository/org/slf4j/jcl-over-slf4j/1.7.30/jcl-over-slf4j-1.7.30.jar:/home/jenkins/.m2/repository/org/glassfish/jersey/core/jersey-server/2.30/jersey-server-2.30.jar:/home/jenkins/.m2/repository/io/dropwizard/metrics/metrics-jmx/4.1.1/metrics-jmx-4.1.1.jar:/home/jenkins/.m2/repository/org/glassfish/jersey/core/jersey-client/2.30/jersey-client-2.30.jar:/home/jenkins/.m2/repository/junit/junit/4.12/junit-4.12.jar:/home/jenkins/.m2/repository/org/seleniumhq/selenium/selenium-firefox-driver/3.141.59/selenium-firefox-driver-3.141.59.jar:/home/jenkins/.m2/repository/commons-logging/commons-logging/1.1.3/commons-logging-1.1.3.jar:/home/jenkins/.m2/repository/org/seleniumhq/selenium/selenium-safari-driver/3.141.59/selenium-safari-driver-3.141.59.jar:/home/jenkins/.m2/repository/org/eclipse/jetty/jetty-continuation/9.4.28.v20200408/jetty-continuation-9.4.28.v20200408.jar:/home/jenkins/.m2/repository/org/scalatest/scalatest-core_2.12/3.2.0/scalatest-core_2.12-3.2.0.jar
[INFO] 
[INFO] --- scala-maven-plugin:4.3.0:testCompile (scala-test-compile-first) @ spark-kubernetes-integration-tests_2.12 ---
[INFO] Using incremental compilation using Mixed compile order
[INFO] Compiler bridge file: /home/jenkins/.sbt/1.0/zinc/org.scala-sbt/org.scala-sbt-compiler-bridge_2.12-1.3.1-bin_2.12.10__52.0-1.3.1_20191012T045515.jar
[INFO] Compiling 20 Scala sources to /home/jenkins/workspace/spark-master-test-k8s/resource-managers/kubernetes/integration-tests/target/test-classes ...
[ERROR] [Error] /home/jenkins/workspace/spark-master-test-k8s/resource-managers/kubernetes/integration-tests/src/test/scala/org/apache/spark/deploy/k8s/integrationtest/DecommissionSuite.scala:29: value WORKER_DECOMMISSION_ENABLED is not a member of object org.apache.spark.internal.config.Worker
[ERROR] one error found
[INFO] ------------------------------------------------------------------------
[INFO] Reactor Summary for Spark Project Parent POM 3.1.0-SNAPSHOT:
[INFO] 
[INFO] Spark Project Parent POM ........................... SUCCESS [  4.175 s]
[INFO] Spark Project Tags ................................. SUCCESS [  9.073 s]
[INFO] Spark Project Local DB ............................. SUCCESS [  4.444 s]
[INFO] Spark Project Networking ........................... SUCCESS [  5.724 s]
[INFO] Spark Project Shuffle Streaming Service ............ SUCCESS [  3.225 s]
[INFO] Spark Project Unsafe ............................... SUCCESS [ 10.568 s]
[INFO] Spark Project Launcher ............................. SUCCESS [  3.767 s]
[INFO] Spark Project Core ................................. SUCCESS [02:11 min]
[INFO] Spark Project Kubernetes Integration Tests ......... FAILURE [  8.357 s]
[INFO] ------------------------------------------------------------------------
[INFO] BUILD FAILURE
[INFO] ------------------------------------------------------------------------
[INFO] Total time:  03:01 min
[INFO] Finished at: 2020-08-19T14:10:45-07:00
[INFO] ------------------------------------------------------------------------
[ERROR] Failed to execute goal net.alchim31.maven:scala-maven-plugin:4.3.0:testCompile (scala-test-compile-first) on project spark-kubernetes-integration-tests_2.12: Execution scala-test-compile-first of goal net.alchim31.maven:scala-maven-plugin:4.3.0:testCompile failed.: CompileFailed -> [Help 1]
[ERROR] 
[ERROR] To see the full stack trace of the errors, re-run Maven with the -e switch.
[ERROR] Re-run Maven using the -X switch to enable full debug logging.
[ERROR] 
[ERROR] For more information about the errors and possible solutions, please read the following articles:
[ERROR] [Help 1] http://cwiki.apache.org/confluence/display/MAVEN/PluginExecutionException
[ERROR] 
[ERROR] After correcting the problems, you can resume the build with the command
[ERROR]   mvn <args> -rf :spark-kubernetes-integration-tests_2.12
+ retcode3=1
+ kill -9 3553
+ minikube stop
:   Stopping "minikube" in kvm2 ...
-   "minikube" stopped.
/tmp/hudson5651660847061578768.sh: line 67:  3553 Killed                  minikube mount ${PVC_TESTS_HOST_PATH}:${PVC_TESTS_VM_PATH} --9p-version=9p2000.L --gid=0 --uid=185
+ rm -rf /tmp/tmp.Mk4CfGc8li
+ exit 1
Build step 'Execute shell' marked build as failure
Archiving artifacts
Finished: FAILURE