FailedConsole Output

Skipping 1,704 KB.. Full Log
  binutils binutils-common binutils-x86-64-linux-gnu build-essential bzip2
  bzip2-doc cpp cpp-8 dbus dpkg-dev fakeroot fontconfig fontconfig-config
  fonts-dejavu-core g++ g++-8 gcc gcc-8 gfortran gfortran-8 icu-devtools
  libalgorithm-diff-perl libalgorithm-diff-xs-perl libalgorithm-merge-perl
  libapparmor1 libasan5 libatomic1 libauthen-sasl-perl libbinutils libblas-dev
  libblas3 libbsd0 libbz2-dev libc-dev-bin libc6-dev libcairo2 libcc1-0
  libcurl4 libdata-dump-perl libdatrie1 libdbus-1-3 libdpkg-perl
  libdrm-amdgpu1 libdrm-common libdrm-intel1 libdrm-nouveau2 libdrm-radeon1
  libdrm2 libedit2 libelf1 libencode-locale-perl libexpat1 libfakeroot
  libfile-basedir-perl libfile-desktopentry-perl libfile-fcntllock-perl
  libfile-listing-perl libfile-mimeinfo-perl libfont-afm-perl libfontconfig1
  libfontenc1 libfreetype6 libfribidi0 libgcc-8-dev libgdbm-compat4 libgdbm6
  libgfortran-8-dev libgfortran5 libgl1 libgl1-mesa-dri libglapi-mesa
  libglib2.0-0 libglib2.0-data libglvnd0 libglx-mesa0 libglx0 libgomp1
  libgraphite2-3 libharfbuzz0b libhtml-form-perl libhtml-format-perl
  libhtml-parser-perl libhtml-tagset-perl libhtml-tree-perl
  libhttp-cookies-perl libhttp-daemon-perl libhttp-date-perl
  libhttp-message-perl libhttp-negotiate-perl libice6 libicu-dev
  libio-html-perl libio-socket-ssl-perl libio-stringy-perl
  libipc-system-simple-perl libisl19 libitm1 libjbig0 libjpeg-dev
  libjpeg62-turbo libjpeg62-turbo-dev liblapack-dev liblapack3 libllvm7
  liblocale-gettext-perl liblsan0 liblwp-mediatypes-perl
  liblwp-protocol-https-perl liblzma-dev libmailtools-perl libmpc3 libmpfr6
  libmpx2 libncurses-dev libncurses5-dev libnet-dbus-perl libnet-http-perl
  libnet-smtp-ssl-perl libnet-ssleay-perl libnghttp2-14 libpango-1.0-0
  libpangocairo-1.0-0 libpangoft2-1.0-0 libpaper-utils libpaper1 libpciaccess0
  libpcre16-3 libpcre2-16-0 libpcre2-32-0 libpcre2-8-0 libpcre2-dev
  libpcre2-posix0 libpcre3-dev libpcre32-3 libpcrecpp0v5 libperl5.28
  libpixman-1-0 libpng-dev libpng-tools libpng16-16 libpsl5 libquadmath0
  libreadline-dev librtmp1 libsensors-config libsensors5 libsm6 libssh2-1
  libstdc++-8-dev libtcl8.6 libtext-iconv-perl libthai-data libthai0
  libtie-ixhash-perl libtiff5 libtimedate-perl libtk8.6 libtry-tiny-perl
  libtsan0 libubsan1 liburi-perl libwebp6 libwww-perl libwww-robotrules-perl
  libx11-6 libx11-data libx11-protocol-perl libx11-xcb1 libxau6 libxaw7
  libxcb-dri2-0 libxcb-dri3-0 libxcb-glx0 libxcb-present0 libxcb-render0
  libxcb-shape0 libxcb-shm0 libxcb-sync1 libxcb1 libxcomposite1 libxcursor1
  libxdamage1 libxdmcp6 libxext6 libxfixes3 libxft2 libxi6 libxinerama1
  libxml-parser-perl libxml-twig-perl libxml-xpathengine-perl libxmu6 libxmuu1
  libxpm4 libxrandr2 libxrender1 libxshmfence1 libxss1 libxt6 libxtst6 libxv1
  libxxf86dga1 libxxf86vm1 linux-libc-dev make manpages manpages-dev netbase
  patch perl perl-base perl-modules-5.28 perl-openssl-defaults pkg-config
  publicsuffix r-base-core r-base-html r-cran-boot r-cran-class r-cran-cluster
  r-cran-codetools r-cran-foreign r-cran-kernsmooth r-cran-lattice r-cran-mass
  r-cran-matrix r-cran-mgcv r-cran-nlme r-cran-nnet r-cran-rpart
  r-cran-spatial r-cran-survival r-doc-html r-recommended sensible-utils
  shared-mime-info ucf unzip x11-common x11-utils x11-xserver-utils xauth
  xdg-user-dirs xdg-utils xz-utils zip zlib1g-dev
Suggested packages:
  binutils-doc cpp-doc gcc-8-locales default-dbus-session-bus
  | dbus-session-bus debian-keyring g++-multilib g++-8-multilib gcc-8-doc
  libstdc++6-8-dbg gcc-multilib autoconf automake libtool flex bison gdb
  gcc-doc gcc-8-multilib libgcc1-dbg libgomp1-dbg libitm1-dbg libatomic1-dbg
  libasan5-dbg liblsan0-dbg libtsan0-dbg libubsan1-dbg libmpx2-dbg
  libquadmath0-dbg gfortran-multilib gfortran-doc gfortran-8-multilib
  gfortran-8-doc libgfortran5-dbg libcoarrays-dev libdigest-hmac-perl
  libgssapi-perl liblapack-doc glibc-doc git bzr gdbm-l10n icu-doc
  libcrypt-ssleay-perl liblzma-doc ncurses-doc pciutils readline-doc
  lm-sensors libstdc++-8-doc tcl8.6 tk8.6 libauthen-ntlm-perl
  libunicode-map8-perl libunicode-string-perl xml-twig-tools make-doc
  man-browser ed diffutils-doc perl-doc libterm-readline-gnu-perl
  | libterm-readline-perl-perl libb-debug-perl liblocale-codes-perl elpa-ess
  r-doc-info | r-doc-pdf r-mathlib texlive-base texlive-latex-base
  texlive-plain-generic texlive-fonts-recommended texlive-fonts-extra
  texlive-extra-utils texlive-latex-recommended texlive-latex-extra texinfo
  mozilla | www-browser mesa-utils nickle cairo-5c xorg-docs-core
The following NEW packages will be installed:
  binutils binutils-common binutils-x86-64-linux-gnu build-essential bzip2
  bzip2-doc cpp cpp-8 dbus dpkg-dev fakeroot fontconfig fontconfig-config
  fonts-dejavu-core g++ g++-8 gcc gcc-8 gfortran gfortran-8 icu-devtools
  libalgorithm-diff-perl libalgorithm-diff-xs-perl libalgorithm-merge-perl
  libapparmor1 libasan5 libatomic1 libauthen-sasl-perl libbinutils libblas-dev
  libblas3 libbsd0 libbz2-dev libc-dev-bin libc6-dev libcairo2 libcc1-0
  libcurl4 libdata-dump-perl libdatrie1 libdbus-1-3 libdpkg-perl
  libdrm-amdgpu1 libdrm-common libdrm-intel1 libdrm-nouveau2 libdrm-radeon1
  libdrm2 libedit2 libelf1 libencode-locale-perl libexpat1 libfakeroot
  libfile-basedir-perl libfile-desktopentry-perl libfile-fcntllock-perl
  libfile-listing-perl libfile-mimeinfo-perl libfont-afm-perl libfontconfig1
  libfontenc1 libfreetype6 libfribidi0 libgcc-8-dev libgdbm-compat4 libgdbm6
  libgfortran-8-dev libgfortran5 libgl1 libgl1-mesa-dri libglapi-mesa
  libglib2.0-0 libglib2.0-data libglvnd0 libglx-mesa0 libglx0 libgomp1
  libgraphite2-3 libharfbuzz0b libhtml-form-perl libhtml-format-perl
  libhtml-parser-perl libhtml-tagset-perl libhtml-tree-perl
  libhttp-cookies-perl libhttp-daemon-perl libhttp-date-perl
  libhttp-message-perl libhttp-negotiate-perl libice6 libicu-dev
  libio-html-perl libio-socket-ssl-perl libio-stringy-perl
  libipc-system-simple-perl libisl19 libitm1 libjbig0 libjpeg-dev
  libjpeg62-turbo libjpeg62-turbo-dev liblapack-dev liblapack3 libllvm7
  liblocale-gettext-perl liblsan0 liblwp-mediatypes-perl
  liblwp-protocol-https-perl liblzma-dev libmailtools-perl libmpc3 libmpfr6
  libmpx2 libncurses-dev libncurses5-dev libnet-dbus-perl libnet-http-perl
  libnet-smtp-ssl-perl libnet-ssleay-perl libnghttp2-14 libpango-1.0-0
  libpangocairo-1.0-0 libpangoft2-1.0-0 libpaper-utils libpaper1 libpciaccess0
  libpcre16-3 libpcre2-16-0 libpcre2-32-0 libpcre2-8-0 libpcre2-dev
  libpcre2-posix0 libpcre3-dev libpcre32-3 libpcrecpp0v5 libperl5.28
  libpixman-1-0 libpng-dev libpng-tools libpng16-16 libpsl5 libquadmath0
  libreadline-dev librtmp1 libsensors-config libsensors5 libsm6 libssh2-1
  libstdc++-8-dev libtcl8.6 libtext-iconv-perl libthai-data libthai0
  libtie-ixhash-perl libtiff5 libtimedate-perl libtk8.6 libtry-tiny-perl
  libtsan0 libubsan1 liburi-perl libwebp6 libwww-perl libwww-robotrules-perl
  libx11-6 libx11-data libx11-protocol-perl libx11-xcb1 libxau6 libxaw7
  libxcb-dri2-0 libxcb-dri3-0 libxcb-glx0 libxcb-present0 libxcb-render0
  libxcb-shape0 libxcb-shm0 libxcb-sync1 libxcb1 libxcomposite1 libxcursor1
  libxdamage1 libxdmcp6 libxext6 libxfixes3 libxft2 libxi6 libxinerama1
  libxml-parser-perl libxml-twig-perl libxml-xpathengine-perl libxmu6 libxmuu1
  libxpm4 libxrandr2 libxrender1 libxshmfence1 libxss1 libxt6 libxtst6 libxv1
  libxxf86dga1 libxxf86vm1 linux-libc-dev make manpages manpages-dev netbase
  patch perl perl-modules-5.28 perl-openssl-defaults pkg-config publicsuffix
  r-base r-base-core r-base-dev r-base-html r-cran-boot r-cran-class
  r-cran-cluster r-cran-codetools r-cran-foreign r-cran-kernsmooth
  r-cran-lattice r-cran-mass r-cran-matrix r-cran-mgcv r-cran-nlme r-cran-nnet
  r-cran-rpart r-cran-spatial r-cran-survival r-doc-html r-recommended
  sensible-utils shared-mime-info ucf unzip x11-common x11-utils
  x11-xserver-utils xauth xdg-user-dirs xdg-utils xz-utils zip zlib1g-dev
The following packages will be upgraded:
  perl-base
1 upgraded, 248 newly installed, 0 to remove and 34 not upgraded.
Need to get 176 MB of archives.
After this operation, 694 MB of additional disk space will be used.
Get:1 http://cloud.r-project.org/bin/linux/debian buster-cran35/ r-base-core 3.6.3-1~bustercran.0 [24.7 MB]
Get:2 https://deb.debian.org/debian buster/main amd64 perl-base amd64 5.28.1-6+deb10u1 [1514 kB]
Get:3 https://deb.debian.org/debian buster/main amd64 perl-modules-5.28 all 5.28.1-6+deb10u1 [2873 kB]
Get:4 https://deb.debian.org/debian buster/main amd64 libgdbm6 amd64 1.18.1-4 [64.7 kB]
Get:5 https://deb.debian.org/debian buster/main amd64 libgdbm-compat4 amd64 1.18.1-4 [44.1 kB]
Get:6 https://deb.debian.org/debian buster/main amd64 libperl5.28 amd64 5.28.1-6+deb10u1 [3894 kB]
Get:7 https://deb.debian.org/debian buster/main amd64 perl amd64 5.28.1-6+deb10u1 [204 kB]
Get:8 https://deb.debian.org/debian buster/main amd64 liblocale-gettext-perl amd64 1.07-3+b4 [18.9 kB]
Get:9 https://deb.debian.org/debian buster/main amd64 netbase all 5.6 [19.4 kB]
Get:10 https://deb.debian.org/debian buster/main amd64 sensible-utils all 0.0.12 [15.8 kB]
Get:11 https://deb.debian.org/debian buster/main amd64 bzip2 amd64 1.0.6-9.2~deb10u1 [48.4 kB]
Get:12 https://deb.debian.org/debian buster/main amd64 libapparmor1 amd64 2.13.2-10 [94.7 kB]
Get:13 https://deb.debian.org/debian buster/main amd64 libdbus-1-3 amd64 1.12.20-0+deb10u1 [215 kB]
Get:14 https://deb.debian.org/debian buster/main amd64 libexpat1 amd64 2.2.6-2+deb10u1 [106 kB]
Get:15 https://deb.debian.org/debian buster/main amd64 dbus amd64 1.12.20-0+deb10u1 [236 kB]
Get:16 https://deb.debian.org/debian buster/main amd64 manpages all 4.16-2 [1295 kB]
Get:17 https://deb.debian.org/debian buster/main amd64 ucf all 3.0038+nmu1 [69.0 kB]
Get:18 https://deb.debian.org/debian buster/main amd64 xz-utils amd64 5.2.4-1 [183 kB]
Get:19 https://deb.debian.org/debian buster/main amd64 binutils-common amd64 2.31.1-16 [2073 kB]
Get:20 https://deb.debian.org/debian buster/main amd64 libbinutils amd64 2.31.1-16 [478 kB]
Get:21 https://deb.debian.org/debian buster/main amd64 binutils-x86-64-linux-gnu amd64 2.31.1-16 [1823 kB]
Get:22 https://deb.debian.org/debian buster/main amd64 binutils amd64 2.31.1-16 [56.8 kB]
Get:23 https://deb.debian.org/debian buster/main amd64 libc-dev-bin amd64 2.28-10 [275 kB]
Get:24 https://deb.debian.org/debian buster/main amd64 linux-libc-dev amd64 4.19.160-2 [1416 kB]
Get:25 https://deb.debian.org/debian buster/main amd64 libc6-dev amd64 2.28-10 [2691 kB]
Get:26 https://deb.debian.org/debian buster/main amd64 libisl19 amd64 0.20-2 [587 kB]
Get:27 https://deb.debian.org/debian buster/main amd64 libmpfr6 amd64 4.0.2-1 [775 kB]
Get:28 https://deb.debian.org/debian buster/main amd64 libmpc3 amd64 1.1.0-1 [41.3 kB]
Get:29 https://deb.debian.org/debian buster/main amd64 cpp-8 amd64 8.3.0-6 [8914 kB]
Get:30 https://deb.debian.org/debian buster/main amd64 cpp amd64 4:8.3.0-1 [19.4 kB]
Get:31 https://deb.debian.org/debian buster/main amd64 libcc1-0 amd64 8.3.0-6 [46.6 kB]
Get:32 https://deb.debian.org/debian buster/main amd64 libgomp1 amd64 8.3.0-6 [75.8 kB]
Get:33 https://deb.debian.org/debian buster/main amd64 libitm1 amd64 8.3.0-6 [27.7 kB]
Get:34 https://deb.debian.org/debian buster/main amd64 libatomic1 amd64 8.3.0-6 [9032 B]
Get:35 https://deb.debian.org/debian buster/main amd64 libasan5 amd64 8.3.0-6 [362 kB]
Get:36 https://deb.debian.org/debian buster/main amd64 liblsan0 amd64 8.3.0-6 [131 kB]
Get:37 https://deb.debian.org/debian buster/main amd64 libtsan0 amd64 8.3.0-6 [283 kB]
Get:38 https://deb.debian.org/debian buster/main amd64 libubsan1 amd64 8.3.0-6 [120 kB]
Get:39 https://deb.debian.org/debian buster/main amd64 libmpx2 amd64 8.3.0-6 [11.4 kB]
Get:40 https://deb.debian.org/debian buster/main amd64 libquadmath0 amd64 8.3.0-6 [133 kB]
Get:41 https://deb.debian.org/debian buster/main amd64 libgcc-8-dev amd64 8.3.0-6 [2298 kB]
Get:42 https://deb.debian.org/debian buster/main amd64 gcc-8 amd64 8.3.0-6 [9452 kB]
Get:43 https://deb.debian.org/debian buster/main amd64 gcc amd64 4:8.3.0-1 [5196 B]
Get:44 https://deb.debian.org/debian buster/main amd64 libstdc++-8-dev amd64 8.3.0-6 [1532 kB]
Get:45 https://deb.debian.org/debian buster/main amd64 g++-8 amd64 8.3.0-6 [9752 kB]
Get:46 https://deb.debian.org/debian buster/main amd64 g++ amd64 4:8.3.0-1 [1644 B]
Get:47 https://deb.debian.org/debian buster/main amd64 make amd64 4.2.1-1.2 [341 kB]
Get:48 https://deb.debian.org/debian buster/main amd64 libdpkg-perl all 1.19.7 [1414 kB]
Get:49 https://deb.debian.org/debian buster/main amd64 patch amd64 2.7.6-3+deb10u1 [126 kB]
Get:50 https://deb.debian.org/debian buster/main amd64 dpkg-dev all 1.19.7 [1773 kB]
Get:51 https://deb.debian.org/debian buster/main amd64 build-essential amd64 12.6 [7576 B]
Get:52 https://deb.debian.org/debian buster/main amd64 bzip2-doc all 1.0.6-9.2~deb10u1 [493 kB]
Get:53 https://deb.debian.org/debian buster/main amd64 libfakeroot amd64 1.23-1 [45.9 kB]
Get:54 https://deb.debian.org/debian buster/main amd64 fakeroot amd64 1.23-1 [85.8 kB]
Get:55 https://deb.debian.org/debian buster/main amd64 libpng16-16 amd64 1.6.36-6 [292 kB]
Get:56 https://deb.debian.org/debian buster/main amd64 libfreetype6 amd64 2.9.1-3+deb10u2 [380 kB]
Get:57 https://deb.debian.org/debian buster/main amd64 fonts-dejavu-core all 2.37-1 [1068 kB]
Get:58 https://deb.debian.org/debian buster/main amd64 fontconfig-config all 2.13.1-2 [280 kB]
Get:59 https://deb.debian.org/debian buster/main amd64 libfontconfig1 amd64 2.13.1-2 [346 kB]
Get:60 https://deb.debian.org/debian buster/main amd64 fontconfig amd64 2.13.1-2 [405 kB]
Get:61 https://deb.debian.org/debian buster/main amd64 libgfortran5 amd64 8.3.0-6 [581 kB]
Get:62 https://deb.debian.org/debian buster/main amd64 libgfortran-8-dev amd64 8.3.0-6 [616 kB]
Get:63 https://deb.debian.org/debian buster/main amd64 gfortran-8 amd64 8.3.0-6 [9375 kB]
Get:64 https://deb.debian.org/debian buster/main amd64 gfortran amd64 4:8.3.0-1 [1432 B]
Get:65 https://deb.debian.org/debian buster/main amd64 icu-devtools amd64 63.1-6+deb10u1 [189 kB]
Get:66 https://deb.debian.org/debian buster/main amd64 libalgorithm-diff-perl all 1.19.03-2 [47.9 kB]
Get:67 https://deb.debian.org/debian buster/main amd64 libalgorithm-diff-xs-perl amd64 0.04-5+b1 [11.8 kB]
Get:68 https://deb.debian.org/debian buster/main amd64 libalgorithm-merge-perl all 0.08-3 [12.7 kB]
Get:69 https://deb.debian.org/debian buster/main amd64 libauthen-sasl-perl all 2.1600-1 [50.8 kB]
Get:70 https://deb.debian.org/debian buster/main amd64 libblas3 amd64 3.8.0-2 [148 kB]
Get:71 https://deb.debian.org/debian buster/main amd64 libblas-dev amd64 3.8.0-2 [154 kB]
Get:72 https://deb.debian.org/debian buster/main amd64 libbsd0 amd64 0.9.1-2 [99.5 kB]
Get:73 https://deb.debian.org/debian buster/main amd64 libbz2-dev amd64 1.0.6-9.2~deb10u1 [30.2 kB]
Get:74 https://deb.debian.org/debian buster/main amd64 libpixman-1-0 amd64 0.36.0-1 [537 kB]
Get:75 https://deb.debian.org/debian buster/main amd64 libxau6 amd64 1:1.0.8-1+b2 [19.9 kB]
Get:76 https://deb.debian.org/debian buster/main amd64 libxdmcp6 amd64 1:1.1.2-3 [26.3 kB]
Get:77 https://deb.debian.org/debian buster/main amd64 libxcb1 amd64 1.13.1-2 [137 kB]
Get:78 https://deb.debian.org/debian buster/main amd64 libx11-data all 2:1.6.7-1+deb10u1 [294 kB]
Get:79 https://deb.debian.org/debian buster/main amd64 libx11-6 amd64 2:1.6.7-1+deb10u1 [757 kB]
Get:80 https://deb.debian.org/debian buster/main amd64 libxcb-render0 amd64 1.13.1-2 [109 kB]
Get:81 https://deb.debian.org/debian buster/main amd64 libxcb-shm0 amd64 1.13.1-2 [99.2 kB]
Get:82 https://deb.debian.org/debian buster/main amd64 libxext6 amd64 2:1.3.3-1+b2 [52.5 kB]
Get:83 https://deb.debian.org/debian buster/main amd64 libxrender1 amd64 1:0.9.10-1 [33.0 kB]
Get:84 https://deb.debian.org/debian buster/main amd64 libcairo2 amd64 1.16.0-4 [689 kB]
Get:85 https://deb.debian.org/debian buster/main amd64 libnghttp2-14 amd64 1.36.0-2+deb10u1 [85.0 kB]
Get:86 https://deb.debian.org/debian buster/main amd64 libpsl5 amd64 0.20.2-2 [53.7 kB]
Get:87 https://deb.debian.org/debian buster/main amd64 librtmp1 amd64 2.4+20151223.gitfa8646d.1-2 [60.5 kB]
Get:88 https://deb.debian.org/debian buster/main amd64 libssh2-1 amd64 1.8.0-2.1 [140 kB]
Get:89 https://deb.debian.org/debian buster/main amd64 libcurl4 amd64 7.64.0-4+deb10u1 [331 kB]
Get:90 https://deb.debian.org/debian buster/main amd64 libdata-dump-perl all 1.23-1 [29.5 kB]
Get:91 https://deb.debian.org/debian buster/main amd64 libdatrie1 amd64 0.2.12-2 [39.3 kB]
Get:92 https://deb.debian.org/debian buster/main amd64 libdrm-common all 2.4.97-1 [13.8 kB]
Get:93 https://deb.debian.org/debian buster/main amd64 libdrm2 amd64 2.4.97-1 [39.7 kB]
Get:94 https://deb.debian.org/debian buster/main amd64 libdrm-amdgpu1 amd64 2.4.97-1 [27.3 kB]
Get:95 https://deb.debian.org/debian buster/main amd64 libpciaccess0 amd64 0.14-1 [53.5 kB]
Get:96 https://deb.debian.org/debian buster/main amd64 libdrm-intel1 amd64 2.4.97-1 [69.8 kB]
Get:97 https://deb.debian.org/debian buster/main amd64 libdrm-nouveau2 amd64 2.4.97-1 [26.3 kB]
Get:98 https://deb.debian.org/debian buster/main amd64 libdrm-radeon1 amd64 2.4.97-1 [31.1 kB]
Get:99 https://deb.debian.org/debian buster/main amd64 libedit2 amd64 3.1-20181209-1 [94.0 kB]
Get:100 https://deb.debian.org/debian buster/main amd64 libelf1 amd64 0.176-1.1 [161 kB]
Get:101 https://deb.debian.org/debian buster/main amd64 libencode-locale-perl all 1.05-1 [13.7 kB]
Get:102 https://deb.debian.org/debian buster/main amd64 libipc-system-simple-perl all 1.25-4 [26.5 kB]
Get:103 https://deb.debian.org/debian buster/main amd64 libfile-basedir-perl all 0.08-1 [17.7 kB]
Get:104 https://deb.debian.org/debian buster/main amd64 liburi-perl all 1.76-1 [89.9 kB]
Get:105 https://deb.debian.org/debian buster/main amd64 libfile-desktopentry-perl all 0.22-1 [19.2 kB]
Get:106 https://deb.debian.org/debian buster/main amd64 libfile-fcntllock-perl amd64 0.22-3+b5 [35.4 kB]
Get:107 https://deb.debian.org/debian buster/main amd64 libtimedate-perl all 2.3000-2+deb10u1 [38.1 kB]
Get:108 https://deb.debian.org/debian buster/main amd64 libhttp-date-perl all 6.02-1 [10.7 kB]
Get:109 https://deb.debian.org/debian buster/main amd64 libfile-listing-perl all 6.04-1 [10.3 kB]
Get:110 https://deb.debian.org/debian buster/main amd64 libglib2.0-0 amd64 2.58.3-2+deb10u2 [1258 kB]
Get:111 https://deb.debian.org/debian buster/main amd64 shared-mime-info amd64 1.10-1 [766 kB]
Get:112 https://deb.debian.org/debian buster/main amd64 libfile-mimeinfo-perl all 0.29-1 [46.5 kB]
Get:113 https://deb.debian.org/debian buster/main amd64 libfont-afm-perl all 1.20-2 [13.6 kB]
Get:114 https://deb.debian.org/debian buster/main amd64 libfontenc1 amd64 1:1.1.3-1+b2 [24.4 kB]
Get:115 https://deb.debian.org/debian buster/main amd64 libfribidi0 amd64 1.0.5-3.1+deb10u1 [63.7 kB]
Get:116 https://deb.debian.org/debian buster/main amd64 libglapi-mesa amd64 18.3.6-2+deb10u1 [66.3 kB]
Get:117 https://deb.debian.org/debian buster/main amd64 libllvm7 amd64 1:7.0.1-8+deb10u2 [13.1 MB]
Get:118 https://deb.debian.org/debian buster/main amd64 libsensors-config all 1:3.5.0-3 [31.6 kB]
Get:119 https://deb.debian.org/debian buster/main amd64 libsensors5 amd64 1:3.5.0-3 [52.6 kB]
Get:120 https://deb.debian.org/debian buster/main amd64 libgl1-mesa-dri amd64 18.3.6-2+deb10u1 [6685 kB]
Get:121 https://deb.debian.org/debian buster/main amd64 libglib2.0-data all 2.58.3-2+deb10u2 [1110 kB]
Get:122 https://deb.debian.org/debian buster/main amd64 libglvnd0 amd64 1.1.0-1 [48.6 kB]
Get:123 https://deb.debian.org/debian buster/main amd64 libx11-xcb1 amd64 2:1.6.7-1+deb10u1 [190 kB]
Get:124 https://deb.debian.org/debian buster/main amd64 libxcb-dri2-0 amd64 1.13.1-2 [101 kB]
Get:125 https://deb.debian.org/debian buster/main amd64 libxcb-dri3-0 amd64 1.13.1-2 [100 kB]
Get:126 https://deb.debian.org/debian buster/main amd64 libxcb-glx0 amd64 1.13.1-2 [116 kB]
Get:127 https://deb.debian.org/debian buster/main amd64 libxcb-present0 amd64 1.13.1-2 [99.1 kB]
Get:128 https://deb.debian.org/debian buster/main amd64 libxcb-sync1 amd64 1.13.1-2 [103 kB]
Get:129 https://deb.debian.org/debian buster/main amd64 libxfixes3 amd64 1:5.0.3-1 [21.9 kB]
Get:130 https://deb.debian.org/debian buster/main amd64 libxdamage1 amd64 1:1.1.4-3+b3 [14.9 kB]
Get:131 https://deb.debian.org/debian buster/main amd64 libxshmfence1 amd64 1.3-1 [8820 B]
Get:132 https://deb.debian.org/debian buster/main amd64 libxxf86vm1 amd64 1:1.1.4-1+b2 [20.8 kB]
Get:133 https://deb.debian.org/debian buster/main amd64 libglx-mesa0 amd64 18.3.6-2+deb10u1 [180 kB]
Get:134 https://deb.debian.org/debian buster/main amd64 libgraphite2-3 amd64 1.3.13-7 [80.7 kB]
Get:135 https://deb.debian.org/debian buster/main amd64 libharfbuzz0b amd64 2.3.1-1 [1187 kB]
Get:136 https://deb.debian.org/debian buster/main amd64 libhtml-tagset-perl all 3.20-3 [12.7 kB]
Get:137 https://deb.debian.org/debian buster/main amd64 libhtml-parser-perl amd64 3.72-3+b3 [105 kB]
Get:138 https://deb.debian.org/debian buster/main amd64 libio-html-perl all 1.001-1 [17.6 kB]
Get:139 https://deb.debian.org/debian buster/main amd64 liblwp-mediatypes-perl all 6.02-1 [22.1 kB]
Get:140 https://deb.debian.org/debian buster/main amd64 libhttp-message-perl all 6.18-1 [77.8 kB]
Get:141 https://deb.debian.org/debian buster/main amd64 libhtml-form-perl all 6.03-1 [23.9 kB]
Get:142 https://deb.debian.org/debian buster/main amd64 libhtml-tree-perl all 5.07-2 [213 kB]
Get:143 https://deb.debian.org/debian buster/main amd64 libhtml-format-perl all 2.12-1 [43.5 kB]
Get:144 https://deb.debian.org/debian buster/main amd64 libhttp-cookies-perl all 6.04-1 [17.8 kB]
Get:145 https://deb.debian.org/debian buster/main amd64 libhttp-daemon-perl all 6.01-3 [16.6 kB]
Get:146 https://deb.debian.org/debian buster/main amd64 libhttp-negotiate-perl all 6.01-1 [12.8 kB]
Get:147 https://deb.debian.org/debian buster/main amd64 x11-common all 1:7.7+19 [251 kB]
Get:148 https://deb.debian.org/debian buster/main amd64 libice6 amd64 2:1.0.9-2 [58.7 kB]
Get:149 https://deb.debian.org/debian buster/main amd64 libicu-dev amd64 63.1-6+deb10u1 [9186 kB]
Get:150 https://deb.debian.org/debian buster/main amd64 perl-openssl-defaults amd64 3 [6782 B]
Get:151 https://deb.debian.org/debian buster/main amd64 libnet-ssleay-perl amd64 1.85-2+b1 [308 kB]
Get:152 https://deb.debian.org/debian buster/main amd64 libio-socket-ssl-perl all 2.060-3 [207 kB]
Get:153 https://deb.debian.org/debian buster/main amd64 libio-stringy-perl all 2.111-3 [56.5 kB]
Get:154 https://deb.debian.org/debian buster/main amd64 libjbig0 amd64 2.1-3.1+b2 [31.0 kB]
Get:155 https://deb.debian.org/debian buster/main amd64 libjpeg62-turbo amd64 1:1.5.2-2+deb10u1 [133 kB]
Get:156 https://deb.debian.org/debian buster/main amd64 libjpeg62-turbo-dev amd64 1:1.5.2-2+deb10u1 [208 kB]
Get:157 https://deb.debian.org/debian buster/main amd64 libjpeg-dev all 1:1.5.2-2+deb10u1 [57.7 kB]
Get:158 https://deb.debian.org/debian buster/main amd64 liblapack3 amd64 3.8.0-2 [2110 kB]
Get:159 https://deb.debian.org/debian buster/main amd64 liblapack-dev amd64 3.8.0-2 [2140 kB]
Get:160 https://deb.debian.org/debian buster/main amd64 libnet-http-perl all 6.18-1 [24.5 kB]
Get:161 https://deb.debian.org/debian buster/main amd64 libtry-tiny-perl all 0.30-1 [23.3 kB]
Get:162 https://deb.debian.org/debian buster/main amd64 libwww-robotrules-perl all 6.02-1 [12.9 kB]
Get:163 https://deb.debian.org/debian buster/main amd64 libwww-perl all 6.36-2 [188 kB]
Get:164 https://deb.debian.org/debian buster/main amd64 liblwp-protocol-https-perl all 6.07-2 [9242 B]
Get:165 https://deb.debian.org/debian buster/main amd64 liblzma-dev amd64 5.2.4-1 [210 kB]
Get:166 https://deb.debian.org/debian buster/main amd64 libnet-smtp-ssl-perl all 1.04-1 [6184 B]
Get:167 https://deb.debian.org/debian buster/main amd64 libmailtools-perl all 2.18-1 [88.5 kB]
Get:168 https://deb.debian.org/debian buster/main amd64 libncurses-dev amd64 6.1+20181013-2+deb10u2 [333 kB]
Get:169 https://deb.debian.org/debian buster/main amd64 libncurses5-dev amd64 6.1+20181013-2+deb10u2 [948 B]
Get:170 https://deb.debian.org/debian buster/main amd64 libxml-parser-perl amd64 2.44-4 [213 kB]
Get:171 https://deb.debian.org/debian buster/main amd64 libxml-twig-perl all 1:3.50-1.1 [179 kB]
Get:172 https://deb.debian.org/debian buster/main amd64 libnet-dbus-perl amd64 1.1.0-5+b1 [181 kB]
Get:173 https://deb.debian.org/debian buster/main amd64 libthai-data all 0.1.28-2 [170 kB]
Get:174 https://deb.debian.org/debian buster/main amd64 libthai0 amd64 0.1.28-2 [54.1 kB]
Get:175 https://deb.debian.org/debian buster/main amd64 libpango-1.0-0 amd64 1.42.4-8~deb10u1 [186 kB]
Get:176 https://deb.debian.org/debian buster/main amd64 libpangoft2-1.0-0 amd64 1.42.4-8~deb10u1 [68.3 kB]
Get:177 https://deb.debian.org/debian buster/main amd64 libpangocairo-1.0-0 amd64 1.42.4-8~deb10u1 [55.7 kB]
Get:178 https://deb.debian.org/debian buster/main amd64 libpaper1 amd64 1.1.28 [21.3 kB]
Get:179 https://deb.debian.org/debian buster/main amd64 libpaper-utils amd64 1.1.28 [18.0 kB]
Get:180 https://deb.debian.org/debian buster/main amd64 libpcre16-3 amd64 2:8.39-12 [259 kB]
Get:181 https://deb.debian.org/debian buster/main amd64 libpcre2-16-0 amd64 10.32-5 [202 kB]
Get:182 https://deb.debian.org/debian buster/main amd64 libpcre2-32-0 amd64 10.32-5 [194 kB]
Get:183 https://deb.debian.org/debian buster/main amd64 libpcre2-8-0 amd64 10.32-5 [213 kB]
Get:184 https://deb.debian.org/debian buster/main amd64 libpcre2-posix0 amd64 10.32-5 [38.8 kB]
Get:185 https://deb.debian.org/debian buster/main amd64 libpcre2-dev amd64 10.32-5 [664 kB]
Get:186 https://deb.debian.org/debian buster/main amd64 libpcre32-3 amd64 2:8.39-12 [250 kB]
Get:187 https://deb.debian.org/debian buster/main amd64 libpcrecpp0v5 amd64 2:8.39-12 [152 kB]
Get:188 https://deb.debian.org/debian buster/main amd64 libpcre3-dev amd64 2:8.39-12 [650 kB]
Get:189 https://deb.debian.org/debian buster/main amd64 zlib1g-dev amd64 1:1.2.11.dfsg-1 [214 kB]
Get:190 https://deb.debian.org/debian buster/main amd64 libpng-dev amd64 1.6.36-6 [300 kB]
Get:191 https://deb.debian.org/debian buster/main amd64 libpng-tools amd64 1.6.36-6 [140 kB]
Get:192 https://deb.debian.org/debian buster/main amd64 libreadline-dev amd64 7.0-5 [133 kB]
Get:193 https://deb.debian.org/debian buster/main amd64 libsm6 amd64 2:1.2.3-1 [35.1 kB]
Get:194 https://deb.debian.org/debian buster/main amd64 libtcl8.6 amd64 8.6.9+dfsg-2 [1005 kB]
Get:195 https://deb.debian.org/debian buster/main amd64 libtext-iconv-perl amd64 1.7-5+b7 [15.4 kB]
Get:196 https://deb.debian.org/debian buster/main amd64 libtie-ixhash-perl all 1.23-2 [11.7 kB]
Get:197 https://deb.debian.org/debian buster/main amd64 libwebp6 amd64 0.6.1-2 [263 kB]
Get:198 https://deb.debian.org/debian buster/main amd64 libtiff5 amd64 4.1.0+git191117-2~deb10u1 [271 kB]
Get:199 https://deb.debian.org/debian buster/main amd64 libxft2 amd64 2.3.2-2 [57.2 kB]
Get:200 https://deb.debian.org/debian buster/main amd64 libxss1 amd64 1:1.2.3-1 [17.8 kB]
Get:201 https://deb.debian.org/debian buster/main amd64 libtk8.6 amd64 8.6.9-2 [768 kB]
Get:202 https://deb.debian.org/debian buster/main amd64 libx11-protocol-perl all 0.56-7 [150 kB]
Get:203 https://deb.debian.org/debian buster/main amd64 libxt6 amd64 1:1.1.5-1+b3 [190 kB]
Get:204 https://deb.debian.org/debian buster/main amd64 libxmu6 amd64 2:1.1.2-2+b3 [60.8 kB]
Get:205 https://deb.debian.org/debian buster/main amd64 libxpm4 amd64 1:3.5.12-1 [49.1 kB]
Get:206 https://deb.debian.org/debian buster/main amd64 libxaw7 amd64 2:1.0.13-1+b2 [201 kB]
Get:207 https://deb.debian.org/debian buster/main amd64 libxcb-shape0 amd64 1.13.1-2 [99.5 kB]
Get:208 https://deb.debian.org/debian buster/main amd64 libxcomposite1 amd64 1:0.4.4-2 [16.5 kB]
Get:209 https://deb.debian.org/debian buster/main amd64 libxcursor1 amd64 1:1.1.15-2 [36.6 kB]
Get:210 https://deb.debian.org/debian buster/main amd64 libxi6 amd64 2:1.7.9-1 [82.6 kB]
Get:211 https://deb.debian.org/debian buster/main amd64 libxinerama1 amd64 2:1.1.4-2 [17.7 kB]
Get:212 https://deb.debian.org/debian buster/main amd64 libxml-xpathengine-perl all 0.14-1 [33.3 kB]
Get:213 https://deb.debian.org/debian buster/main amd64 libxmuu1 amd64 2:1.1.2-2+b3 [23.9 kB]
Get:214 https://deb.debian.org/debian buster/main amd64 libxrandr2 amd64 2:1.5.1-1 [37.5 kB]
Get:215 https://deb.debian.org/debian buster/main amd64 libxtst6 amd64 2:1.2.3-1 [27.8 kB]
Get:216 https://deb.debian.org/debian buster/main amd64 libxv1 amd64 2:1.0.11-1 [24.6 kB]
Get:217 https://deb.debian.org/debian buster/main amd64 libxxf86dga1 amd64 2:1.1.4-1+b3 [22.1 kB]
Get:218 https://deb.debian.org/debian buster/main amd64 manpages-dev all 4.16-2 [2232 kB]
Get:219 https://deb.debian.org/debian buster/main amd64 pkg-config amd64 0.29-6 [63.5 kB]
Get:220 https://deb.debian.org/debian buster/main amd64 publicsuffix all 20190415.1030-1 [116 kB]
Get:221 https://deb.debian.org/debian buster/main amd64 zip amd64 3.0-11+b1 [234 kB]
Get:222 https://deb.debian.org/debian buster/main amd64 unzip amd64 6.0-23+deb10u1 [172 kB]
Get:223 https://deb.debian.org/debian buster/main amd64 xdg-utils all 1.1.3-1+deb10u1 [73.7 kB]
Get:224 https://deb.debian.org/debian buster/main amd64 xauth amd64 1:1.0.10-1 [40.3 kB]
Get:225 https://deb.debian.org/debian buster/main amd64 libglx0 amd64 1.1.0-1 [30.0 kB]
Get:226 https://deb.debian.org/debian buster/main amd64 libgl1 amd64 1.1.0-1 [91.1 kB]
Get:227 https://deb.debian.org/debian buster/main amd64 x11-utils amd64 7.7+4 [202 kB]
Get:228 https://deb.debian.org/debian buster/main amd64 x11-xserver-utils amd64 7.7+8 [168 kB]
Get:229 https://deb.debian.org/debian buster/main amd64 xdg-user-dirs amd64 0.17-2 [53.8 kB]
Get:230 http://cloud.r-project.org/bin/linux/debian buster-cran35/ r-cran-boot 1.3-24-2~bustercran.0 [624 kB]
Get:231 http://cloud.r-project.org/bin/linux/debian buster-cran35/ r-cran-cluster 2.1.0-2~bustercran.0 [546 kB]
Get:232 http://cloud.r-project.org/bin/linux/debian buster-cran35/ r-cran-foreign 0.8.75-1~bustercran.0 [248 kB]
Get:233 http://cloud.r-project.org/bin/linux/debian buster-cran35/ r-cran-mass 7.3-51.5-2~bustercran.0 [1123 kB]
Get:234 http://cloud.r-project.org/bin/linux/debian buster-cran35/ r-cran-kernsmooth 2.23-16-1+1~bustercran.0 [92.1 kB]
Get:235 http://cloud.r-project.org/bin/linux/debian buster-cran35/ r-cran-lattice 0.20-40-1~bustercran.0 [1137 kB]
Get:236 http://cloud.r-project.org/bin/linux/debian buster-cran35/ r-cran-nlme 3.1.144-1~bustercran.0 [2269 kB]
Get:237 http://cloud.r-project.org/bin/linux/debian buster-cran35/ r-cran-matrix 1.2-18-1~bustercran.0 [3447 kB]
Get:238 http://cloud.r-project.org/bin/linux/debian buster-cran35/ r-cran-mgcv 1.8-31-1~bustercran.0 [2786 kB]
Get:239 http://cloud.r-project.org/bin/linux/debian buster-cran35/ r-cran-survival 3.1-8-1~bustercran.0 [7425 kB]
Get:240 http://cloud.r-project.org/bin/linux/debian buster-cran35/ r-cran-rpart 4.1-15-2~bustercran.0 [705 kB]
Get:241 http://cloud.r-project.org/bin/linux/debian buster-cran35/ r-cran-class 7.3-15-1~bustercran.0 [88.1 kB]
Get:242 http://cloud.r-project.org/bin/linux/debian buster-cran35/ r-cran-nnet 7.3-12-2~bustercran.0 [112 kB]
Get:243 http://cloud.r-project.org/bin/linux/debian buster-cran35/ r-cran-spatial 7.3-11-2~bustercran.0 [129 kB]
Get:244 http://cloud.r-project.org/bin/linux/debian buster-cran35/ r-cran-codetools 0.2-16-1~bustercran.0 [92.4 kB]
Get:245 http://cloud.r-project.org/bin/linux/debian buster-cran35/ r-recommended 3.6.3-1~bustercran.0 [2776 B]
Get:246 http://cloud.r-project.org/bin/linux/debian buster-cran35/ r-base 3.6.3-1~bustercran.0 [43.2 kB]
Get:247 http://cloud.r-project.org/bin/linux/debian buster-cran35/ r-base-dev 3.6.3-1~bustercran.0 [4484 B]
Get:248 http://cloud.r-project.org/bin/linux/debian buster-cran35/ r-base-html 3.6.3-1~bustercran.0 [89.9 kB]
Get:249 http://cloud.r-project.org/bin/linux/debian buster-cran35/ r-doc-html 3.6.3-1~bustercran.0 [570 kB]
debconf: delaying package configuration, since apt-utils is not installed
Fetched 176 MB in 6s (29.6 MB/s)
(Reading database ... 
(Reading database ... 5%
(Reading database ... 10%
(Reading database ... 15%
(Reading database ... 20%
(Reading database ... 25%
(Reading database ... 30%
(Reading database ... 35%
(Reading database ... 40%
(Reading database ... 45%
(Reading database ... 50%
(Reading database ... 55%
(Reading database ... 60%
(Reading database ... 65%
(Reading database ... 70%
(Reading database ... 75%
(Reading database ... 80%
(Reading database ... 85%
(Reading database ... 90%
(Reading database ... 95%
(Reading database ... 100%
(Reading database ... 7614 files and directories currently installed.)
Preparing to unpack .../perl-base_5.28.1-6+deb10u1_amd64.deb ...
Unpacking perl-base (5.28.1-6+deb10u1) over (5.28.1-6) ...
Setting up perl-base (5.28.1-6+deb10u1) ...
Selecting previously unselected package perl-modules-5.28.
(Reading database ... 
(Reading database ... 5%
(Reading database ... 10%
(Reading database ... 15%
(Reading database ... 20%
(Reading database ... 25%
(Reading database ... 30%
(Reading database ... 35%
(Reading database ... 40%
(Reading database ... 45%
(Reading database ... 50%
(Reading database ... 55%
(Reading database ... 60%
(Reading database ... 65%
(Reading database ... 70%
(Reading database ... 75%
(Reading database ... 80%
(Reading database ... 85%
(Reading database ... 90%
(Reading database ... 95%
(Reading database ... 100%
(Reading database ... 7614 files and directories currently installed.)
Preparing to unpack .../000-perl-modules-5.28_5.28.1-6+deb10u1_all.deb ...
Unpacking perl-modules-5.28 (5.28.1-6+deb10u1) ...
Selecting previously unselected package libgdbm6:amd64.
Preparing to unpack .../001-libgdbm6_1.18.1-4_amd64.deb ...
Unpacking libgdbm6:amd64 (1.18.1-4) ...
Selecting previously unselected package libgdbm-compat4:amd64.
Preparing to unpack .../002-libgdbm-compat4_1.18.1-4_amd64.deb ...
Unpacking libgdbm-compat4:amd64 (1.18.1-4) ...
Selecting previously unselected package libperl5.28:amd64.
Preparing to unpack .../003-libperl5.28_5.28.1-6+deb10u1_amd64.deb ...
Unpacking libperl5.28:amd64 (5.28.1-6+deb10u1) ...
Selecting previously unselected package perl.
Preparing to unpack .../004-perl_5.28.1-6+deb10u1_amd64.deb ...
Unpacking perl (5.28.1-6+deb10u1) ...
Selecting previously unselected package liblocale-gettext-perl.
Preparing to unpack .../005-liblocale-gettext-perl_1.07-3+b4_amd64.deb ...
Unpacking liblocale-gettext-perl (1.07-3+b4) ...
Selecting previously unselected package netbase.
Preparing to unpack .../006-netbase_5.6_all.deb ...
Unpacking netbase (5.6) ...
Selecting previously unselected package sensible-utils.
Preparing to unpack .../007-sensible-utils_0.0.12_all.deb ...
Unpacking sensible-utils (0.0.12) ...
Selecting previously unselected package bzip2.
Preparing to unpack .../008-bzip2_1.0.6-9.2~deb10u1_amd64.deb ...
Unpacking bzip2 (1.0.6-9.2~deb10u1) ...
Selecting previously unselected package libapparmor1:amd64.
Preparing to unpack .../009-libapparmor1_2.13.2-10_amd64.deb ...
Unpacking libapparmor1:amd64 (2.13.2-10) ...
Selecting previously unselected package libdbus-1-3:amd64.
Preparing to unpack .../010-libdbus-1-3_1.12.20-0+deb10u1_amd64.deb ...
Unpacking libdbus-1-3:amd64 (1.12.20-0+deb10u1) ...
Selecting previously unselected package libexpat1:amd64.
Preparing to unpack .../011-libexpat1_2.2.6-2+deb10u1_amd64.deb ...
Unpacking libexpat1:amd64 (2.2.6-2+deb10u1) ...
Selecting previously unselected package dbus.
Preparing to unpack .../012-dbus_1.12.20-0+deb10u1_amd64.deb ...
Unpacking dbus (1.12.20-0+deb10u1) ...
Selecting previously unselected package manpages.
Preparing to unpack .../013-manpages_4.16-2_all.deb ...
Unpacking manpages (4.16-2) ...
Selecting previously unselected package ucf.
Preparing to unpack .../014-ucf_3.0038+nmu1_all.deb ...
Moving old data out of the way
Unpacking ucf (3.0038+nmu1) ...
Selecting previously unselected package xz-utils.
Preparing to unpack .../015-xz-utils_5.2.4-1_amd64.deb ...
Unpacking xz-utils (5.2.4-1) ...
Selecting previously unselected package binutils-common:amd64.
Preparing to unpack .../016-binutils-common_2.31.1-16_amd64.deb ...
Unpacking binutils-common:amd64 (2.31.1-16) ...
Selecting previously unselected package libbinutils:amd64.
Preparing to unpack .../017-libbinutils_2.31.1-16_amd64.deb ...
Unpacking libbinutils:amd64 (2.31.1-16) ...
Selecting previously unselected package binutils-x86-64-linux-gnu.
Preparing to unpack .../018-binutils-x86-64-linux-gnu_2.31.1-16_amd64.deb ...
Unpacking binutils-x86-64-linux-gnu (2.31.1-16) ...
Selecting previously unselected package binutils.
Preparing to unpack .../019-binutils_2.31.1-16_amd64.deb ...
Unpacking binutils (2.31.1-16) ...
Selecting previously unselected package libc-dev-bin.
Preparing to unpack .../020-libc-dev-bin_2.28-10_amd64.deb ...
Unpacking libc-dev-bin (2.28-10) ...
Selecting previously unselected package linux-libc-dev:amd64.
Preparing to unpack .../021-linux-libc-dev_4.19.160-2_amd64.deb ...
Unpacking linux-libc-dev:amd64 (4.19.160-2) ...
Selecting previously unselected package libc6-dev:amd64.
Preparing to unpack .../022-libc6-dev_2.28-10_amd64.deb ...
Unpacking libc6-dev:amd64 (2.28-10) ...
Selecting previously unselected package libisl19:amd64.
Preparing to unpack .../023-libisl19_0.20-2_amd64.deb ...
Unpacking libisl19:amd64 (0.20-2) ...
Selecting previously unselected package libmpfr6:amd64.
Preparing to unpack .../024-libmpfr6_4.0.2-1_amd64.deb ...
Unpacking libmpfr6:amd64 (4.0.2-1) ...
Selecting previously unselected package libmpc3:amd64.
Preparing to unpack .../025-libmpc3_1.1.0-1_amd64.deb ...
Unpacking libmpc3:amd64 (1.1.0-1) ...
Selecting previously unselected package cpp-8.
Preparing to unpack .../026-cpp-8_8.3.0-6_amd64.deb ...
Unpacking cpp-8 (8.3.0-6) ...
Selecting previously unselected package cpp.
Preparing to unpack .../027-cpp_4%3a8.3.0-1_amd64.deb ...
Unpacking cpp (4:8.3.0-1) ...
Selecting previously unselected package libcc1-0:amd64.
Preparing to unpack .../028-libcc1-0_8.3.0-6_amd64.deb ...
Unpacking libcc1-0:amd64 (8.3.0-6) ...
Selecting previously unselected package libgomp1:amd64.
Preparing to unpack .../029-libgomp1_8.3.0-6_amd64.deb ...
Unpacking libgomp1:amd64 (8.3.0-6) ...
Selecting previously unselected package libitm1:amd64.
Preparing to unpack .../030-libitm1_8.3.0-6_amd64.deb ...
Unpacking libitm1:amd64 (8.3.0-6) ...
Selecting previously unselected package libatomic1:amd64.
Preparing to unpack .../031-libatomic1_8.3.0-6_amd64.deb ...
Unpacking libatomic1:amd64 (8.3.0-6) ...
Selecting previously unselected package libasan5:amd64.
Preparing to unpack .../032-libasan5_8.3.0-6_amd64.deb ...
Unpacking libasan5:amd64 (8.3.0-6) ...
Selecting previously unselected package liblsan0:amd64.
Preparing to unpack .../033-liblsan0_8.3.0-6_amd64.deb ...
Unpacking liblsan0:amd64 (8.3.0-6) ...
Selecting previously unselected package libtsan0:amd64.
Preparing to unpack .../034-libtsan0_8.3.0-6_amd64.deb ...
Unpacking libtsan0:amd64 (8.3.0-6) ...
Selecting previously unselected package libubsan1:amd64.
Preparing to unpack .../035-libubsan1_8.3.0-6_amd64.deb ...
Unpacking libubsan1:amd64 (8.3.0-6) ...
Selecting previously unselected package libmpx2:amd64.
Preparing to unpack .../036-libmpx2_8.3.0-6_amd64.deb ...
Unpacking libmpx2:amd64 (8.3.0-6) ...
Selecting previously unselected package libquadmath0:amd64.
Preparing to unpack .../037-libquadmath0_8.3.0-6_amd64.deb ...
Unpacking libquadmath0:amd64 (8.3.0-6) ...
Selecting previously unselected package libgcc-8-dev:amd64.
Preparing to unpack .../038-libgcc-8-dev_8.3.0-6_amd64.deb ...
Unpacking libgcc-8-dev:amd64 (8.3.0-6) ...
Selecting previously unselected package gcc-8.
Preparing to unpack .../039-gcc-8_8.3.0-6_amd64.deb ...
Unpacking gcc-8 (8.3.0-6) ...
Selecting previously unselected package gcc.
Preparing to unpack .../040-gcc_4%3a8.3.0-1_amd64.deb ...
Unpacking gcc (4:8.3.0-1) ...
Selecting previously unselected package libstdc++-8-dev:amd64.
Preparing to unpack .../041-libstdc++-8-dev_8.3.0-6_amd64.deb ...
Unpacking libstdc++-8-dev:amd64 (8.3.0-6) ...
Selecting previously unselected package g++-8.
Preparing to unpack .../042-g++-8_8.3.0-6_amd64.deb ...
Unpacking g++-8 (8.3.0-6) ...
Selecting previously unselected package g++.
Preparing to unpack .../043-g++_4%3a8.3.0-1_amd64.deb ...
Unpacking g++ (4:8.3.0-1) ...
Selecting previously unselected package make.
Preparing to unpack .../044-make_4.2.1-1.2_amd64.deb ...
Unpacking make (4.2.1-1.2) ...
Selecting previously unselected package libdpkg-perl.
Preparing to unpack .../045-libdpkg-perl_1.19.7_all.deb ...
Unpacking libdpkg-perl (1.19.7) ...
Selecting previously unselected package patch.
Preparing to unpack .../046-patch_2.7.6-3+deb10u1_amd64.deb ...
Unpacking patch (2.7.6-3+deb10u1) ...
Selecting previously unselected package dpkg-dev.
Preparing to unpack .../047-dpkg-dev_1.19.7_all.deb ...
Unpacking dpkg-dev (1.19.7) ...
Selecting previously unselected package build-essential.
Preparing to unpack .../048-build-essential_12.6_amd64.deb ...
Unpacking build-essential (12.6) ...
Selecting previously unselected package bzip2-doc.
Preparing to unpack .../049-bzip2-doc_1.0.6-9.2~deb10u1_all.deb ...
Unpacking bzip2-doc (1.0.6-9.2~deb10u1) ...
Selecting previously unselected package libfakeroot:amd64.
Preparing to unpack .../050-libfakeroot_1.23-1_amd64.deb ...
Unpacking libfakeroot:amd64 (1.23-1) ...
Selecting previously unselected package fakeroot.
Preparing to unpack .../051-fakeroot_1.23-1_amd64.deb ...
Unpacking fakeroot (1.23-1) ...
Selecting previously unselected package libpng16-16:amd64.
Preparing to unpack .../052-libpng16-16_1.6.36-6_amd64.deb ...
Unpacking libpng16-16:amd64 (1.6.36-6) ...
Selecting previously unselected package libfreetype6:amd64.
Preparing to unpack .../053-libfreetype6_2.9.1-3+deb10u2_amd64.deb ...
Unpacking libfreetype6:amd64 (2.9.1-3+deb10u2) ...
Selecting previously unselected package fonts-dejavu-core.
Preparing to unpack .../054-fonts-dejavu-core_2.37-1_all.deb ...
Unpacking fonts-dejavu-core (2.37-1) ...
Selecting previously unselected package fontconfig-config.
Preparing to unpack .../055-fontconfig-config_2.13.1-2_all.deb ...
Unpacking fontconfig-config (2.13.1-2) ...
Selecting previously unselected package libfontconfig1:amd64.
Preparing to unpack .../056-libfontconfig1_2.13.1-2_amd64.deb ...
Unpacking libfontconfig1:amd64 (2.13.1-2) ...
Selecting previously unselected package fontconfig.
Preparing to unpack .../057-fontconfig_2.13.1-2_amd64.deb ...
Unpacking fontconfig (2.13.1-2) ...
Selecting previously unselected package libgfortran5:amd64.
Preparing to unpack .../058-libgfortran5_8.3.0-6_amd64.deb ...
Unpacking libgfortran5:amd64 (8.3.0-6) ...
Selecting previously unselected package libgfortran-8-dev:amd64.
Preparing to unpack .../059-libgfortran-8-dev_8.3.0-6_amd64.deb ...
Unpacking libgfortran-8-dev:amd64 (8.3.0-6) ...
Selecting previously unselected package gfortran-8.
Preparing to unpack .../060-gfortran-8_8.3.0-6_amd64.deb ...
Unpacking gfortran-8 (8.3.0-6) ...
Selecting previously unselected package gfortran.
Preparing to unpack .../061-gfortran_4%3a8.3.0-1_amd64.deb ...
Unpacking gfortran (4:8.3.0-1) ...
Selecting previously unselected package icu-devtools.
Preparing to unpack .../062-icu-devtools_63.1-6+deb10u1_amd64.deb ...
Unpacking icu-devtools (63.1-6+deb10u1) ...
Selecting previously unselected package libalgorithm-diff-perl.
Preparing to unpack .../063-libalgorithm-diff-perl_1.19.03-2_all.deb ...
Unpacking libalgorithm-diff-perl (1.19.03-2) ...
Selecting previously unselected package libalgorithm-diff-xs-perl.
Preparing to unpack .../064-libalgorithm-diff-xs-perl_0.04-5+b1_amd64.deb ...
Unpacking libalgorithm-diff-xs-perl (0.04-5+b1) ...
Selecting previously unselected package libalgorithm-merge-perl.
Preparing to unpack .../065-libalgorithm-merge-perl_0.08-3_all.deb ...
Unpacking libalgorithm-merge-perl (0.08-3) ...
Selecting previously unselected package libauthen-sasl-perl.
Preparing to unpack .../066-libauthen-sasl-perl_2.1600-1_all.deb ...
Unpacking libauthen-sasl-perl (2.1600-1) ...
Selecting previously unselected package libblas3:amd64.
Preparing to unpack .../067-libblas3_3.8.0-2_amd64.deb ...
Unpacking libblas3:amd64 (3.8.0-2) ...
Selecting previously unselected package libblas-dev:amd64.
Preparing to unpack .../068-libblas-dev_3.8.0-2_amd64.deb ...
Unpacking libblas-dev:amd64 (3.8.0-2) ...
Selecting previously unselected package libbsd0:amd64.
Preparing to unpack .../069-libbsd0_0.9.1-2_amd64.deb ...
Unpacking libbsd0:amd64 (0.9.1-2) ...
Selecting previously unselected package libbz2-dev:amd64.
Preparing to unpack .../070-libbz2-dev_1.0.6-9.2~deb10u1_amd64.deb ...
Unpacking libbz2-dev:amd64 (1.0.6-9.2~deb10u1) ...
Selecting previously unselected package libpixman-1-0:amd64.
Preparing to unpack .../071-libpixman-1-0_0.36.0-1_amd64.deb ...
Unpacking libpixman-1-0:amd64 (0.36.0-1) ...
Selecting previously unselected package libxau6:amd64.
Preparing to unpack .../072-libxau6_1%3a1.0.8-1+b2_amd64.deb ...
Unpacking libxau6:amd64 (1:1.0.8-1+b2) ...
Selecting previously unselected package libxdmcp6:amd64.
Preparing to unpack .../073-libxdmcp6_1%3a1.1.2-3_amd64.deb ...
Unpacking libxdmcp6:amd64 (1:1.1.2-3) ...
Selecting previously unselected package libxcb1:amd64.
Preparing to unpack .../074-libxcb1_1.13.1-2_amd64.deb ...
Unpacking libxcb1:amd64 (1.13.1-2) ...
Selecting previously unselected package libx11-data.
Preparing to unpack .../075-libx11-data_2%3a1.6.7-1+deb10u1_all.deb ...
Unpacking libx11-data (2:1.6.7-1+deb10u1) ...
Selecting previously unselected package libx11-6:amd64.
Preparing to unpack .../076-libx11-6_2%3a1.6.7-1+deb10u1_amd64.deb ...
Unpacking libx11-6:amd64 (2:1.6.7-1+deb10u1) ...
Selecting previously unselected package libxcb-render0:amd64.
Preparing to unpack .../077-libxcb-render0_1.13.1-2_amd64.deb ...
Unpacking libxcb-render0:amd64 (1.13.1-2) ...
Selecting previously unselected package libxcb-shm0:amd64.
Preparing to unpack .../078-libxcb-shm0_1.13.1-2_amd64.deb ...
Unpacking libxcb-shm0:amd64 (1.13.1-2) ...
Selecting previously unselected package libxext6:amd64.
Preparing to unpack .../079-libxext6_2%3a1.3.3-1+b2_amd64.deb ...
Unpacking libxext6:amd64 (2:1.3.3-1+b2) ...
Selecting previously unselected package libxrender1:amd64.
Preparing to unpack .../080-libxrender1_1%3a0.9.10-1_amd64.deb ...
Unpacking libxrender1:amd64 (1:0.9.10-1) ...
Selecting previously unselected package libcairo2:amd64.
Preparing to unpack .../081-libcairo2_1.16.0-4_amd64.deb ...
Unpacking libcairo2:amd64 (1.16.0-4) ...
Selecting previously unselected package libnghttp2-14:amd64.
Preparing to unpack .../082-libnghttp2-14_1.36.0-2+deb10u1_amd64.deb ...
Unpacking libnghttp2-14:amd64 (1.36.0-2+deb10u1) ...
Selecting previously unselected package libpsl5:amd64.
Preparing to unpack .../083-libpsl5_0.20.2-2_amd64.deb ...
Unpacking libpsl5:amd64 (0.20.2-2) ...
Selecting previously unselected package librtmp1:amd64.
Preparing to unpack .../084-librtmp1_2.4+20151223.gitfa8646d.1-2_amd64.deb ...
Unpacking librtmp1:amd64 (2.4+20151223.gitfa8646d.1-2) ...
Selecting previously unselected package libssh2-1:amd64.
Preparing to unpack .../085-libssh2-1_1.8.0-2.1_amd64.deb ...
Unpacking libssh2-1:amd64 (1.8.0-2.1) ...
Selecting previously unselected package libcurl4:amd64.
Preparing to unpack .../086-libcurl4_7.64.0-4+deb10u1_amd64.deb ...
Unpacking libcurl4:amd64 (7.64.0-4+deb10u1) ...
Selecting previously unselected package libdata-dump-perl.
Preparing to unpack .../087-libdata-dump-perl_1.23-1_all.deb ...
Unpacking libdata-dump-perl (1.23-1) ...
Selecting previously unselected package libdatrie1:amd64.
Preparing to unpack .../088-libdatrie1_0.2.12-2_amd64.deb ...
Unpacking libdatrie1:amd64 (0.2.12-2) ...
Selecting previously unselected package libdrm-common.
Preparing to unpack .../089-libdrm-common_2.4.97-1_all.deb ...
Unpacking libdrm-common (2.4.97-1) ...
Selecting previously unselected package libdrm2:amd64.
Preparing to unpack .../090-libdrm2_2.4.97-1_amd64.deb ...
Unpacking libdrm2:amd64 (2.4.97-1) ...
Selecting previously unselected package libdrm-amdgpu1:amd64.
Preparing to unpack .../091-libdrm-amdgpu1_2.4.97-1_amd64.deb ...
Unpacking libdrm-amdgpu1:amd64 (2.4.97-1) ...
Selecting previously unselected package libpciaccess0:amd64.
Preparing to unpack .../092-libpciaccess0_0.14-1_amd64.deb ...
Unpacking libpciaccess0:amd64 (0.14-1) ...
Selecting previously unselected package libdrm-intel1:amd64.
Preparing to unpack .../093-libdrm-intel1_2.4.97-1_amd64.deb ...
Unpacking libdrm-intel1:amd64 (2.4.97-1) ...
Selecting previously unselected package libdrm-nouveau2:amd64.
Preparing to unpack .../094-libdrm-nouveau2_2.4.97-1_amd64.deb ...
Unpacking libdrm-nouveau2:amd64 (2.4.97-1) ...
Selecting previously unselected package libdrm-radeon1:amd64.
Preparing to unpack .../095-libdrm-radeon1_2.4.97-1_amd64.deb ...
Unpacking libdrm-radeon1:amd64 (2.4.97-1) ...
Selecting previously unselected package libedit2:amd64.
Preparing to unpack .../096-libedit2_3.1-20181209-1_amd64.deb ...
Unpacking libedit2:amd64 (3.1-20181209-1) ...
Selecting previously unselected package libelf1:amd64.
Preparing to unpack .../097-libelf1_0.176-1.1_amd64.deb ...
Unpacking libelf1:amd64 (0.176-1.1) ...
Selecting previously unselected package libencode-locale-perl.
Preparing to unpack .../098-libencode-locale-perl_1.05-1_all.deb ...
Unpacking libencode-locale-perl (1.05-1) ...
Selecting previously unselected package libipc-system-simple-perl.
Preparing to unpack .../099-libipc-system-simple-perl_1.25-4_all.deb ...
Unpacking libipc-system-simple-perl (1.25-4) ...
Selecting previously unselected package libfile-basedir-perl.
Preparing to unpack .../100-libfile-basedir-perl_0.08-1_all.deb ...
Unpacking libfile-basedir-perl (0.08-1) ...
Selecting previously unselected package liburi-perl.
Preparing to unpack .../101-liburi-perl_1.76-1_all.deb ...
Unpacking liburi-perl (1.76-1) ...
Selecting previously unselected package libfile-desktopentry-perl.
Preparing to unpack .../102-libfile-desktopentry-perl_0.22-1_all.deb ...
Unpacking libfile-desktopentry-perl (0.22-1) ...
Selecting previously unselected package libfile-fcntllock-perl.
Preparing to unpack .../103-libfile-fcntllock-perl_0.22-3+b5_amd64.deb ...
Unpacking libfile-fcntllock-perl (0.22-3+b5) ...
Selecting previously unselected package libtimedate-perl.
Preparing to unpack .../104-libtimedate-perl_2.3000-2+deb10u1_all.deb ...
Unpacking libtimedate-perl (2.3000-2+deb10u1) ...
Selecting previously unselected package libhttp-date-perl.
Preparing to unpack .../105-libhttp-date-perl_6.02-1_all.deb ...
Unpacking libhttp-date-perl (6.02-1) ...
Selecting previously unselected package libfile-listing-perl.
Preparing to unpack .../106-libfile-listing-perl_6.04-1_all.deb ...
Unpacking libfile-listing-perl (6.04-1) ...
Selecting previously unselected package libglib2.0-0:amd64.
Preparing to unpack .../107-libglib2.0-0_2.58.3-2+deb10u2_amd64.deb ...
Unpacking libglib2.0-0:amd64 (2.58.3-2+deb10u2) ...
Selecting previously unselected package shared-mime-info.
Preparing to unpack .../108-shared-mime-info_1.10-1_amd64.deb ...
Unpacking shared-mime-info (1.10-1) ...
Selecting previously unselected package libfile-mimeinfo-perl.
Preparing to unpack .../109-libfile-mimeinfo-perl_0.29-1_all.deb ...
Unpacking libfile-mimeinfo-perl (0.29-1) ...
Selecting previously unselected package libfont-afm-perl.
Preparing to unpack .../110-libfont-afm-perl_1.20-2_all.deb ...
Unpacking libfont-afm-perl (1.20-2) ...
Selecting previously unselected package libfontenc1:amd64.
Preparing to unpack .../111-libfontenc1_1%3a1.1.3-1+b2_amd64.deb ...
Unpacking libfontenc1:amd64 (1:1.1.3-1+b2) ...
Selecting previously unselected package libfribidi0:amd64.
Preparing to unpack .../112-libfribidi0_1.0.5-3.1+deb10u1_amd64.deb ...
Unpacking libfribidi0:amd64 (1.0.5-3.1+deb10u1) ...
Selecting previously unselected package libglapi-mesa:amd64.
Preparing to unpack .../113-libglapi-mesa_18.3.6-2+deb10u1_amd64.deb ...
Unpacking libglapi-mesa:amd64 (18.3.6-2+deb10u1) ...
Selecting previously unselected package libllvm7:amd64.
Preparing to unpack .../114-libllvm7_1%3a7.0.1-8+deb10u2_amd64.deb ...
Unpacking libllvm7:amd64 (1:7.0.1-8+deb10u2) ...
Selecting previously unselected package libsensors-config.
Preparing to unpack .../115-libsensors-config_1%3a3.5.0-3_all.deb ...
Unpacking libsensors-config (1:3.5.0-3) ...
Selecting previously unselected package libsensors5:amd64.
Preparing to unpack .../116-libsensors5_1%3a3.5.0-3_amd64.deb ...
Unpacking libsensors5:amd64 (1:3.5.0-3) ...
Selecting previously unselected package libgl1-mesa-dri:amd64.
Preparing to unpack .../117-libgl1-mesa-dri_18.3.6-2+deb10u1_amd64.deb ...
Unpacking libgl1-mesa-dri:amd64 (18.3.6-2+deb10u1) ...
Selecting previously unselected package libglib2.0-data.
Preparing to unpack .../118-libglib2.0-data_2.58.3-2+deb10u2_all.deb ...
Unpacking libglib2.0-data (2.58.3-2+deb10u2) ...
Selecting previously unselected package libglvnd0:amd64.
Preparing to unpack .../119-libglvnd0_1.1.0-1_amd64.deb ...
Unpacking libglvnd0:amd64 (1.1.0-1) ...
Selecting previously unselected package libx11-xcb1:amd64.
Preparing to unpack .../120-libx11-xcb1_2%3a1.6.7-1+deb10u1_amd64.deb ...
Unpacking libx11-xcb1:amd64 (2:1.6.7-1+deb10u1) ...
Selecting previously unselected package libxcb-dri2-0:amd64.
Preparing to unpack .../121-libxcb-dri2-0_1.13.1-2_amd64.deb ...
Unpacking libxcb-dri2-0:amd64 (1.13.1-2) ...
Selecting previously unselected package libxcb-dri3-0:amd64.
Preparing to unpack .../122-libxcb-dri3-0_1.13.1-2_amd64.deb ...
Unpacking libxcb-dri3-0:amd64 (1.13.1-2) ...
Selecting previously unselected package libxcb-glx0:amd64.
Preparing to unpack .../123-libxcb-glx0_1.13.1-2_amd64.deb ...
Unpacking libxcb-glx0:amd64 (1.13.1-2) ...
Selecting previously unselected package libxcb-present0:amd64.
Preparing to unpack .../124-libxcb-present0_1.13.1-2_amd64.deb ...
Unpacking libxcb-present0:amd64 (1.13.1-2) ...
Selecting previously unselected package libxcb-sync1:amd64.
Preparing to unpack .../125-libxcb-sync1_1.13.1-2_amd64.deb ...
Unpacking libxcb-sync1:amd64 (1.13.1-2) ...
Selecting previously unselected package libxfixes3:amd64.
Preparing to unpack .../126-libxfixes3_1%3a5.0.3-1_amd64.deb ...
Unpacking libxfixes3:amd64 (1:5.0.3-1) ...
Selecting previously unselected package libxdamage1:amd64.
Preparing to unpack .../127-libxdamage1_1%3a1.1.4-3+b3_amd64.deb ...
Unpacking libxdamage1:amd64 (1:1.1.4-3+b3) ...
Selecting previously unselected package libxshmfence1:amd64.
Preparing to unpack .../128-libxshmfence1_1.3-1_amd64.deb ...
Unpacking libxshmfence1:amd64 (1.3-1) ...
Selecting previously unselected package libxxf86vm1:amd64.
Preparing to unpack .../129-libxxf86vm1_1%3a1.1.4-1+b2_amd64.deb ...
Unpacking libxxf86vm1:amd64 (1:1.1.4-1+b2) ...
Selecting previously unselected package libglx-mesa0:amd64.
Preparing to unpack .../130-libglx-mesa0_18.3.6-2+deb10u1_amd64.deb ...
Unpacking libglx-mesa0:amd64 (18.3.6-2+deb10u1) ...
Selecting previously unselected package libgraphite2-3:amd64.
Preparing to unpack .../131-libgraphite2-3_1.3.13-7_amd64.deb ...
Unpacking libgraphite2-3:amd64 (1.3.13-7) ...
Selecting previously unselected package libharfbuzz0b:amd64.
Preparing to unpack .../132-libharfbuzz0b_2.3.1-1_amd64.deb ...
Unpacking libharfbuzz0b:amd64 (2.3.1-1) ...
Selecting previously unselected package libhtml-tagset-perl.
Preparing to unpack .../133-libhtml-tagset-perl_3.20-3_all.deb ...
Unpacking libhtml-tagset-perl (3.20-3) ...
Selecting previously unselected package libhtml-parser-perl.
Preparing to unpack .../134-libhtml-parser-perl_3.72-3+b3_amd64.deb ...
Unpacking libhtml-parser-perl (3.72-3+b3) ...
Selecting previously unselected package libio-html-perl.
Preparing to unpack .../135-libio-html-perl_1.001-1_all.deb ...
Unpacking libio-html-perl (1.001-1) ...
Selecting previously unselected package liblwp-mediatypes-perl.
Preparing to unpack .../136-liblwp-mediatypes-perl_6.02-1_all.deb ...
Unpacking liblwp-mediatypes-perl (6.02-1) ...
Selecting previously unselected package libhttp-message-perl.
Preparing to unpack .../137-libhttp-message-perl_6.18-1_all.deb ...
Unpacking libhttp-message-perl (6.18-1) ...
Selecting previously unselected package libhtml-form-perl.
Preparing to unpack .../138-libhtml-form-perl_6.03-1_all.deb ...
Unpacking libhtml-form-perl (6.03-1) ...
Selecting previously unselected package libhtml-tree-perl.
Preparing to unpack .../139-libhtml-tree-perl_5.07-2_all.deb ...
Unpacking libhtml-tree-perl (5.07-2) ...
Selecting previously unselected package libhtml-format-perl.
Preparing to unpack .../140-libhtml-format-perl_2.12-1_all.deb ...
Unpacking libhtml-format-perl (2.12-1) ...
Selecting previously unselected package libhttp-cookies-perl.
Preparing to unpack .../141-libhttp-cookies-perl_6.04-1_all.deb ...
Unpacking libhttp-cookies-perl (6.04-1) ...
Selecting previously unselected package libhttp-daemon-perl.
Preparing to unpack .../142-libhttp-daemon-perl_6.01-3_all.deb ...
Unpacking libhttp-daemon-perl (6.01-3) ...
Selecting previously unselected package libhttp-negotiate-perl.
Preparing to unpack .../143-libhttp-negotiate-perl_6.01-1_all.deb ...
Unpacking libhttp-negotiate-perl (6.01-1) ...
Selecting previously unselected package x11-common.
Preparing to unpack .../144-x11-common_1%3a7.7+19_all.deb ...
Unpacking x11-common (1:7.7+19) ...
Selecting previously unselected package libice6:amd64.
Preparing to unpack .../145-libice6_2%3a1.0.9-2_amd64.deb ...
Unpacking libice6:amd64 (2:1.0.9-2) ...
Selecting previously unselected package libicu-dev:amd64.
Preparing to unpack .../146-libicu-dev_63.1-6+deb10u1_amd64.deb ...
Unpacking libicu-dev:amd64 (63.1-6+deb10u1) ...
Selecting previously unselected package perl-openssl-defaults:amd64.
Preparing to unpack .../147-perl-openssl-defaults_3_amd64.deb ...
Unpacking perl-openssl-defaults:amd64 (3) ...
Selecting previously unselected package libnet-ssleay-perl.
Preparing to unpack .../148-libnet-ssleay-perl_1.85-2+b1_amd64.deb ...
Unpacking libnet-ssleay-perl (1.85-2+b1) ...
Selecting previously unselected package libio-socket-ssl-perl.
Preparing to unpack .../149-libio-socket-ssl-perl_2.060-3_all.deb ...
Unpacking libio-socket-ssl-perl (2.060-3) ...
Selecting previously unselected package libio-stringy-perl.
Preparing to unpack .../150-libio-stringy-perl_2.111-3_all.deb ...
Unpacking libio-stringy-perl (2.111-3) ...
Selecting previously unselected package libjbig0:amd64.
Preparing to unpack .../151-libjbig0_2.1-3.1+b2_amd64.deb ...
Unpacking libjbig0:amd64 (2.1-3.1+b2) ...
Selecting previously unselected package libjpeg62-turbo:amd64.
Preparing to unpack .../152-libjpeg62-turbo_1%3a1.5.2-2+deb10u1_amd64.deb ...
Unpacking libjpeg62-turbo:amd64 (1:1.5.2-2+deb10u1) ...
Selecting previously unselected package libjpeg62-turbo-dev:amd64.
Preparing to unpack .../153-libjpeg62-turbo-dev_1%3a1.5.2-2+deb10u1_amd64.deb ...
Unpacking libjpeg62-turbo-dev:amd64 (1:1.5.2-2+deb10u1) ...
Selecting previously unselected package libjpeg-dev.
Preparing to unpack .../154-libjpeg-dev_1%3a1.5.2-2+deb10u1_all.deb ...
Unpacking libjpeg-dev (1:1.5.2-2+deb10u1) ...
Selecting previously unselected package liblapack3:amd64.
Preparing to unpack .../155-liblapack3_3.8.0-2_amd64.deb ...
Unpacking liblapack3:amd64 (3.8.0-2) ...
Selecting previously unselected package liblapack-dev:amd64.
Preparing to unpack .../156-liblapack-dev_3.8.0-2_amd64.deb ...
Unpacking liblapack-dev:amd64 (3.8.0-2) ...
Selecting previously unselected package libnet-http-perl.
Preparing to unpack .../157-libnet-http-perl_6.18-1_all.deb ...
Unpacking libnet-http-perl (6.18-1) ...
Selecting previously unselected package libtry-tiny-perl.
Preparing to unpack .../158-libtry-tiny-perl_0.30-1_all.deb ...
Unpacking libtry-tiny-perl (0.30-1) ...
Selecting previously unselected package libwww-robotrules-perl.
Preparing to unpack .../159-libwww-robotrules-perl_6.02-1_all.deb ...
Unpacking libwww-robotrules-perl (6.02-1) ...
Selecting previously unselected package libwww-perl.
Preparing to unpack .../160-libwww-perl_6.36-2_all.deb ...
Unpacking libwww-perl (6.36-2) ...
Selecting previously unselected package liblwp-protocol-https-perl.
Preparing to unpack .../161-liblwp-protocol-https-perl_6.07-2_all.deb ...
Unpacking liblwp-protocol-https-perl (6.07-2) ...
Selecting previously unselected package liblzma-dev:amd64.
Preparing to unpack .../162-liblzma-dev_5.2.4-1_amd64.deb ...
Unpacking liblzma-dev:amd64 (5.2.4-1) ...
Selecting previously unselected package libnet-smtp-ssl-perl.
Preparing to unpack .../163-libnet-smtp-ssl-perl_1.04-1_all.deb ...
Unpacking libnet-smtp-ssl-perl (1.04-1) ...
Selecting previously unselected package libmailtools-perl.
Preparing to unpack .../164-libmailtools-perl_2.18-1_all.deb ...
Unpacking libmailtools-perl (2.18-1) ...
Selecting previously unselected package libncurses-dev:amd64.
Preparing to unpack .../165-libncurses-dev_6.1+20181013-2+deb10u2_amd64.deb ...
Unpacking libncurses-dev:amd64 (6.1+20181013-2+deb10u2) ...
Selecting previously unselected package libncurses5-dev:amd64.
Preparing to unpack .../166-libncurses5-dev_6.1+20181013-2+deb10u2_amd64.deb ...
Unpacking libncurses5-dev:amd64 (6.1+20181013-2+deb10u2) ...
Selecting previously unselected package libxml-parser-perl.
Preparing to unpack .../167-libxml-parser-perl_2.44-4_amd64.deb ...
Unpacking libxml-parser-perl (2.44-4) ...
Selecting previously unselected package libxml-twig-perl.
Preparing to unpack .../168-libxml-twig-perl_1%3a3.50-1.1_all.deb ...
Unpacking libxml-twig-perl (1:3.50-1.1) ...
Selecting previously unselected package libnet-dbus-perl.
Preparing to unpack .../169-libnet-dbus-perl_1.1.0-5+b1_amd64.deb ...
Unpacking libnet-dbus-perl (1.1.0-5+b1) ...
Selecting previously unselected package libthai-data.
Preparing to unpack .../170-libthai-data_0.1.28-2_all.deb ...
Unpacking libthai-data (0.1.28-2) ...
Selecting previously unselected package libthai0:amd64.
Preparing to unpack .../171-libthai0_0.1.28-2_amd64.deb ...
Unpacking libthai0:amd64 (0.1.28-2) ...
Selecting previously unselected package libpango-1.0-0:amd64.
Preparing to unpack .../172-libpango-1.0-0_1.42.4-8~deb10u1_amd64.deb ...
Unpacking libpango-1.0-0:amd64 (1.42.4-8~deb10u1) ...
Selecting previously unselected package libpangoft2-1.0-0:amd64.
Preparing to unpack .../173-libpangoft2-1.0-0_1.42.4-8~deb10u1_amd64.deb ...
Unpacking libpangoft2-1.0-0:amd64 (1.42.4-8~deb10u1) ...
Selecting previously unselected package libpangocairo-1.0-0:amd64.
Preparing to unpack .../174-libpangocairo-1.0-0_1.42.4-8~deb10u1_amd64.deb ...
Unpacking libpangocairo-1.0-0:amd64 (1.42.4-8~deb10u1) ...
Selecting previously unselected package libpaper1:amd64.
Preparing to unpack .../175-libpaper1_1.1.28_amd64.deb ...
Unpacking libpaper1:amd64 (1.1.28) ...
Selecting previously unselected package libpaper-utils.
Preparing to unpack .../176-libpaper-utils_1.1.28_amd64.deb ...
Unpacking libpaper-utils (1.1.28) ...
Selecting previously unselected package libpcre16-3:amd64.
Preparing to unpack .../177-libpcre16-3_2%3a8.39-12_amd64.deb ...
Unpacking libpcre16-3:amd64 (2:8.39-12) ...
Selecting previously unselected package libpcre2-16-0:amd64.
Preparing to unpack .../178-libpcre2-16-0_10.32-5_amd64.deb ...
Unpacking libpcre2-16-0:amd64 (10.32-5) ...
Selecting previously unselected package libpcre2-32-0:amd64.
Preparing to unpack .../179-libpcre2-32-0_10.32-5_amd64.deb ...
Unpacking libpcre2-32-0:amd64 (10.32-5) ...
Selecting previously unselected package libpcre2-8-0:amd64.
Preparing to unpack .../180-libpcre2-8-0_10.32-5_amd64.deb ...
Unpacking libpcre2-8-0:amd64 (10.32-5) ...
Selecting previously unselected package libpcre2-posix0:amd64.
Preparing to unpack .../181-libpcre2-posix0_10.32-5_amd64.deb ...
Unpacking libpcre2-posix0:amd64 (10.32-5) ...
Selecting previously unselected package libpcre2-dev:amd64.
Preparing to unpack .../182-libpcre2-dev_10.32-5_amd64.deb ...
Unpacking libpcre2-dev:amd64 (10.32-5) ...
Selecting previously unselected package libpcre32-3:amd64.
Preparing to unpack .../183-libpcre32-3_2%3a8.39-12_amd64.deb ...
Unpacking libpcre32-3:amd64 (2:8.39-12) ...
Selecting previously unselected package libpcrecpp0v5:amd64.
Preparing to unpack .../184-libpcrecpp0v5_2%3a8.39-12_amd64.deb ...
Unpacking libpcrecpp0v5:amd64 (2:8.39-12) ...
Selecting previously unselected package libpcre3-dev:amd64.
Preparing to unpack .../185-libpcre3-dev_2%3a8.39-12_amd64.deb ...
Unpacking libpcre3-dev:amd64 (2:8.39-12) ...
Selecting previously unselected package zlib1g-dev:amd64.
Preparing to unpack .../186-zlib1g-dev_1%3a1.2.11.dfsg-1_amd64.deb ...
Unpacking zlib1g-dev:amd64 (1:1.2.11.dfsg-1) ...
Selecting previously unselected package libpng-dev:amd64.
Preparing to unpack .../187-libpng-dev_1.6.36-6_amd64.deb ...
Unpacking libpng-dev:amd64 (1.6.36-6) ...
Selecting previously unselected package libpng-tools.
Preparing to unpack .../188-libpng-tools_1.6.36-6_amd64.deb ...
Unpacking libpng-tools (1.6.36-6) ...
Selecting previously unselected package libreadline-dev:amd64.
Preparing to unpack .../189-libreadline-dev_7.0-5_amd64.deb ...
Unpacking libreadline-dev:amd64 (7.0-5) ...
Selecting previously unselected package libsm6:amd64.
Preparing to unpack .../190-libsm6_2%3a1.2.3-1_amd64.deb ...
Unpacking libsm6:amd64 (2:1.2.3-1) ...
Selecting previously unselected package libtcl8.6:amd64.
Preparing to unpack .../191-libtcl8.6_8.6.9+dfsg-2_amd64.deb ...
Unpacking libtcl8.6:amd64 (8.6.9+dfsg-2) ...
Selecting previously unselected package libtext-iconv-perl.
Preparing to unpack .../192-libtext-iconv-perl_1.7-5+b7_amd64.deb ...
Unpacking libtext-iconv-perl (1.7-5+b7) ...
Selecting previously unselected package libtie-ixhash-perl.
Preparing to unpack .../193-libtie-ixhash-perl_1.23-2_all.deb ...
Unpacking libtie-ixhash-perl (1.23-2) ...
Selecting previously unselected package libwebp6:amd64.
Preparing to unpack .../194-libwebp6_0.6.1-2_amd64.deb ...
Unpacking libwebp6:amd64 (0.6.1-2) ...
Selecting previously unselected package libtiff5:amd64.
Preparing to unpack .../195-libtiff5_4.1.0+git191117-2~deb10u1_amd64.deb ...
Unpacking libtiff5:amd64 (4.1.0+git191117-2~deb10u1) ...
Selecting previously unselected package libxft2:amd64.
Preparing to unpack .../196-libxft2_2.3.2-2_amd64.deb ...
Unpacking libxft2:amd64 (2.3.2-2) ...
Selecting previously unselected package libxss1:amd64.
Preparing to unpack .../197-libxss1_1%3a1.2.3-1_amd64.deb ...
Unpacking libxss1:amd64 (1:1.2.3-1) ...
Selecting previously unselected package libtk8.6:amd64.
Preparing to unpack .../198-libtk8.6_8.6.9-2_amd64.deb ...
Unpacking libtk8.6:amd64 (8.6.9-2) ...
Selecting previously unselected package libx11-protocol-perl.
Preparing to unpack .../199-libx11-protocol-perl_0.56-7_all.deb ...
Unpacking libx11-protocol-perl (0.56-7) ...
Selecting previously unselected package libxt6:amd64.
Preparing to unpack .../200-libxt6_1%3a1.1.5-1+b3_amd64.deb ...
Unpacking libxt6:amd64 (1:1.1.5-1+b3) ...
Selecting previously unselected package libxmu6:amd64.
Preparing to unpack .../201-libxmu6_2%3a1.1.2-2+b3_amd64.deb ...
Unpacking libxmu6:amd64 (2:1.1.2-2+b3) ...
Selecting previously unselected package libxpm4:amd64.
Preparing to unpack .../202-libxpm4_1%3a3.5.12-1_amd64.deb ...
Unpacking libxpm4:amd64 (1:3.5.12-1) ...
Selecting previously unselected package libxaw7:amd64.
Preparing to unpack .../203-libxaw7_2%3a1.0.13-1+b2_amd64.deb ...
Unpacking libxaw7:amd64 (2:1.0.13-1+b2) ...
Selecting previously unselected package libxcb-shape0:amd64.
Preparing to unpack .../204-libxcb-shape0_1.13.1-2_amd64.deb ...
Unpacking libxcb-shape0:amd64 (1.13.1-2) ...
Selecting previously unselected package libxcomposite1:amd64.
Preparing to unpack .../205-libxcomposite1_1%3a0.4.4-2_amd64.deb ...
Unpacking libxcomposite1:amd64 (1:0.4.4-2) ...
Selecting previously unselected package libxcursor1:amd64.
Preparing to unpack .../206-libxcursor1_1%3a1.1.15-2_amd64.deb ...
Unpacking libxcursor1:amd64 (1:1.1.15-2) ...
Selecting previously unselected package libxi6:amd64.
Preparing to unpack .../207-libxi6_2%3a1.7.9-1_amd64.deb ...
Unpacking libxi6:amd64 (2:1.7.9-1) ...
Selecting previously unselected package libxinerama1:amd64.
Preparing to unpack .../208-libxinerama1_2%3a1.1.4-2_amd64.deb ...
Unpacking libxinerama1:amd64 (2:1.1.4-2) ...
Selecting previously unselected package libxml-xpathengine-perl.
Preparing to unpack .../209-libxml-xpathengine-perl_0.14-1_all.deb ...
Unpacking libxml-xpathengine-perl (0.14-1) ...
Selecting previously unselected package libxmuu1:amd64.
Preparing to unpack .../210-libxmuu1_2%3a1.1.2-2+b3_amd64.deb ...
Unpacking libxmuu1:amd64 (2:1.1.2-2+b3) ...
Selecting previously unselected package libxrandr2:amd64.
Preparing to unpack .../211-libxrandr2_2%3a1.5.1-1_amd64.deb ...
Unpacking libxrandr2:amd64 (2:1.5.1-1) ...
Selecting previously unselected package libxtst6:amd64.
Preparing to unpack .../212-libxtst6_2%3a1.2.3-1_amd64.deb ...
Unpacking libxtst6:amd64 (2:1.2.3-1) ...
Selecting previously unselected package libxv1:amd64.
Preparing to unpack .../213-libxv1_2%3a1.0.11-1_amd64.deb ...
Unpacking libxv1:amd64 (2:1.0.11-1) ...
Selecting previously unselected package libxxf86dga1:amd64.
Preparing to unpack .../214-libxxf86dga1_2%3a1.1.4-1+b3_amd64.deb ...
Unpacking libxxf86dga1:amd64 (2:1.1.4-1+b3) ...
Selecting previously unselected package manpages-dev.
Preparing to unpack .../215-manpages-dev_4.16-2_all.deb ...
Unpacking manpages-dev (4.16-2) ...
Selecting previously unselected package pkg-config.
Preparing to unpack .../216-pkg-config_0.29-6_amd64.deb ...
Unpacking pkg-config (0.29-6) ...
Selecting previously unselected package publicsuffix.
Preparing to unpack .../217-publicsuffix_20190415.1030-1_all.deb ...
Unpacking publicsuffix (20190415.1030-1) ...
Selecting previously unselected package zip.
Preparing to unpack .../218-zip_3.0-11+b1_amd64.deb ...
Unpacking zip (3.0-11+b1) ...
Selecting previously unselected package unzip.
Preparing to unpack .../219-unzip_6.0-23+deb10u1_amd64.deb ...
Unpacking unzip (6.0-23+deb10u1) ...
Selecting previously unselected package xdg-utils.
Preparing to unpack .../220-xdg-utils_1.1.3-1+deb10u1_all.deb ...
Unpacking xdg-utils (1.1.3-1+deb10u1) ...
Selecting previously unselected package r-base-core.
Preparing to unpack .../221-r-base-core_3.6.3-1~bustercran.0_amd64.deb ...
Unpacking r-base-core (3.6.3-1~bustercran.0) ...
Selecting previously unselected package r-cran-boot.
Preparing to unpack .../222-r-cran-boot_1.3-24-2~bustercran.0_all.deb ...
Unpacking r-cran-boot (1.3-24-2~bustercran.0) ...
Selecting previously unselected package r-cran-cluster.
Preparing to unpack .../223-r-cran-cluster_2.1.0-2~bustercran.0_amd64.deb ...
Unpacking r-cran-cluster (2.1.0-2~bustercran.0) ...
Selecting previously unselected package r-cran-foreign.
Preparing to unpack .../224-r-cran-foreign_0.8.75-1~bustercran.0_amd64.deb ...
Unpacking r-cran-foreign (0.8.75-1~bustercran.0) ...
Selecting previously unselected package r-cran-mass.
Preparing to unpack .../225-r-cran-mass_7.3-51.5-2~bustercran.0_amd64.deb ...
Unpacking r-cran-mass (7.3-51.5-2~bustercran.0) ...
Selecting previously unselected package r-cran-kernsmooth.
Preparing to unpack .../226-r-cran-kernsmooth_2.23-16-1+1~bustercran.0_amd64.deb ...
Unpacking r-cran-kernsmooth (2.23-16-1+1~bustercran.0) ...
Selecting previously unselected package r-cran-lattice.
Preparing to unpack .../227-r-cran-lattice_0.20-40-1~bustercran.0_amd64.deb ...
Unpacking r-cran-lattice (0.20-40-1~bustercran.0) ...
Selecting previously unselected package r-cran-nlme.
Preparing to unpack .../228-r-cran-nlme_3.1.144-1~bustercran.0_amd64.deb ...
Unpacking r-cran-nlme (3.1.144-1~bustercran.0) ...
Selecting previously unselected package r-cran-matrix.
Preparing to unpack .../229-r-cran-matrix_1.2-18-1~bustercran.0_amd64.deb ...
Unpacking r-cran-matrix (1.2-18-1~bustercran.0) ...
Selecting previously unselected package r-cran-mgcv.
Preparing to unpack .../230-r-cran-mgcv_1.8-31-1~bustercran.0_amd64.deb ...
Unpacking r-cran-mgcv (1.8-31-1~bustercran.0) ...
Selecting previously unselected package r-cran-survival.
Preparing to unpack .../231-r-cran-survival_3.1-8-1~bustercran.0_amd64.deb ...
Unpacking r-cran-survival (3.1-8-1~bustercran.0) ...
Selecting previously unselected package r-cran-rpart.
Preparing to unpack .../232-r-cran-rpart_4.1-15-2~bustercran.0_amd64.deb ...
Unpacking r-cran-rpart (4.1-15-2~bustercran.0) ...
Selecting previously unselected package r-cran-class.
Preparing to unpack .../233-r-cran-class_7.3-15-1~bustercran.0_amd64.deb ...
Unpacking r-cran-class (7.3-15-1~bustercran.0) ...
Selecting previously unselected package r-cran-nnet.
Preparing to unpack .../234-r-cran-nnet_7.3-12-2~bustercran.0_amd64.deb ...
Unpacking r-cran-nnet (7.3-12-2~bustercran.0) ...
Selecting previously unselected package r-cran-spatial.
Preparing to unpack .../235-r-cran-spatial_7.3-11-2~bustercran.0_amd64.deb ...
Unpacking r-cran-spatial (7.3-11-2~bustercran.0) ...
Selecting previously unselected package r-cran-codetools.
Preparing to unpack .../236-r-cran-codetools_0.2-16-1~bustercran.0_all.deb ...
Unpacking r-cran-codetools (0.2-16-1~bustercran.0) ...
Selecting previously unselected package r-recommended.
Preparing to unpack .../237-r-recommended_3.6.3-1~bustercran.0_all.deb ...
Unpacking r-recommended (3.6.3-1~bustercran.0) ...
Selecting previously unselected package r-base.
Preparing to unpack .../238-r-base_3.6.3-1~bustercran.0_all.deb ...
Unpacking r-base (3.6.3-1~bustercran.0) ...
Selecting previously unselected package xauth.
Preparing to unpack .../239-xauth_1%3a1.0.10-1_amd64.deb ...
Unpacking xauth (1:1.0.10-1) ...
Selecting previously unselected package r-base-dev.
Preparing to unpack .../240-r-base-dev_3.6.3-1~bustercran.0_all.deb ...
Unpacking r-base-dev (3.6.3-1~bustercran.0) ...
Selecting previously unselected package r-base-html.
Preparing to unpack .../241-r-base-html_3.6.3-1~bustercran.0_all.deb ...
Unpacking r-base-html (3.6.3-1~bustercran.0) ...
Selecting previously unselected package r-doc-html.
Preparing to unpack .../242-r-doc-html_3.6.3-1~bustercran.0_all.deb ...
Unpacking r-doc-html (3.6.3-1~bustercran.0) ...
Selecting previously unselected package libglx0:amd64.
Preparing to unpack .../243-libglx0_1.1.0-1_amd64.deb ...
Unpacking libglx0:amd64 (1.1.0-1) ...
Selecting previously unselected package libgl1:amd64.
Preparing to unpack .../244-libgl1_1.1.0-1_amd64.deb ...
Unpacking libgl1:amd64 (1.1.0-1) ...
Selecting previously unselected package x11-utils.
Preparing to unpack .../245-x11-utils_7.7+4_amd64.deb ...
Unpacking x11-utils (7.7+4) ...
Selecting previously unselected package x11-xserver-utils.
Preparing to unpack .../246-x11-xserver-utils_7.7+8_amd64.deb ...
Unpacking x11-xserver-utils (7.7+8) ...
Selecting previously unselected package xdg-user-dirs.
Preparing to unpack .../247-xdg-user-dirs_0.17-2_amd64.deb ...
Unpacking xdg-user-dirs (0.17-2) ...
Setting up perl-modules-5.28 (5.28.1-6+deb10u1) ...
Setting up libexpat1:amd64 (2.2.6-2+deb10u1) ...
Setting up libpcrecpp0v5:amd64 (2:8.39-12) ...
Setting up libtext-iconv-perl (1.7-5+b7) ...
Setting up libgraphite2-3:amd64 (1.3.13-7) ...
Setting up libpixman-1-0:amd64 (0.36.0-1) ...
Setting up bzip2-doc (1.0.6-9.2~deb10u1) ...
Setting up libx11-xcb1:amd64 (2:1.6.7-1+deb10u1) ...
Setting up libpciaccess0:amd64 (0.14-1) ...
Setting up libxau6:amd64 (1:1.0.8-1+b2) ...
Setting up libapparmor1:amd64 (2.13.2-10) ...
Setting up libpsl5:amd64 (0.20.2-2) ...
Setting up r-doc-html (3.6.3-1~bustercran.0) ...
Setting up libpcre16-3:amd64 (2:8.39-12) ...
Setting up libdatrie1:amd64 (0.2.12-2) ...
Setting up xdg-user-dirs (0.17-2) ...
Setting up libglib2.0-0:amd64 (2.58.3-2+deb10u2) ...
No schema files found: doing nothing.
Setting up manpages (4.16-2) ...
Setting up libglvnd0:amd64 (1.1.0-1) ...
Setting up unzip (6.0-23+deb10u1) ...
Setting up binutils-common:amd64 (2.31.1-16) ...
Setting up x11-common (1:7.7+19) ...
debconf: unable to initialize frontend: Dialog
debconf: (TERM is not set, so the dialog frontend is not usable.)
debconf: falling back to frontend: Readline
update-rc.d: warning: start and stop actions are no longer supported; falling back to defaults
invoke-rc.d: could not determine current runlevel
invoke-rc.d: policy-rc.d denied execution of start.
Setting up libsensors-config (1:3.5.0-3) ...
Setting up libnghttp2-14:amd64 (1.36.0-2+deb10u1) ...
Setting up perl-openssl-defaults:amd64 (3) ...
Setting up linux-libc-dev:amd64 (4.19.160-2) ...
Setting up libgomp1:amd64 (8.3.0-6) ...
Setting up bzip2 (1.0.6-9.2~deb10u1) ...
Setting up libjbig0:amd64 (2.1-3.1+b2) ...
Setting up libpcre2-16-0:amd64 (10.32-5) ...
Setting up libfakeroot:amd64 (1.23-1) ...
Setting up fakeroot (1.23-1) ...
update-alternatives: using /usr/bin/fakeroot-sysv to provide /usr/bin/fakeroot (fakeroot) in auto mode
update-alternatives: warning: skip creation of /usr/share/man/man1/fakeroot.1.gz because associated file /usr/share/man/man1/fakeroot-sysv.1.gz (of link group fakeroot) doesn't exist
update-alternatives: warning: skip creation of /usr/share/man/man1/faked.1.gz because associated file /usr/share/man/man1/faked-sysv.1.gz (of link group fakeroot) doesn't exist
update-alternatives: warning: skip creation of /usr/share/man/es/man1/fakeroot.1.gz because associated file /usr/share/man/es/man1/fakeroot-sysv.1.gz (of link group fakeroot) doesn't exist
update-alternatives: warning: skip creation of /usr/share/man/es/man1/faked.1.gz because associated file /usr/share/man/es/man1/faked-sysv.1.gz (of link group fakeroot) doesn't exist
update-alternatives: warning: skip creation of /usr/share/man/fr/man1/fakeroot.1.gz because associated file /usr/share/man/fr/man1/fakeroot-sysv.1.gz (of link group fakeroot) doesn't exist
update-alternatives: warning: skip creation of /usr/share/man/fr/man1/faked.1.gz because associated file /usr/share/man/fr/man1/faked-sysv.1.gz (of link group fakeroot) doesn't exist
update-alternatives: warning: skip creation of /usr/share/man/sv/man1/fakeroot.1.gz because associated file /usr/share/man/sv/man1/fakeroot-sysv.1.gz (of link group fakeroot) doesn't exist
update-alternatives: warning: skip creation of /usr/share/man/sv/man1/faked.1.gz because associated file /usr/share/man/sv/man1/faked-sysv.1.gz (of link group fakeroot) doesn't exist
Setting up libasan5:amd64 (8.3.0-6) ...
Setting up zip (3.0-11+b1) ...
Setting up libfontenc1:amd64 (1:1.1.3-1+b2) ...
Setting up libpcre2-32-0:amd64 (10.32-5) ...
Setting up libglib2.0-data (2.58.3-2+deb10u2) ...
Setting up libjpeg62-turbo:amd64 (1:1.5.2-2+deb10u1) ...
Setting up libx11-data (2:1.6.7-1+deb10u1) ...
Setting up make (4.2.1-1.2) ...
Setting up libmpfr6:amd64 (4.0.2-1) ...
Setting up librtmp1:amd64 (2.4+20151223.gitfa8646d.1-2) ...
Setting up libdbus-1-3:amd64 (1.12.20-0+deb10u1) ...
Setting up dbus (1.12.20-0+deb10u1) ...
invoke-rc.d: could not determine current runlevel
invoke-rc.d: policy-rc.d denied execution of start.
Setting up xz-utils (5.2.4-1) ...
update-alternatives: using /usr/bin/xz to provide /usr/bin/lzma (lzma) in auto mode
update-alternatives: warning: skip creation of /usr/share/man/man1/lzma.1.gz because associated file /usr/share/man/man1/xz.1.gz (of link group lzma) doesn't exist
update-alternatives: warning: skip creation of /usr/share/man/man1/unlzma.1.gz because associated file /usr/share/man/man1/unxz.1.gz (of link group lzma) doesn't exist
update-alternatives: warning: skip creation of /usr/share/man/man1/lzcat.1.gz because associated file /usr/share/man/man1/xzcat.1.gz (of link group lzma) doesn't exist
update-alternatives: warning: skip creation of /usr/share/man/man1/lzmore.1.gz because associated file /usr/share/man/man1/xzmore.1.gz (of link group lzma) doesn't exist
update-alternatives: warning: skip creation of /usr/share/man/man1/lzless.1.gz because associated file /usr/share/man/man1/xzless.1.gz (of link group lzma) doesn't exist
update-alternatives: warning: skip creation of /usr/share/man/man1/lzdiff.1.gz because associated file /usr/share/man/man1/xzdiff.1.gz (of link group lzma) doesn't exist
update-alternatives: warning: skip creation of /usr/share/man/man1/lzcmp.1.gz because associated file /usr/share/man/man1/xzcmp.1.gz (of link group lzma) doesn't exist
update-alternatives: warning: skip creation of /usr/share/man/man1/lzgrep.1.gz because associated file /usr/share/man/man1/xzgrep.1.gz (of link group lzma) doesn't exist
update-alternatives: warning: skip creation of /usr/share/man/man1/lzegrep.1.gz because associated file /usr/share/man/man1/xzegrep.1.gz (of link group lzma) doesn't exist
update-alternatives: warning: skip creation of /usr/share/man/man1/lzfgrep.1.gz because associated file /usr/share/man/man1/xzfgrep.1.gz (of link group lzma) doesn't exist
Setting up libfribidi0:amd64 (1.0.5-3.1+deb10u1) ...
Setting up libquadmath0:amd64 (8.3.0-6) ...
Setting up shared-mime-info (1.10-1) ...
Setting up libpng16-16:amd64 (1.6.36-6) ...
Setting up libpcre32-3:amd64 (2:8.39-12) ...
Setting up libmpc3:amd64 (1.1.0-1) ...
Setting up libatomic1:amd64 (8.3.0-6) ...
Setting up patch (2.7.6-3+deb10u1) ...
Setting up libtcl8.6:amd64 (8.6.9+dfsg-2) ...
Setting up libwebp6:amd64 (0.6.1-2) ...
Setting up icu-devtools (63.1-6+deb10u1) ...
Setting up fonts-dejavu-core (2.37-1) ...
Setting up libsensors5:amd64 (1:3.5.0-3) ...
Setting up libpcre2-8-0:amd64 (10.32-5) ...
Setting up libglapi-mesa:amd64 (18.3.6-2+deb10u1) ...
Setting up libgfortran5:amd64 (8.3.0-6) ...
Setting up libmpx2:amd64 (8.3.0-6) ...
Setting up liblzma-dev:amd64 (5.2.4-1) ...
Setting up libubsan1:amd64 (8.3.0-6) ...
Setting up libisl19:amd64 (0.20-2) ...
Setting up sensible-utils (0.0.12) ...
Setting up libxshmfence1:amd64 (1.3-1) ...
Setting up libthai-data (0.1.28-2) ...
Setting up libssh2-1:amd64 (1.8.0-2.1) ...
Setting up netbase (5.6) ...
Setting up libtiff5:amd64 (4.1.0+git191117-2~deb10u1) ...
Setting up libbinutils:amd64 (2.31.1-16) ...
Setting up cpp-8 (8.3.0-6) ...
Setting up libc-dev-bin (2.28-10) ...
Setting up libbsd0:amd64 (0.9.1-2) ...
Setting up libdrm-common (2.4.97-1) ...
Setting up libelf1:amd64 (0.176-1.1) ...
Setting up publicsuffix (20190415.1030-1) ...
Setting up xdg-utils (1.1.3-1+deb10u1) ...
Setting up libcc1-0:amd64 (8.3.0-6) ...
Setting up liblocale-gettext-perl (1.07-3+b4) ...
Setting up liblsan0:amd64 (8.3.0-6) ...
Setting up libitm1:amd64 (8.3.0-6) ...
Setting up libgdbm6:amd64 (1.18.1-4) ...
Setting up binutils-x86-64-linux-gnu (2.31.1-16) ...
Setting up libtsan0:amd64 (8.3.0-6) ...
Setting up manpages-dev (4.16-2) ...
Setting up libice6:amd64 (2:1.0.9-2) ...
Setting up libxdmcp6:amd64 (1:1.1.2-3) ...
Setting up libxcb1:amd64 (1.13.1-2) ...
Setting up libpng-tools (1.6.36-6) ...
Setting up libxcb-render0:amd64 (1.13.1-2) ...
Setting up libxcb-glx0:amd64 (1.13.1-2) ...
Setting up libedit2:amd64 (3.1-20181209-1) ...
Setting up libxcb-shape0:amd64 (1.13.1-2) ...
Setting up libxcb-shm0:amd64 (1.13.1-2) ...
Setting up binutils (2.31.1-16) ...
Setting up libxcb-present0:amd64 (1.13.1-2) ...
Setting up libthai0:amd64 (0.1.28-2) ...
Setting up libblas3:amd64 (3.8.0-2) ...
update-alternatives: using /usr/lib/x86_64-linux-gnu/blas/libblas.so.3 to provide /usr/lib/x86_64-linux-gnu/libblas.so.3 (libblas.so.3-x86_64-linux-gnu) in auto mode
Setting up libpcre2-posix0:amd64 (10.32-5) ...
Setting up libfreetype6:amd64 (2.9.1-3+deb10u2) ...
Setting up libxcb-sync1:amd64 (1.13.1-2) ...
Setting up libgdbm-compat4:amd64 (1.18.1-4) ...
Setting up ucf (3.0038+nmu1) ...
debconf: unable to initialize frontend: Dialog
debconf: (TERM is not set, so the dialog frontend is not usable.)
debconf: falling back to frontend: Readline
Setting up libgcc-8-dev:amd64 (8.3.0-6) ...
Setting up libperl5.28:amd64 (5.28.1-6+deb10u1) ...
Setting up libxcb-dri2-0:amd64 (1.13.1-2) ...
Setting up libdrm2:amd64 (2.4.97-1) ...
Setting up cpp (4:8.3.0-1) ...
Setting up libcurl4:amd64 (7.64.0-4+deb10u1) ...
Setting up libllvm7:amd64 (1:7.0.1-8+deb10u2) ...
Setting up libc6-dev:amd64 (2.28-10) ...
Setting up libx11-6:amd64 (2:1.6.7-1+deb10u1) ...
Setting up libharfbuzz0b:amd64 (2.3.1-1) ...
Setting up libxcomposite1:amd64 (1:0.4.4-2) ...
Setting up libsm6:amd64 (2:1.2.3-1) ...
Setting up libicu-dev:amd64 (63.1-6+deb10u1) ...
Setting up libxmuu1:amd64 (2:1.1.2-2+b3) ...
Setting up libblas-dev:amd64 (3.8.0-2) ...
update-alternatives: using /usr/lib/x86_64-linux-gnu/blas/libblas.so to provide /usr/lib/x86_64-linux-gnu/libblas.so (libblas.so-x86_64-linux-gnu) in auto mode
Setting up libstdc++-8-dev:amd64 (8.3.0-6) ...
Setting up libdrm-amdgpu1:amd64 (2.4.97-1) ...
Setting up libbz2-dev:amd64 (1.0.6-9.2~deb10u1) ...
Setting up libxcb-dri3-0:amd64 (1.13.1-2) ...
Setting up libgfortran-8-dev:amd64 (8.3.0-6) ...
Setting up libpaper1:amd64 (1.1.28) ...
debconf: unable to initialize frontend: Dialog
debconf: (TERM is not set, so the dialog frontend is not usable.)
debconf: falling back to frontend: Readline

Creating config file /etc/papersize with new version
Setting up liblapack3:amd64 (3.8.0-2) ...
update-alternatives: using /usr/lib/x86_64-linux-gnu/lapack/liblapack.so.3 to provide /usr/lib/x86_64-linux-gnu/liblapack.so.3 (liblapack.so.3-x86_64-linux-gnu) in auto mode
Setting up libncurses-dev:amd64 (6.1+20181013-2+deb10u2) ...
Setting up libdrm-nouveau2:amd64 (2.4.97-1) ...
Setting up gcc-8 (8.3.0-6) ...
Setting up libxpm4:amd64 (1:3.5.12-1) ...
Setting up libpcre2-dev:amd64 (10.32-5) ...
Setting up libxrender1:amd64 (1:0.9.10-1) ...
Setting up libpcre3-dev:amd64 (2:8.39-12) ...
Setting up libdrm-radeon1:amd64 (2.4.97-1) ...
Setting up fontconfig-config (2.13.1-2) ...
debconf: unable to initialize frontend: Dialog
debconf: (TERM is not set, so the dialog frontend is not usable.)
debconf: falling back to frontend: Readline
Setting up gfortran-8 (8.3.0-6) ...
Setting up libdrm-intel1:amd64 (2.4.97-1) ...
Setting up libgl1-mesa-dri:amd64 (18.3.6-2+deb10u1) ...
Setting up libxext6:amd64 (2:1.3.3-1+b2) ...
Setting up libpaper-utils (1.1.28) ...
Setting up libreadline-dev:amd64 (7.0-5) ...
Setting up gcc (4:8.3.0-1) ...
Setting up libxxf86vm1:amd64 (1:1.1.4-1+b2) ...
Setting up perl (5.28.1-6+deb10u1) ...
Setting up libdata-dump-perl (1.23-1) ...
Setting up libjpeg62-turbo-dev:amd64 (1:1.5.2-2+deb10u1) ...
Setting up libxfixes3:amd64 (1:5.0.3-1) ...
Setting up libipc-system-simple-perl (1.25-4) ...
Setting up libxml-xpathengine-perl (0.14-1) ...
Setting up libxinerama1:amd64 (2:1.1.4-2) ...
Setting up libxv1:amd64 (2:1.0.11-1) ...
Setting up liblapack-dev:amd64 (3.8.0-2) ...
update-alternatives: using /usr/lib/x86_64-linux-gnu/lapack/liblapack.so to provide /usr/lib/x86_64-linux-gnu/liblapack.so (liblapack.so-x86_64-linux-gnu) in auto mode
Setting up libio-html-perl (1.001-1) ...
Setting up libxrandr2:amd64 (2:1.5.1-1) ...
Setting up libxt6:amd64 (1:1.1.5-1+b3) ...
Setting up libdpkg-perl (1.19.7) ...
Setting up libtimedate-perl (2.3000-2+deb10u1) ...
Setting up zlib1g-dev:amd64 (1:1.2.11.dfsg-1) ...
Setting up g++-8 (8.3.0-6) ...
Setting up xauth (1:1.0.10-1) ...
Setting up libncurses5-dev:amd64 (6.1+20181013-2+deb10u2) ...
Setting up libxss1:amd64 (1:1.2.3-1) ...
Setting up libfontconfig1:amd64 (2.13.1-2) ...
Setting up liburi-perl (1.76-1) ...
Setting up libx11-protocol-perl (0.56-7) ...
Setting up libnet-ssleay-perl (1.85-2+b1) ...
Setting up libhttp-date-perl (6.02-1) ...
Setting up fontconfig (2.13.1-2) ...
Regenerating fonts cache... done.
Setting up libxft2:amd64 (2.3.2-2) ...
Setting up libxmu6:amd64 (2:1.1.2-2+b3) ...
Setting up libfile-basedir-perl (0.08-1) ...
Setting up libtie-ixhash-perl (1.23-2) ...
Setting up libxdamage1:amd64 (1:1.1.4-3+b3) ...
Setting up libfile-listing-perl (6.04-1) ...
Setting up libxi6:amd64 (2:1.7.9-1) ...
Setting up libfont-afm-perl (1.20-2) ...
Setting up libfile-fcntllock-perl (0.22-3+b5) ...
Setting up libalgorithm-diff-perl (1.19.03-2) ...
Setting up libio-stringy-perl (2.111-3) ...
Setting up libxtst6:amd64 (2:1.2.3-1) ...
Setting up libhtml-tagset-perl (3.20-3) ...
Setting up libauthen-sasl-perl (2.1600-1) ...
Setting up libtk8.6:amd64 (8.6.9-2) ...
Setting up libxcursor1:amd64 (1:1.1.15-2) ...
Setting up libpango-1.0-0:amd64 (1.42.4-8~deb10u1) ...
Setting up liblwp-mediatypes-perl (6.02-1) ...
Setting up libpng-dev:amd64 (1.6.36-6) ...
Setting up libtry-tiny-perl (0.30-1) ...
Setting up libjpeg-dev (1:1.5.2-2+deb10u1) ...
Setting up libxxf86dga1:amd64 (2:1.1.4-1+b3) ...
Setting up libnet-http-perl (6.18-1) ...
Setting up libencode-locale-perl (1.05-1) ...
Setting up libxaw7:amd64 (2:1.0.13-1+b2) ...
Setting up x11-xserver-utils (7.7+8) ...
Setting up gfortran (4:8.3.0-1) ...
update-alternatives: using /usr/bin/gfortran to provide /usr/bin/f95 (f95) in auto mode
update-alternatives: using /usr/bin/gfortran to provide /usr/bin/f77 (f77) in auto mode
Setting up libcairo2:amd64 (1.16.0-4) ...
Setting up dpkg-dev (1.19.7) ...
Setting up pkg-config (0.29-6) ...
Setting up libfile-desktopentry-perl (0.22-1) ...
Setting up libwww-robotrules-perl (6.02-1) ...
Setting up g++ (4:8.3.0-1) ...
update-alternatives: using /usr/bin/g++ to provide /usr/bin/c++ (c++) in auto mode
Setting up libhtml-parser-perl (3.72-3+b3) ...
Setting up build-essential (12.6) ...
Setting up libpangoft2-1.0-0:amd64 (1.42.4-8~deb10u1) ...
Setting up libalgorithm-diff-xs-perl (0.04-5+b1) ...
Setting up libio-socket-ssl-perl (2.060-3) ...
Setting up libpangocairo-1.0-0:amd64 (1.42.4-8~deb10u1) ...
Setting up libalgorithm-merge-perl (0.08-3) ...
Setting up libhttp-message-perl (6.18-1) ...
Setting up libhtml-form-perl (6.03-1) ...
Setting up libfile-mimeinfo-perl (0.29-1) ...
Setting up libhttp-negotiate-perl (6.01-1) ...
Setting up libglx-mesa0:amd64 (18.3.6-2+deb10u1) ...
Setting up libglx0:amd64 (1.1.0-1) ...
Setting up libhttp-cookies-perl (6.04-1) ...
Setting up libhtml-tree-perl (5.07-2) ...
Setting up libhtml-format-perl (2.12-1) ...
Setting up libgl1:amd64 (1.1.0-1) ...
Setting up libnet-smtp-ssl-perl (1.04-1) ...
Setting up libmailtools-perl (2.18-1) ...
Setting up r-base-core (3.6.3-1~bustercran.0) ...
debconf: unable to initialize frontend: Dialog
debconf: (TERM is not set, so the dialog frontend is not usable.)
debconf: falling back to frontend: Readline

Creating config file /etc/R/Renviron with new version
Setting up r-cran-lattice (0.20-40-1~bustercran.0) ...
Setting up r-cran-nlme (3.1.144-1~bustercran.0) ...
Setting up libhttp-daemon-perl (6.01-3) ...
Setting up r-cran-cluster (2.1.0-2~bustercran.0) ...
Setting up x11-utils (7.7+4) ...
Setting up r-cran-nnet (7.3-12-2~bustercran.0) ...
Setting up r-cran-codetools (0.2-16-1~bustercran.0) ...
Setting up r-cran-boot (1.3-24-2~bustercran.0) ...
Setting up r-base-dev (3.6.3-1~bustercran.0) ...
Setting up r-cran-spatial (7.3-11-2~bustercran.0) ...
Setting up r-cran-mass (7.3-51.5-2~bustercran.0) ...
Setting up r-cran-foreign (0.8.75-1~bustercran.0) ...
Setting up r-base-html (3.6.3-1~bustercran.0) ...
Setting up r-cran-matrix (1.2-18-1~bustercran.0) ...
Setting up r-cran-kernsmooth (2.23-16-1+1~bustercran.0) ...
Setting up r-cran-mgcv (1.8-31-1~bustercran.0) ...
Setting up r-cran-class (7.3-15-1~bustercran.0) ...
Setting up r-cran-survival (3.1-8-1~bustercran.0) ...
Setting up r-cran-rpart (4.1-15-2~bustercran.0) ...
Setting up r-recommended (3.6.3-1~bustercran.0) ...
Setting up r-base (3.6.3-1~bustercran.0) ...
Setting up liblwp-protocol-https-perl (6.07-2) ...
Setting up libwww-perl (6.36-2) ...
Setting up libxml-parser-perl (2.44-4) ...
Setting up libxml-twig-perl (1:3.50-1.1) ...
Setting up libnet-dbus-perl (1.1.0-5+b1) ...
Processing triggers for libc-bin (2.28-10) ...
Removing intermediate container be5e0bb615ed
 ---> dd15dbdadfb9
Step 7/12 : COPY R ${SPARK_HOME}/R
 ---> c5a273e7e35e
Step 8/12 : ENV R_HOME /usr/lib/R
 ---> Running in b539b3d95c90
Removing intermediate container b539b3d95c90
 ---> 8b7fb4463f12
Step 9/12 : WORKDIR /opt/spark/work-dir
 ---> Running in d596dcdea574
Removing intermediate container d596dcdea574
 ---> 817b7ae28b59
Step 10/12 : ENTRYPOINT [ "/opt/entrypoint.sh" ]
 ---> Running in ca4634a10056
Removing intermediate container ca4634a10056
 ---> 638d684bdf4e
Step 11/12 : ARG spark_uid=185
 ---> Running in d259f04de21b
Removing intermediate container d259f04de21b
 ---> 74d7b0321249
Step 12/12 : USER ${spark_uid}
 ---> Running in ec09955d23f7
Removing intermediate container ec09955d23f7
 ---> d00946ded43c
[Warning] One or more build-args [java_image_tag] were not consumed
Successfully built d00946ded43c
Successfully tagged kubespark/spark-r:3.2.0-SNAPSHOT_429e6b74-5347-452f-beb0-a600dfde460c
+ cd -
/home/jenkins/workspace/spark-master-test-k8s/resource-managers/kubernetes/integration-tests
+ rm -f /home/jenkins/workspace/spark-master-test-k8s/resource-managers/kubernetes/integration-tests/target/imageTag.txt
+ echo -n 3.2.0-SNAPSHOT_429e6b74-5347-452f-beb0-a600dfde460c
[INFO] 
[INFO] --- scalatest-maven-plugin:2.0.0:test (integration-test) @ spark-kubernetes-integration-tests_2.12 ---
Discovery starting.
Discovery completed in 465 milliseconds.
Run starting. Expected test count is: 26
KubernetesSuite:
- Run SparkPi with no resources
- Run SparkPi with a very long application name.
- Use SparkLauncher.NO_RESOURCE
- Run SparkPi with a master URL without a scheme.
- Run SparkPi with an argument.
- Run SparkPi with custom labels, annotations, and environment variables.
- All pods have the same service account by default
- Run extraJVMOptions check on driver
- Run SparkRemoteFileTest using a remote data file
- Verify logging configuration is picked from the provided SPARK_CONF_DIR/log4j.properties
- Run SparkPi with env and mount secrets.
- Run PySpark on simple pi.py example
- Run PySpark to test a pyfiles example
- Run PySpark with memory customization *** FAILED ***
  The code passed to eventually never returned normally. Attempted 186 times over 3.0033148279 minutes. Last failure message: "++ id -u
  + myuid=185
  ++ id -g
  + mygid=0
  + set +e
  ++ getent passwd 185
  + uidentry=
  + set -e
  + '[' -z '' ']'
  + '[' -w /etc/passwd ']'
  + echo '185:x:185:0:anonymous uid:/opt/spark:/bin/false'
  + SPARK_CLASSPATH=':/opt/spark/jars/*'
  + env
  + grep SPARK_JAVA_OPT_
  + sort -t_ -k4 -n
  + sed 's/[^=]*=\(.*\)/\1/g'
  + readarray -t SPARK_EXECUTOR_JAVA_OPTS
  + '[' -n '' ']'
  + '[' -z ']'
  + '[' -z ']'
  + '[' -n '' ']'
  + '[' -z ']'
  + '[' -z x ']'
  + SPARK_CLASSPATH='/opt/spark/conf::/opt/spark/jars/*'
  + case "$1" in
  + shift 1
  + CMD=("$SPARK_HOME/bin/spark-submit" --conf "spark.driver.bindAddress=$SPARK_DRIVER_BIND_ADDRESS" --deploy-mode client "$@")
  + exec /usr/bin/tini -s -- /opt/spark/bin/spark-submit --conf spark.driver.bindAddress=172.17.0.4 --deploy-mode client --properties-file /opt/spark/conf/spark.properties --class org.apache.spark.deploy.PythonRunner local:///opt/spark/tests/worker_memory_check.py 209715200
  21/01/11 01:30:58 WARN NativeCodeLoader: Unable to load native-hadoop library for your platform... using builtin-java classes where applicable
  Using Spark's default log4j profile: org/apache/spark/log4j-defaults.properties
  21/01/11 01:30:58 INFO SparkContext: Running Spark version 3.2.0-SNAPSHOT
  21/01/11 01:30:59 INFO ResourceUtils: ==============================================================
  21/01/11 01:30:59 INFO ResourceUtils: No custom resources configured for spark.driver.
  21/01/11 01:30:59 INFO ResourceUtils: ==============================================================
  21/01/11 01:30:59 INFO SparkContext: Submitted application: PyMemoryTest
  21/01/11 01:30:59 INFO ResourceProfile: Default ResourceProfile created, executor resources: Map(cores -> name: cores, amount: 1, script: , vendor: , memory -> name: memory, amount: 1024, script: , vendor: , pyspark.memory -> name: pyspark.memory, amount: 200, script: , vendor: , offHeap -> name: offHeap, amount: 0, script: , vendor: ), task resources: Map(cpus -> name: cpus, amount: 1.0)
  21/01/11 01:30:59 INFO ResourceProfile: Limiting resource is cpus at 1 tasks per executor
  21/01/11 01:30:59 INFO ResourceProfileManager: Added ResourceProfile id: 0
  21/01/11 01:30:59 INFO SecurityManager: Changing view acls to: 185,jenkins
  21/01/11 01:30:59 INFO SecurityManager: Changing modify acls to: 185,jenkins
  21/01/11 01:30:59 INFO SecurityManager: Changing view acls groups to: 
  21/01/11 01:30:59 INFO SecurityManager: Changing modify acls groups to: 
  21/01/11 01:30:59 INFO SecurityManager: SecurityManager: authentication enabled; ui acls disabled; users  with view permissions: Set(185, jenkins); groups with view permissions: Set(); users  with modify permissions: Set(185, jenkins); groups with modify permissions: Set()
  21/01/11 01:30:59 INFO Utils: Successfully started service 'sparkDriver' on port 7078.
  21/01/11 01:30:59 INFO SparkEnv: Registering MapOutputTracker
  21/01/11 01:30:59 INFO SparkEnv: Registering BlockManagerMaster
  21/01/11 01:30:59 INFO BlockManagerMasterEndpoint: Using org.apache.spark.storage.DefaultTopologyMapper for getting topology information
  21/01/11 01:30:59 INFO BlockManagerMasterEndpoint: BlockManagerMasterEndpoint up
  21/01/11 01:30:59 INFO SparkEnv: Registering BlockManagerMasterHeartbeat
  21/01/11 01:30:59 INFO DiskBlockManager: Created local directory at /var/data/spark-e7d065f5-73e6-4323-abe0-fb0acca00d75/blockmgr-6f3618e6-d83f-4172-81ea-763c470d72ef
  21/01/11 01:30:59 INFO MemoryStore: MemoryStore started with capacity 546.3 MiB
  21/01/11 01:30:59 INFO SparkEnv: Registering OutputCommitCoordinator
  21/01/11 01:31:00 INFO Utils: Successfully started service 'SparkUI' on port 4040.
  21/01/11 01:31:00 INFO SparkUI: Bound SparkUI to 0.0.0.0, and started at http://spark-test-app-5d4f3076ef1141bc-driver-svc.3345686f5ea8436bb14117afc77393b7.svc:4040
  21/01/11 01:31:00 WARN SparkContext: File with 'local' scheme local:///opt/spark/tests/py_container_checks.py is not supported to add to file server, since it is already available on every node.
  21/01/11 01:31:00 INFO SparkKubernetesClientFactory: Auto-configuring K8S client using current context from users K8S config file
  21/01/11 01:31:02 INFO ExecutorPodsAllocator: Going to request 1 executors from Kubernetes for ResourceProfile Id: 0, target: 1 running: 0.
  21/01/11 01:31:02 INFO BasicExecutorFeatureStep: Decommissioning not enabled, skipping shutdown script
  21/01/11 01:31:02 INFO Utils: Successfully started service 'org.apache.spark.network.netty.NettyBlockTransferService' on port 7079.
  21/01/11 01:31:02 INFO NettyBlockTransferService: Server created on spark-test-app-5d4f3076ef1141bc-driver-svc.3345686f5ea8436bb14117afc77393b7.svc:7079
  21/01/11 01:31:02 INFO BlockManager: Using org.apache.spark.storage.RandomBlockReplicationPolicy for block replication policy
  21/01/11 01:31:02 INFO BlockManagerMaster: Registering BlockManager BlockManagerId(driver, spark-test-app-5d4f3076ef1141bc-driver-svc.3345686f5ea8436bb14117afc77393b7.svc, 7079, None)
  21/01/11 01:31:02 INFO BlockManagerMasterEndpoint: Registering block manager spark-test-app-5d4f3076ef1141bc-driver-svc.3345686f5ea8436bb14117afc77393b7.svc:7079 with 546.3 MiB RAM, BlockManagerId(driver, spark-test-app-5d4f3076ef1141bc-driver-svc.3345686f5ea8436bb14117afc77393b7.svc, 7079, None)
  21/01/11 01:31:02 INFO BlockManagerMaster: Registered BlockManager BlockManagerId(driver, spark-test-app-5d4f3076ef1141bc-driver-svc.3345686f5ea8436bb14117afc77393b7.svc, 7079, None)
  21/01/11 01:31:02 INFO BlockManager: Initialized BlockManager: BlockManagerId(driver, spark-test-app-5d4f3076ef1141bc-driver-svc.3345686f5ea8436bb14117afc77393b7.svc, 7079, None)
  21/01/11 01:31:32 INFO KubernetesClusterSchedulerBackend: SchedulerBackend is ready for scheduling beginning after waiting maxRegisteredResourcesWaitingTime: 30000000000(ns)
  21/01/11 01:31:32 INFO SharedState: Setting hive.metastore.warehouse.dir ('null') to the value of spark.sql.warehouse.dir ('file:/opt/spark/work-dir/spark-warehouse').
  21/01/11 01:31:32 INFO SharedState: Warehouse path is 'file:/opt/spark/work-dir/spark-warehouse'.
  21/01/11 01:31:34 INFO SparkContext: Starting job: collect at /opt/spark/tests/worker_memory_check.py:41
  21/01/11 01:31:34 INFO DAGScheduler: Got job 0 (collect at /opt/spark/tests/worker_memory_check.py:41) with 2 output partitions
  21/01/11 01:31:34 INFO DAGScheduler: Final stage: ResultStage 0 (collect at /opt/spark/tests/worker_memory_check.py:41)
  21/01/11 01:31:34 INFO DAGScheduler: Parents of final stage: List()
  21/01/11 01:31:34 INFO DAGScheduler: Missing parents: List()
  21/01/11 01:31:34 INFO DAGScheduler: Submitting ResultStage 0 (PythonRDD[1] at collect at /opt/spark/tests/worker_memory_check.py:41), which has no missing parents
  21/01/11 01:31:34 INFO MemoryStore: Block broadcast_0 stored as values in memory (estimated size 4.9 KiB, free 546.3 MiB)
  21/01/11 01:31:34 INFO MemoryStore: Block broadcast_0_piece0 stored as bytes in memory (estimated size 3.2 KiB, free 546.3 MiB)
  21/01/11 01:31:34 INFO BlockManagerInfo: Added broadcast_0_piece0 in memory on spark-test-app-5d4f3076ef1141bc-driver-svc.3345686f5ea8436bb14117afc77393b7.svc:7079 (size: 3.2 KiB, free: 546.3 MiB)
  21/01/11 01:31:34 INFO SparkContext: Created broadcast 0 from broadcast at DAGScheduler.scala:1383
  21/01/11 01:31:34 INFO DAGScheduler: Submitting 2 missing tasks from ResultStage 0 (PythonRDD[1] at collect at /opt/spark/tests/worker_memory_check.py:41) (first 15 tasks are for partitions Vector(0, 1))
  21/01/11 01:31:34 INFO TaskSchedulerImpl: Adding task set 0.0 with 2 tasks resource profile 0
  21/01/11 01:31:49 WARN TaskSchedulerImpl: Initial job has not accepted any resources; check your cluster UI to ensure that workers are registered and have sufficient resources
  21/01/11 01:32:04 WARN TaskSchedulerImpl: Initial job has not accepted any resources; check your cluster UI to ensure that workers are registered and have sufficient resources
  21/01/11 01:32:19 WARN TaskSchedulerImpl: Initial job has not accepted any resources; check your cluster UI to ensure that workers are registered and have sufficient resources
  21/01/11 01:32:34 WARN TaskSchedulerImpl: Initial job has not accepted any resources; check your cluster UI to ensure that workers are registered and have sufficient resources
  21/01/11 01:32:49 WARN TaskSchedulerImpl: Initial job has not accepted any resources; check your cluster UI to ensure that workers are registered and have sufficient resources
  21/01/11 01:33:04 WARN TaskSchedulerImpl: Initial job has not accepted any resources; check your cluster UI to ensure that workers are registered and have sufficient resources
  21/01/11 01:33:19 WARN TaskSchedulerImpl: Initial job has not accepted any resources; check your cluster UI to ensure that workers are registered and have sufficient resources
  21/01/11 01:33:34 WARN TaskSchedulerImpl: Initial job has not accepted any resources; check your cluster UI to ensure that workers are registered and have sufficient resources
  21/01/11 01:33:49 WARN TaskSchedulerImpl: Initial job has not accepted any resources; check your cluster UI to ensure that workers are registered and have sufficient resources
  " did not contain "PySpark Worker Memory Check is: True" The application did not complete, driver log did not contain str PySpark Worker Memory Check is: True. (KubernetesSuite.scala:405)
- Run in client mode.
- Start pod creation from template
- PVs with local storage *** FAILED ***
  io.fabric8.kubernetes.client.KubernetesClientException: Failure executing: POST at: https://192.168.39.168:8443/api/v1/persistentvolumes. Message: object is being deleted: persistentvolumes "test-local-pv" already exists. Received status: Status(apiVersion=v1, code=409, details=StatusDetails(causes=[], group=null, kind=persistentvolumes, name=test-local-pv, retryAfterSeconds=null, uid=null, additionalProperties={}), kind=Status, message=object is being deleted: persistentvolumes "test-local-pv" already exists, metadata=ListMeta(_continue=null, remainingItemCount=null, resourceVersion=null, selfLink=null, additionalProperties={}), reason=AlreadyExists, status=Failure, additionalProperties={}).
  at io.fabric8.kubernetes.client.dsl.base.OperationSupport.requestFailure(OperationSupport.java:589)
  at io.fabric8.kubernetes.client.dsl.base.OperationSupport.assertResponseCode(OperationSupport.java:528)
  at io.fabric8.kubernetes.client.dsl.base.OperationSupport.handleResponse(OperationSupport.java:492)
  at io.fabric8.kubernetes.client.dsl.base.OperationSupport.handleResponse(OperationSupport.java:451)
  at io.fabric8.kubernetes.client.dsl.base.OperationSupport.handleCreate(OperationSupport.java:252)
  at io.fabric8.kubernetes.client.dsl.base.BaseOperation.handleCreate(BaseOperation.java:879)
  at io.fabric8.kubernetes.client.dsl.base.BaseOperation.create(BaseOperation.java:341)
  at io.fabric8.kubernetes.client.dsl.base.BaseOperation.create(BaseOperation.java:84)
  at org.apache.spark.deploy.k8s.integrationtest.PVTestsSuite.setupLocalStorage(PVTestsSuite.scala:87)
  at org.apache.spark.deploy.k8s.integrationtest.PVTestsSuite.$anonfun$$init$$1(PVTestsSuite.scala:137)
  ...
- Launcher client dependencies
- SPARK-33615: Launcher client archives
- SPARK-33748: Launcher python client respecting PYSPARK_PYTHON
- SPARK-33748: Launcher python client respecting spark.pyspark.python and spark.pyspark.driver.python
- Launcher python client dependencies using a zip file
- Test basic decommissioning *** FAILED ***
  The code passed to eventually never returned normally. Attempted 182 times over 3.014592867683333 minutes. Last failure message: "++ id -u
  + myuid=185
  ++ id -g
  + mygid=0
  + set +e
  ++ getent passwd 185
  + uidentry=
  + set -e
  + '[' -z '' ']'
  + '[' -w /etc/passwd ']'
  + echo '185:x:185:0:anonymous uid:/opt/spark:/bin/false'
  + SPARK_CLASSPATH=':/opt/spark/jars/*'
  + env
  + grep SPARK_JAVA_OPT_
  + sort -t_ -k4 -n
  + sed 's/[^=]*=\(.*\)/\1/g'
  + readarray -t SPARK_EXECUTOR_JAVA_OPTS
  + '[' -n '' ']'
  + '[' -z ']'
  + '[' -z ']'
  + '[' -n '' ']'
  + '[' -z ']'
  + '[' -z x ']'
  + SPARK_CLASSPATH='/opt/spark/conf::/opt/spark/jars/*'
  + case "$1" in
  + shift 1
  + CMD=("$SPARK_HOME/bin/spark-submit" --conf "spark.driver.bindAddress=$SPARK_DRIVER_BIND_ADDRESS" --deploy-mode client "$@")
  + exec /usr/bin/tini -s -- /opt/spark/bin/spark-submit --conf spark.driver.bindAddress=172.17.0.4 --deploy-mode client --properties-file /opt/spark/conf/spark.properties --class org.apache.spark.deploy.PythonRunner local:///opt/spark/tests/decommissioning.py
  21/01/11 01:40:18 WARN NativeCodeLoader: Unable to load native-hadoop library for your platform... using builtin-java classes where applicable
  Starting decom test
  Using Spark's default log4j profile: org/apache/spark/log4j-defaults.properties
  21/01/11 01:40:19 INFO SparkContext: Running Spark version 3.2.0-SNAPSHOT
  21/01/11 01:40:19 INFO ResourceUtils: ==============================================================
  21/01/11 01:40:19 INFO ResourceUtils: No custom resources configured for spark.driver.
  21/01/11 01:40:19 INFO ResourceUtils: ==============================================================
  21/01/11 01:40:19 INFO SparkContext: Submitted application: DecomTest
  21/01/11 01:40:19 INFO ResourceProfile: Default ResourceProfile created, executor resources: Map(cores -> name: cores, amount: 1, script: , vendor: , memory -> name: memory, amount: 1024, script: , vendor: , offHeap -> name: offHeap, amount: 0, script: , vendor: ), task resources: Map(cpus -> name: cpus, amount: 1.0)
  21/01/11 01:40:19 INFO ResourceProfile: Limiting resource is cpus at 1 tasks per executor
  21/01/11 01:40:19 INFO ResourceProfileManager: Added ResourceProfile id: 0
  21/01/11 01:40:19 INFO SecurityManager: Changing view acls to: 185,jenkins
  21/01/11 01:40:19 INFO SecurityManager: Changing modify acls to: 185,jenkins
  21/01/11 01:40:19 INFO SecurityManager: Changing view acls groups to: 
  21/01/11 01:40:19 INFO SecurityManager: Changing modify acls groups to: 
  21/01/11 01:40:19 INFO SecurityManager: SecurityManager: authentication enabled; ui acls disabled; users  with view permissions: Set(185, jenkins); groups with view permissions: Set(); users  with modify permissions: Set(185, jenkins); groups with modify permissions: Set()
  21/01/11 01:40:20 INFO Utils: Successfully started service 'sparkDriver' on port 7078.
  21/01/11 01:40:20 INFO SparkEnv: Registering MapOutputTracker
  21/01/11 01:40:20 INFO SparkEnv: Registering BlockManagerMaster
  21/01/11 01:40:20 INFO BlockManagerMasterEndpoint: Using org.apache.spark.storage.DefaultTopologyMapper for getting topology information
  21/01/11 01:40:20 INFO BlockManagerMasterEndpoint: BlockManagerMasterEndpoint up
  21/01/11 01:40:20 INFO SparkEnv: Registering BlockManagerMasterHeartbeat
  21/01/11 01:40:20 INFO DiskBlockManager: Created local directory at /var/data/spark-bc32e6f6-b546-4080-82dd-8974ec297dab/blockmgr-65c8c124-8d06-451a-a374-911ccf5792f8
  21/01/11 01:40:20 INFO MemoryStore: MemoryStore started with capacity 593.9 MiB
  21/01/11 01:40:20 INFO SparkEnv: Registering OutputCommitCoordinator
  21/01/11 01:40:21 INFO Utils: Successfully started service 'SparkUI' on port 4040.
  21/01/11 01:40:21 INFO SparkUI: Bound SparkUI to 0.0.0.0, and started at http://spark-test-app-800ec176ef19cde5-driver-svc.3345686f5ea8436bb14117afc77393b7.svc:4040
  21/01/11 01:40:21 INFO SparkKubernetesClientFactory: Auto-configuring K8S client using current context from users K8S config file
  21/01/11 01:40:23 INFO ExecutorPodsAllocator: Going to request 3 executors from Kubernetes for ResourceProfile Id: 0, target: 3 running: 0.
  21/01/11 01:40:23 INFO BasicExecutorFeatureStep: Adding decommission script to lifecycle
  21/01/11 01:40:23 INFO Utils: Successfully started service 'org.apache.spark.network.netty.NettyBlockTransferService' on port 7079.
  21/01/11 01:40:23 INFO NettyBlockTransferService: Server created on spark-test-app-800ec176ef19cde5-driver-svc.3345686f5ea8436bb14117afc77393b7.svc:7079
  21/01/11 01:40:23 INFO BlockManager: Using org.apache.spark.storage.RandomBlockReplicationPolicy for block replication policy
  21/01/11 01:40:23 INFO BlockManagerMaster: Registering BlockManager BlockManagerId(driver, spark-test-app-800ec176ef19cde5-driver-svc.3345686f5ea8436bb14117afc77393b7.svc, 7079, None)
  21/01/11 01:40:23 INFO BlockManagerMasterEndpoint: Registering block manager spark-test-app-800ec176ef19cde5-driver-svc.3345686f5ea8436bb14117afc77393b7.svc:7079 with 593.9 MiB RAM, BlockManagerId(driver, spark-test-app-800ec176ef19cde5-driver-svc.3345686f5ea8436bb14117afc77393b7.svc, 7079, None)
  21/01/11 01:40:23 INFO BlockManagerMaster: Registered BlockManager BlockManagerId(driver, spark-test-app-800ec176ef19cde5-driver-svc.3345686f5ea8436bb14117afc77393b7.svc, 7079, None)
  21/01/11 01:40:23 INFO BlockManager: Initialized BlockManager: BlockManagerId(driver, spark-test-app-800ec176ef19cde5-driver-svc.3345686f5ea8436bb14117afc77393b7.svc, 7079, None)
  21/01/11 01:40:23 INFO BasicExecutorFeatureStep: Adding decommission script to lifecycle
  21/01/11 01:40:23 INFO BasicExecutorFeatureStep: Adding decommission script to lifecycle
  21/01/11 01:40:28 INFO KubernetesClusterSchedulerBackend$KubernetesDriverEndpoint: Registered executor NettyRpcEndpointRef(spark-client://Executor) (172.17.0.5:57428) with ID 1,  ResourceProfileId 0
  21/01/11 01:40:28 INFO BlockManagerMasterEndpoint: Registering block manager 172.17.0.5:42569 with 593.9 MiB RAM, BlockManagerId(1, 172.17.0.5, 42569, None)
  21/01/11 01:40:53 INFO KubernetesClusterSchedulerBackend: SchedulerBackend is ready for scheduling beginning after waiting maxRegisteredResourcesWaitingTime: 30000000000(ns)
  21/01/11 01:40:53 INFO SharedState: Setting hive.metastore.warehouse.dir ('null') to the value of spark.sql.warehouse.dir ('file:/opt/spark/work-dir/spark-warehouse').
  21/01/11 01:40:53 INFO SharedState: Warehouse path is 'file:/opt/spark/work-dir/spark-warehouse'.
  21/01/11 01:40:55 INFO SparkContext: Starting job: collect at /opt/spark/tests/decommissioning.py:44
  21/01/11 01:40:55 INFO DAGScheduler: Registering RDD 2 (groupByKey at /opt/spark/tests/decommissioning.py:43) as input to shuffle 0
  21/01/11 01:40:55 INFO DAGScheduler: Got job 0 (collect at /opt/spark/tests/decommissioning.py:44) with 5 output partitions
  21/01/11 01:40:55 INFO DAGScheduler: Final stage: ResultStage 1 (collect at /opt/spark/tests/decommissioning.py:44)
  21/01/11 01:40:55 INFO DAGScheduler: Parents of final stage: List(ShuffleMapStage 0)
  21/01/11 01:40:55 INFO DAGScheduler: Missing parents: List(ShuffleMapStage 0)
  21/01/11 01:40:55 INFO DAGScheduler: Submitting ShuffleMapStage 0 (PairwiseRDD[2] at groupByKey at /opt/spark/tests/decommissioning.py:43), which has no missing parents
  21/01/11 01:40:55 INFO MemoryStore: Block broadcast_0 stored as values in memory (estimated size 10.7 KiB, free 593.9 MiB)
  21/01/11 01:40:55 INFO MemoryStore: Block broadcast_0_piece0 stored as bytes in memory (estimated size 6.5 KiB, free 593.9 MiB)
  21/01/11 01:40:55 INFO BlockManagerInfo: Added broadcast_0_piece0 in memory on spark-test-app-800ec176ef19cde5-driver-svc.3345686f5ea8436bb14117afc77393b7.svc:7079 (size: 6.5 KiB, free: 593.9 MiB)
  21/01/11 01:40:55 INFO SparkContext: Created broadcast 0 from broadcast at DAGScheduler.scala:1383
  21/01/11 01:40:55 INFO DAGScheduler: Submitting 5 missing tasks from ShuffleMapStage 0 (PairwiseRDD[2] at groupByKey at /opt/spark/tests/decommissioning.py:43) (first 15 tasks are for partitions Vector(0, 1, 2, 3, 4))
  21/01/11 01:40:55 INFO TaskSchedulerImpl: Adding task set 0.0 with 5 tasks resource profile 0
  21/01/11 01:40:55 INFO TaskSetManager: Starting task 0.0 in stage 0.0 (TID 0) (172.17.0.5, executor 1, partition 0, PROCESS_LOCAL, 7341 bytes) taskResourceAssignments Map()
  21/01/11 01:40:56 INFO BlockManagerInfo: Added broadcast_0_piece0 in memory on 172.17.0.5:42569 (size: 6.5 KiB, free: 593.9 MiB)
  21/01/11 01:40:57 INFO TaskSetManager: Starting task 1.0 in stage 0.0 (TID 1) (172.17.0.5, executor 1, partition 1, PROCESS_LOCAL, 7341 bytes) taskResourceAssignments Map()
  21/01/11 01:40:57 INFO TaskSetManager: Finished task 0.0 in stage 0.0 (TID 0) in 1965 ms on 172.17.0.5 (executor 1) (1/5)
  21/01/11 01:40:57 INFO PythonAccumulatorV2: Connected to AccumulatorServer at host: 127.0.0.1 port: 52967
  21/01/11 01:40:57 INFO TaskSetManager: Starting task 2.0 in stage 0.0 (TID 2) (172.17.0.5, executor 1, partition 2, PROCESS_LOCAL, 7341 bytes) taskResourceAssignments Map()
  21/01/11 01:40:57 INFO TaskSetManager: Finished task 1.0 in stage 0.0 (TID 1) in 135 ms on 172.17.0.5 (executor 1) (2/5)
  21/01/11 01:40:57 INFO TaskSetManager: Starting task 3.0 in stage 0.0 (TID 3) (172.17.0.5, executor 1, partition 3, PROCESS_LOCAL, 7341 bytes) taskResourceAssignments Map()
  21/01/11 01:40:57 INFO TaskSetManager: Finished task 2.0 in stage 0.0 (TID 2) in 122 ms on 172.17.0.5 (executor 1) (3/5)
  21/01/11 01:40:57 INFO TaskSetManager: Starting task 4.0 in stage 0.0 (TID 4) (172.17.0.5, executor 1, partition 4, PROCESS_LOCAL, 7341 bytes) taskResourceAssignments Map()
  21/01/11 01:40:57 INFO TaskSetManager: Finished task 3.0 in stage 0.0 (TID 3) in 118 ms on 172.17.0.5 (executor 1) (4/5)
  21/01/11 01:40:58 INFO TaskSetManager: Finished task 4.0 in stage 0.0 (TID 4) in 88 ms on 172.17.0.5 (executor 1) (5/5)
  21/01/11 01:40:58 INFO TaskSchedulerImpl: Removed TaskSet 0.0, whose tasks have all completed, from pool 
  21/01/11 01:40:58 INFO DAGScheduler: ShuffleMapStage 0 (groupByKey at /opt/spark/tests/decommissioning.py:43) finished in 2.797 s
  21/01/11 01:40:58 INFO DAGScheduler: looking for newly runnable stages
  21/01/11 01:40:58 INFO DAGScheduler: running: Set()
  21/01/11 01:40:58 INFO DAGScheduler: waiting: Set(ResultStage 1)
  21/01/11 01:40:58 INFO DAGScheduler: failed: Set()
  21/01/11 01:40:58 INFO DAGScheduler: Submitting ResultStage 1 (PythonRDD[5] at collect at /opt/spark/tests/decommissioning.py:44), which has no missing parents
  21/01/11 01:40:58 INFO MemoryStore: Block broadcast_1 stored as values in memory (estimated size 9.3 KiB, free 593.9 MiB)
  21/01/11 01:40:58 INFO MemoryStore: Block broadcast_1_piece0 stored as bytes in memory (estimated size 5.4 KiB, free 593.9 MiB)
  21/01/11 01:40:58 INFO BlockManagerInfo: Added broadcast_1_piece0 in memory on spark-test-app-800ec176ef19cde5-driver-svc.3345686f5ea8436bb14117afc77393b7.svc:7079 (size: 5.4 KiB, free: 593.9 MiB)
  21/01/11 01:40:58 INFO SparkContext: Created broadcast 1 from broadcast at DAGScheduler.scala:1383
  21/01/11 01:40:58 INFO DAGScheduler: Submitting 5 missing tasks from ResultStage 1 (PythonRDD[5] at collect at /opt/spark/tests/decommissioning.py:44) (first 15 tasks are for partitions Vector(0, 1, 2, 3, 4))
  21/01/11 01:40:58 INFO TaskSchedulerImpl: Adding task set 1.0 with 5 tasks resource profile 0
  21/01/11 01:40:58 INFO TaskSetManager: Starting task 0.0 in stage 1.0 (TID 5) (172.17.0.5, executor 1, partition 0, NODE_LOCAL, 7162 bytes) taskResourceAssignments Map()
  21/01/11 01:40:58 INFO BlockManagerInfo: Added broadcast_1_piece0 in memory on 172.17.0.5:42569 (size: 5.4 KiB, free: 593.9 MiB)
  21/01/11 01:40:58 INFO MapOutputTrackerMasterEndpoint: Asked to send map output locations for shuffle 0 to 172.17.0.5:57428
  21/01/11 01:40:58 INFO TaskSetManager: Starting task 1.0 in stage 1.0 (TID 6) (172.17.0.5, executor 1, partition 1, NODE_LOCAL, 7162 bytes) taskResourceAssignments Map()
  21/01/11 01:40:58 INFO TaskSetManager: Finished task 0.0 in stage 1.0 (TID 5) in 627 ms on 172.17.0.5 (executor 1) (1/5)
  21/01/11 01:40:58 INFO TaskSetManager: Starting task 2.0 in stage 1.0 (TID 7) (172.17.0.5, executor 1, partition 2, NODE_LOCAL, 7162 bytes) taskResourceAssignments Map()
  21/01/11 01:40:58 INFO TaskSetManager: Finished task 1.0 in stage 1.0 (TID 6) in 83 ms on 172.17.0.5 (executor 1) (2/5)
  21/01/11 01:40:58 INFO TaskSetManager: Starting task 3.0 in stage 1.0 (TID 8) (172.17.0.5, executor 1, partition 3, NODE_LOCAL, 7162 bytes) taskResourceAssignments Map()
  21/01/11 01:40:58 INFO TaskSetManager: Finished task 2.0 in stage 1.0 (TID 7) in 89 ms on 172.17.0.5 (executor 1) (3/5)
  21/01/11 01:40:58 INFO TaskSetManager: Starting task 4.0 in stage 1.0 (TID 9) (172.17.0.5, executor 1, partition 4, NODE_LOCAL, 7162 bytes) taskResourceAssignments Map()
  21/01/11 01:40:58 INFO TaskSetManager: Finished task 3.0 in stage 1.0 (TID 8) in 87 ms on 172.17.0.5 (executor 1) (4/5)
  21/01/11 01:40:59 INFO TaskSetManager: Finished task 4.0 in stage 1.0 (TID 9) in 83 ms on 172.17.0.5 (executor 1) (5/5)
  21/01/11 01:40:59 INFO TaskSchedulerImpl: Removed TaskSet 1.0, whose tasks have all completed, from pool 
  21/01/11 01:40:59 INFO DAGScheduler: ResultStage 1 (collect at /opt/spark/tests/decommissioning.py:44) finished in 0.997 s
  21/01/11 01:40:59 INFO DAGScheduler: Job 0 is finished. Cancelling potential speculative or zombie tasks for this job
  21/01/11 01:40:59 INFO TaskSchedulerImpl: Killing all running tasks in stage 1: Stage finished
  21/01/11 01:40:59 INFO DAGScheduler: Job 0 finished: collect at /opt/spark/tests/decommissioning.py:44, took 3.925468 s
  1st accumulator value is: 100
  Waiting to give nodes time to finish migration, decom exec 1.
  ...
  21/01/11 01:40:59 WARN KubernetesClusterSchedulerBackend$KubernetesDriverEndpoint: Received executor 1 decommissioned message
  21/01/11 01:40:59 INFO KubernetesClusterSchedulerBackend: Decommission executors: 1
  21/01/11 01:40:59 INFO BlockManagerMasterEndpoint: Mark BlockManagers (BlockManagerId(1, 172.17.0.5, 42569, None)) as being decommissioning.
  21/01/11 01:41:00 ERROR TaskSchedulerImpl: Lost executor 1 on 172.17.0.5: Executor decommission.
  21/01/11 01:41:00 INFO DAGScheduler: Executor lost: 1 (epoch 1)
  21/01/11 01:41:00 INFO BlockManagerMasterEndpoint: Trying to remove executor 1 from BlockManagerMaster.
  21/01/11 01:41:00 INFO BlockManagerMasterEndpoint: Removing block manager BlockManagerId(1, 172.17.0.5, 42569, None)
  21/01/11 01:41:00 INFO BlockManagerMaster: Removed 1 successfully in removeExecutor
  21/01/11 01:41:00 INFO DAGScheduler: Shuffle files lost for executor: 1 (epoch 1)
  21/01/11 01:41:01 INFO ExecutorPodsAllocator: Going to request 1 executors from Kubernetes for ResourceProfile Id: 0, target: 3 running: 2.
  21/01/11 01:41:01 INFO BasicExecutorFeatureStep: Adding decommission script to lifecycle
  21/01/11 01:41:04 INFO BlockManagerInfo: Removed broadcast_1_piece0 on spark-test-app-800ec176ef19cde5-driver-svc.3345686f5ea8436bb14117afc77393b7.svc:7079 in memory (size: 5.4 KiB, free: 593.9 MiB)
  21/01/11 01:41:05 INFO KubernetesClusterSchedulerBackend$KubernetesDriverEndpoint: Registered executor NettyRpcEndpointRef(spark-client://Executor) (172.17.0.5:57642) with ID 2,  ResourceProfileId 0
  21/01/11 01:41:05 INFO BlockManagerMasterEndpoint: Registering block manager 172.17.0.5:40321 with 593.9 MiB RAM, BlockManagerId(2, 172.17.0.5, 40321, None)
  21/01/11 01:41:29 INFO SparkContext: Starting job: count at /opt/spark/tests/decommissioning.py:49
  21/01/11 01:41:29 INFO DAGScheduler: Got job 1 (count at /opt/spark/tests/decommissioning.py:49) with 5 output partitions
  21/01/11 01:41:29 INFO DAGScheduler: Final stage: ResultStage 3 (count at /opt/spark/tests/decommissioning.py:49)
  21/01/11 01:41:29 INFO DAGScheduler: Parents of final stage: List(ShuffleMapStage 2)
  21/01/11 01:41:29 INFO DAGScheduler: Missing parents: List(ShuffleMapStage 2)
  21/01/11 01:41:29 INFO DAGScheduler: Submitting ShuffleMapStage 2 (PairwiseRDD[2] at groupByKey at /opt/spark/tests/decommissioning.py:43), which has no missing parents
  21/01/11 01:41:29 INFO MemoryStore: Block broadcast_2 stored as values in memory (estimated size 10.7 KiB, free 593.9 MiB)
  21/01/11 01:41:29 INFO MemoryStore: Block broadcast_2_piece0 stored as bytes in memory (estimated size 6.5 KiB, free 593.9 MiB)
  21/01/11 01:41:29 INFO BlockManagerInfo: Added broadcast_2_piece0 in memory on spark-test-app-800ec176ef19cde5-driver-svc.3345686f5ea8436bb14117afc77393b7.svc:7079 (size: 6.5 KiB, free: 593.9 MiB)
  21/01/11 01:41:29 INFO SparkContext: Created broadcast 2 from broadcast at DAGScheduler.scala:1383
  21/01/11 01:41:29 INFO DAGScheduler: Submitting 5 missing tasks from ShuffleMapStage 2 (PairwiseRDD[2] at groupByKey at /opt/spark/tests/decommissioning.py:43) (first 15 tasks are for partitions Vector(0, 1, 2, 3, 4))
  21/01/11 01:41:29 INFO TaskSchedulerImpl: Adding task set 2.0 with 5 tasks resource profile 0
  21/01/11 01:41:29 INFO TaskSetManager: Starting task 0.0 in stage 2.0 (TID 10) (172.17.0.5, executor 2, partition 0, PROCESS_LOCAL, 7341 bytes) taskResourceAssignments Map()
  21/01/11 01:41:29 INFO BlockManagerInfo: Added broadcast_2_piece0 in memory on 172.17.0.5:40321 (size: 6.5 KiB, free: 593.9 MiB)
  21/01/11 01:41:31 INFO TaskSetManager: Starting task 1.0 in stage 2.0 (TID 11) (172.17.0.5, executor 2, partition 1, PROCESS_LOCAL, 7341 bytes) taskResourceAssignments Map()
  21/01/11 01:41:31 INFO TaskSetManager: Finished task 0.0 in stage 2.0 (TID 10) in 2072 ms on 172.17.0.5 (executor 2) (1/5)
  21/01/11 01:41:31 INFO TaskSetManager: Finished task 1.0 in stage 2.0 (TID 11) in 133 ms on 172.17.0.5 (executor 2) (2/5)
  21/01/11 01:41:31 INFO TaskSetManager: Starting task 2.0 in stage 2.0 (TID 12) (172.17.0.5, executor 2, partition 2, PROCESS_LOCAL, 7341 bytes) taskResourceAssignments Map()
  21/01/11 01:41:31 INFO TaskSetManager: Starting task 3.0 in stage 2.0 (TID 13) (172.17.0.5, executor 2, partition 3, PROCESS_LOCAL, 7341 bytes) taskResourceAssignments Map()
  21/01/11 01:41:31 INFO TaskSetManager: Finished task 2.0 in stage 2.0 (TID 12) in 113 ms on 172.17.0.5 (executor 2) (3/5)
  21/01/11 01:41:31 INFO TaskSetManager: Starting task 4.0 in stage 2.0 (TID 14) (172.17.0.5, executor 2, partition 4, PROCESS_LOCAL, 7341 bytes) taskResourceAssignments Map()
  21/01/11 01:41:31 INFO TaskSetManager: Finished task 3.0 in stage 2.0 (TID 13) in 99 ms on 172.17.0.5 (executor 2) (4/5)
  21/01/11 01:41:31 INFO TaskSetManager: Finished task 4.0 in stage 2.0 (TID 14) in 115 ms on 172.17.0.5 (executor 2) (5/5)
  21/01/11 01:41:31 INFO TaskSchedulerImpl: Removed TaskSet 2.0, whose tasks have all completed, from pool 
  21/01/11 01:41:31 INFO DAGScheduler: ShuffleMapStage 2 (groupByKey at /opt/spark/tests/decommissioning.py:43) finished in 2.555 s
  21/01/11 01:41:31 INFO DAGScheduler: looking for newly runnable stages
  21/01/11 01:41:31 INFO DAGScheduler: running: Set()
  21/01/11 01:41:31 INFO DAGScheduler: waiting: Set(ResultStage 3)
  21/01/11 01:41:31 INFO DAGScheduler: failed: Set()
  21/01/11 01:41:31 INFO DAGScheduler: Submitting ResultStage 3 (PythonRDD[6] at count at /opt/spark/tests/decommissioning.py:49), which has no missing parents
  21/01/11 01:41:31 INFO MemoryStore: Block broadcast_3 stored as values in memory (estimated size 10.6 KiB, free 593.9 MiB)
  21/01/11 01:41:31 INFO MemoryStore: Block broadcast_3_piece0 stored as bytes in memory (estimated size 5.9 KiB, free 593.9 MiB)
  21/01/11 01:41:31 INFO BlockManagerInfo: Added broadcast_3_piece0 in memory on spark-test-app-800ec176ef19cde5-driver-svc.3345686f5ea8436bb14117afc77393b7.svc:7079 (size: 5.9 KiB, free: 593.9 MiB)
  21/01/11 01:41:31 INFO SparkContext: Created broadcast 3 from broadcast at DAGScheduler.scala:1383
  21/01/11 01:41:31 INFO DAGScheduler: Submitting 5 missing tasks from ResultStage 3 (PythonRDD[6] at count at /opt/spark/tests/decommissioning.py:49) (first 15 tasks are for partitions Vector(0, 1, 2, 3, 4))
  21/01/11 01:41:31 INFO TaskSchedulerImpl: Adding task set 3.0 with 5 tasks resource profile 0
  21/01/11 01:41:31 INFO TaskSetManager: Starting task 0.0 in stage 3.0 (TID 15) (172.17.0.5, executor 2, partition 0, NODE_LOCAL, 7162 bytes) taskResourceAssignments Map()
  21/01/11 01:41:31 INFO BlockManagerInfo: Added broadcast_3_piece0 in memory on 172.17.0.5:40321 (size: 5.9 KiB, free: 593.9 MiB)
  21/01/11 01:41:32 INFO MapOutputTrackerMasterEndpoint: Asked to send map output locations for shuffle 0 to 172.17.0.5:57642
  21/01/11 01:41:32 INFO TaskSetManager: Finished task 0.0 in stage 3.0 (TID 15) in 609 ms on 172.17.0.5 (executor 2) (1/5)
  21/01/11 01:41:32 INFO TaskSetManager: Starting task 1.0 in stage 3.0 (TID 16) (172.17.0.5, executor 2, partition 1, NODE_LOCAL, 7162 bytes) taskResourceAssignments Map()
  21/01/11 01:41:32 INFO TaskSetManager: Starting task 2.0 in stage 3.0 (TID 17) (172.17.0.5, executor 2, partition 2, NODE_LOCAL, 7162 bytes) taskResourceAssignments Map()
  21/01/11 01:41:32 INFO TaskSetManager: Finished task 1.0 in stage 3.0 (TID 16) in 88 ms on 172.17.0.5 (executor 2) (2/5)
  21/01/11 01:41:32 INFO TaskSetManager: Starting task 3.0 in stage 3.0 (TID 18) (172.17.0.5, executor 2, partition 3, NODE_LOCAL, 7162 bytes) taskResourceAssignments Map()
  21/01/11 01:41:32 INFO TaskSetManager: Finished task 2.0 in stage 3.0 (TID 17) in 67 ms on 172.17.0.5 (executor 2) (3/5)
  21/01/11 01:41:32 INFO TaskSetManager: Starting task 4.0 in stage 3.0 (TID 19) (172.17.0.5, executor 2, partition 4, NODE_LOCAL, 7162 bytes) taskResourceAssignments Map()
  21/01/11 01:41:32 INFO TaskSetManager: Finished task 3.0 in stage 3.0 (TID 18) in 71 ms on 172.17.0.5 (executor 2) (4/5)
  21/01/11 01:41:32 INFO TaskSetManager: Finished task 4.0 in stage 3.0 (TID 19) in 68 ms on 172.17.0.5 (executor 2) (5/5)
  21/01/11 01:41:32 INFO TaskSchedulerImpl: Removed TaskSet 3.0, whose tasks have all completed, from pool 
  21/01/11 01:41:32 INFO DAGScheduler: ResultStage 3 (count at /opt/spark/tests/decommissioning.py:49) finished in 0.951 s
  21/01/11 01:41:32 INFO DAGScheduler: Job 1 is finished. Cancelling potential speculative or zombie tasks for this job
  21/01/11 01:41:32 INFO TaskSchedulerImpl: Killing all running tasks in stage 3: Stage finished
  21/01/11 01:41:32 INFO DAGScheduler: Job 1 finished: count at /opt/spark/tests/decommissioning.py:49, took 3.528183 s
  21/01/11 01:41:32 INFO SparkContext: Starting job: collect at /opt/spark/tests/decommissioning.py:50
  21/01/11 01:41:32 INFO DAGScheduler: Got job 2 (collect at /opt/spark/tests/decommissioning.py:50) with 5 output partitions
  21/01/11 01:41:32 INFO DAGScheduler: Final stage: ResultStage 5 (collect at /opt/spark/tests/decommissioning.py:50)
  21/01/11 01:41:32 INFO DAGScheduler: Parents of final stage: List(ShuffleMapStage 4)
  21/01/11 01:41:32 INFO DAGScheduler: Missing parents: List()
  21/01/11 01:41:32 INFO DAGScheduler: Submitting ResultStage 5 (PythonRDD[5] at collect at /opt/spark/tests/decommissioning.py:44), which has no missing parents
  21/01/11 01:41:32 INFO MemoryStore: Block broadcast_4 stored as values in memory (estimated size 9.3 KiB, free 593.9 MiB)
  21/01/11 01:41:32 INFO MemoryStore: Block broadcast_4_piece0 stored as bytes in memory (estimated size 5.4 KiB, free 593.9 MiB)
  21/01/11 01:41:32 INFO BlockManagerInfo: Added broadcast_4_piece0 in memory on spark-test-app-800ec176ef19cde5-driver-svc.3345686f5ea8436bb14117afc77393b7.svc:7079 (size: 5.4 KiB, free: 593.9 MiB)
  21/01/11 01:41:32 INFO SparkContext: Created broadcast 4 from broadcast at DAGScheduler.scala:1383
  21/01/11 01:41:32 INFO DAGScheduler: Submitting 5 missing tasks from ResultStage 5 (PythonRDD[5] at collect at /opt/spark/tests/decommissioning.py:44) (first 15 tasks are for partitions Vector(0, 1, 2, 3, 4))
  21/01/11 01:41:32 INFO TaskSchedulerImpl: Adding task set 5.0 with 5 tasks resource profile 0
  21/01/11 01:41:32 INFO TaskSetManager: Starting task 0.0 in stage 5.0 (TID 20) (172.17.0.5, executor 2, partition 0, NODE_LOCAL, 7162 bytes) taskResourceAssignments Map()
  21/01/11 01:41:32 INFO BlockManagerInfo: Added broadcast_4_piece0 in memory on 172.17.0.5:40321 (size: 5.4 KiB, free: 593.9 MiB)
  21/01/11 01:41:32 INFO TaskSetManager: Starting task 1.0 in stage 5.0 (TID 21) (172.17.0.5, executor 2, partition 1, NODE_LOCAL, 7162 bytes) taskResourceAssignments Map()
  21/01/11 01:41:32 INFO TaskSetManager: Finished task 0.0 in stage 5.0 (TID 20) in 93 ms on 172.17.0.5 (executor 2) (1/5)
  21/01/11 01:41:32 INFO TaskSetManager: Starting task 2.0 in stage 5.0 (TID 22) (172.17.0.5, executor 2, partition 2, NODE_LOCAL, 7162 bytes) taskResourceAssignments Map()
  21/01/11 01:41:32 INFO TaskSetManager: Finished task 1.0 in stage 5.0 (TID 21) in 70 ms on 172.17.0.5 (executor 2) (2/5)
  21/01/11 01:41:32 INFO TaskSetManager: Starting task 3.0 in stage 5.0 (TID 23) (172.17.0.5, executor 2, partition 3, NODE_LOCAL, 7162 bytes) taskResourceAssignments Map()
  21/01/11 01:41:32 INFO TaskSetManager: Finished task 2.0 in stage 5.0 (TID 22) in 99 ms on 172.17.0.5 (executor 2) (3/5)
  21/01/11 01:41:33 INFO TaskSetManager: Finished task 3.0 in stage 5.0 (TID 23) in 92 ms on 172.17.0.5 (executor 2) (4/5)
  21/01/11 01:41:33 INFO TaskSetManager: Starting task 4.0 in stage 5.0 (TID 24) (172.17.0.5, executor 2, partition 4, NODE_LOCAL, 7162 bytes) taskResourceAssignments Map()
  21/01/11 01:41:33 INFO TaskSetManager: Finished task 4.0 in stage 5.0 (TID 24) in 62 ms on 172.17.0.5 (executor 2) (5/5)
  21/01/11 01:41:33 INFO TaskSchedulerImpl: Removed TaskSet 5.0, whose tasks have all completed, from pool 
  21/01/11 01:41:33 INFO DAGScheduler: ResultStage 5 (collect at /opt/spark/tests/decommissioning.py:50) finished in 0.422 s
  21/01/11 01:41:33 INFO DAGScheduler: Job 2 is finished. Cancelling potential speculative or zombie tasks for this job
  21/01/11 01:41:33 INFO TaskSchedulerImpl: Killing all running tasks in stage 5: Stage finished
  21/01/11 01:41:33 INFO DAGScheduler: Job 2 finished: collect at /opt/spark/tests/decommissioning.py:50, took 0.431984 s
  Final accumulator value is: 200
  Finished waiting, stopping Spark.
  21/01/11 01:41:33 INFO BlockManagerInfo: Removed broadcast_4_piece0 on spark-test-app-800ec176ef19cde5-driver-svc.3345686f5ea8436bb14117afc77393b7.svc:7079 in memory (size: 5.4 KiB, free: 593.9 MiB)
  21/01/11 01:41:33 INFO SparkUI: Stopped Spark web UI at http://spark-test-app-800ec176ef19cde5-driver-svc.3345686f5ea8436bb14117afc77393b7.svc:4040
  21/01/11 01:41:33 INFO BlockManagerInfo: Removed broadcast_4_piece0 on 172.17.0.5:40321 in memory (size: 5.4 KiB, free: 593.9 MiB)
  21/01/11 01:41:33 INFO KubernetesClusterSchedulerBackend: Shutting down all executors
  21/01/11 01:41:33 INFO KubernetesClusterSchedulerBackend$KubernetesDriverEndpoint: Asking each executor to shut down
  21/01/11 01:41:33 WARN ExecutorPodsWatchSnapshotSource: Kubernetes client has been closed (this is expected if the application is shutting down.)
  21/01/11 01:41:33 INFO MapOutputTrackerMasterEndpoint: MapOutputTrackerMasterEndpoint stopped!
  21/01/11 01:41:33 INFO MemoryStore: MemoryStore cleared
  21/01/11 01:41:33 INFO BlockManager: BlockManager stopped
  21/01/11 01:41:33 INFO BlockManagerMaster: BlockManagerMaster stopped
  21/01/11 01:41:33 INFO OutputCommitCoordinator$OutputCommitCoordinatorEndpoint: OutputCommitCoordinator stopped!
  21/01/11 01:41:33 INFO SparkContext: Successfully stopped SparkContext
  Done, exiting Python
  21/01/11 01:41:34 INFO ShutdownHookManager: Shutdown hook called
  21/01/11 01:41:34 INFO ShutdownHookManager: Deleting directory /tmp/spark-e02676bc-5ef8-473d-a88a-140becc1c09b
  21/01/11 01:41:34 INFO ShutdownHookManager: Deleting directory /var/data/spark-bc32e6f6-b546-4080-82dd-8974ec297dab/spark-ed120df1-4cec-4098-9b0a-9cf0ada0672e/pyspark-b1cc8fd0-b380-4313-b706-2b009614df2b
  21/01/11 01:41:34 INFO ShutdownHookManager: Deleting directory /var/data/spark-bc32e6f6-b546-4080-82dd-8974ec297dab/spark-ed120df1-4cec-4098-9b0a-9cf0ada0672e
  " did not contain "Final accumulator value is: 100" The application did not complete, driver log did not contain str Final accumulator value is: 100. (KubernetesSuite.scala:405)
- Test basic decommissioning with shuffle cleanup
- Test decommissioning with dynamic allocation & shuffle cleanups *** FAILED ***
  The code passed to eventually never returned normally. Attempted 186 times over 3.01021667175 minutes. Last failure message: "++ id -u
  + myuid=185
  ++ id -g
  + mygid=0
  + set +e
  ++ getent passwd 185
  + uidentry=
  + set -e
  + '[' -z '' ']'
  + '[' -w /etc/passwd ']'
  + echo '185:x:185:0:anonymous uid:/opt/spark:/bin/false'
  + SPARK_CLASSPATH=':/opt/spark/jars/*'
  + env
  + grep SPARK_JAVA_OPT_
  + sort -t_ -k4 -n
  + sed 's/[^=]*=\(.*\)/\1/g'
  + readarray -t SPARK_EXECUTOR_JAVA_OPTS
  + '[' -n '' ']'
  + '[' -z ']'
  + '[' -z ']'
  + '[' -n '' ']'
  + '[' -z ']'
  + '[' -z x ']'
  + SPARK_CLASSPATH='/opt/spark/conf::/opt/spark/jars/*'
  + case "$1" in
  + shift 1
  + CMD=("$SPARK_HOME/bin/spark-submit" --conf "spark.driver.bindAddress=$SPARK_DRIVER_BIND_ADDRESS" --deploy-mode client "$@")
  + exec /usr/bin/tini -s -- /opt/spark/bin/spark-submit --conf spark.driver.bindAddress=172.17.0.4 --deploy-mode client --properties-file /opt/spark/conf/spark.properties --class org.apache.spark.deploy.PythonRunner local:///opt/spark/tests/autoscale.py
  21/01/11 01:45:23 WARN NativeCodeLoader: Unable to load native-hadoop library for your platform... using builtin-java classes where applicable
  Starting autoscale test
  Using Spark's default log4j profile: org/apache/spark/log4j-defaults.properties
  21/01/11 01:45:24 INFO SparkContext: Running Spark version 3.2.0-SNAPSHOT
  21/01/11 01:45:24 INFO ResourceUtils: ==============================================================
  21/01/11 01:45:24 INFO ResourceUtils: No custom resources configured for spark.driver.
  21/01/11 01:45:24 INFO ResourceUtils: ==============================================================
  21/01/11 01:45:24 INFO SparkContext: Submitted application: AutoScale
  21/01/11 01:45:24 INFO ResourceProfile: Default ResourceProfile created, executor resources: Map(cores -> name: cores, amount: 1, script: , vendor: , memory -> name: memory, amount: 1024, script: , vendor: , offHeap -> name: offHeap, amount: 0, script: , vendor: ), task resources: Map(cpus -> name: cpus, amount: 1.0)
  21/01/11 01:45:24 INFO ResourceProfile: Limiting resource is cpus at 1 tasks per executor
  21/01/11 01:45:24 INFO ResourceProfileManager: Added ResourceProfile id: 0
  21/01/11 01:45:24 INFO SecurityManager: Changing view acls to: 185,jenkins
  21/01/11 01:45:24 INFO SecurityManager: Changing modify acls to: 185,jenkins
  21/01/11 01:45:24 INFO SecurityManager: Changing view acls groups to: 
  21/01/11 01:45:24 INFO SecurityManager: Changing modify acls groups to: 
  21/01/11 01:45:24 INFO SecurityManager: SecurityManager: authentication enabled; ui acls disabled; users  with view permissions: Set(185, jenkins); groups with view permissions: Set(); users  with modify permissions: Set(185, jenkins); groups with modify permissions: Set()
  21/01/11 01:45:25 INFO Utils: Successfully started service 'sparkDriver' on port 7078.
  21/01/11 01:45:25 INFO SparkEnv: Registering MapOutputTracker
  21/01/11 01:45:25 INFO SparkEnv: Registering BlockManagerMaster
  21/01/11 01:45:25 INFO BlockManagerMasterEndpoint: Using org.apache.spark.storage.DefaultTopologyMapper for getting topology information
  21/01/11 01:45:25 INFO BlockManagerMasterEndpoint: BlockManagerMasterEndpoint up
  21/01/11 01:45:25 INFO SparkEnv: Registering BlockManagerMasterHeartbeat
  21/01/11 01:45:25 INFO DiskBlockManager: Created local directory at /var/data/spark-fd95ff47-fe22-4493-9e39-35575bee57d7/blockmgr-e45baacb-9d7e-450c-88a0-633c03b50351
  21/01/11 01:45:25 INFO MemoryStore: MemoryStore started with capacity 593.9 MiB
  21/01/11 01:45:25 INFO SparkEnv: Registering OutputCommitCoordinator
  21/01/11 01:45:25 INFO Utils: Successfully started service 'SparkUI' on port 4040.
  21/01/11 01:45:25 INFO SparkUI: Bound SparkUI to 0.0.0.0, and started at http://spark-test-app-e9479976ef1e7787-driver-svc.3345686f5ea8436bb14117afc77393b7.svc:4040
  21/01/11 01:45:26 INFO SparkKubernetesClientFactory: Auto-configuring K8S client using current context from users K8S config file
  21/01/11 01:45:27 INFO Utils: Using initial executors = 2, max of spark.dynamicAllocation.initialExecutors, spark.dynamicAllocation.minExecutors and spark.executor.instances
  21/01/11 01:45:27 INFO ExecutorPodsAllocator: Going to request 2 executors from Kubernetes for ResourceProfile Id: 0, target: 2 running: 0.
  21/01/11 01:45:27 INFO BasicExecutorFeatureStep: Adding decommission script to lifecycle
  21/01/11 01:45:28 INFO Utils: Successfully started service 'org.apache.spark.network.netty.NettyBlockTransferService' on port 7079.
  21/01/11 01:45:28 INFO NettyBlockTransferService: Server created on spark-test-app-e9479976ef1e7787-driver-svc.3345686f5ea8436bb14117afc77393b7.svc:7079
  21/01/11 01:45:28 INFO BlockManager: Using org.apache.spark.storage.RandomBlockReplicationPolicy for block replication policy
  21/01/11 01:45:28 INFO BlockManagerMaster: Registering BlockManager BlockManagerId(driver, spark-test-app-e9479976ef1e7787-driver-svc.3345686f5ea8436bb14117afc77393b7.svc, 7079, None)
  21/01/11 01:45:28 INFO BlockManagerMasterEndpoint: Registering block manager spark-test-app-e9479976ef1e7787-driver-svc.3345686f5ea8436bb14117afc77393b7.svc:7079 with 593.9 MiB RAM, BlockManagerId(driver, spark-test-app-e9479976ef1e7787-driver-svc.3345686f5ea8436bb14117afc77393b7.svc, 7079, None)
  21/01/11 01:45:28 INFO BlockManagerMaster: Registered BlockManager BlockManagerId(driver, spark-test-app-e9479976ef1e7787-driver-svc.3345686f5ea8436bb14117afc77393b7.svc, 7079, None)
  21/01/11 01:45:28 INFO BlockManager: Initialized BlockManager: BlockManagerId(driver, spark-test-app-e9479976ef1e7787-driver-svc.3345686f5ea8436bb14117afc77393b7.svc, 7079, None)
  21/01/11 01:45:28 INFO BasicExecutorFeatureStep: Adding decommission script to lifecycle
  21/01/11 01:45:28 INFO Utils: Using initial executors = 2, max of spark.dynamicAllocation.initialExecutors, spark.dynamicAllocation.minExecutors and spark.executor.instances
  21/01/11 01:45:28 WARN ExecutorAllocationManager: Dynamic allocation without a shuffle service is an experimental feature.
  21/01/11 01:45:33 INFO KubernetesClusterSchedulerBackend$KubernetesDriverEndpoint: Registered executor NettyRpcEndpointRef(spark-client://Executor) (172.17.0.5:59112) with ID 1,  ResourceProfileId 0
  21/01/11 01:45:33 INFO ExecutorMonitor: New executor 1 has registered (new total is 1)
  21/01/11 01:45:33 INFO BlockManagerMasterEndpoint: Registering block manager 172.17.0.5:34319 with 593.9 MiB RAM, BlockManagerId(1, 172.17.0.5, 34319, None)
  21/01/11 01:45:39 INFO ExecutorPodsAllocator: Deleting 1 excess pod requests (2).
  21/01/11 01:45:57 INFO KubernetesClusterSchedulerBackend: SchedulerBackend is ready for scheduling beginning after waiting maxRegisteredResourcesWaitingTime: 30000000000(ns)
  21/01/11 01:45:58 INFO SharedState: Setting hive.metastore.warehouse.dir ('null') to the value of spark.sql.warehouse.dir ('file:/opt/spark/work-dir/spark-warehouse').
  21/01/11 01:45:58 INFO SharedState: Warehouse path is 'file:/opt/spark/work-dir/spark-warehouse'.
  21/01/11 01:45:59 INFO SparkContext: Starting job: collect at /opt/spark/tests/autoscale.py:38
  21/01/11 01:45:59 INFO DAGScheduler: Registering RDD 2 (groupByKey at /opt/spark/tests/autoscale.py:37) as input to shuffle 0
  21/01/11 01:45:59 INFO DAGScheduler: Got job 0 (collect at /opt/spark/tests/autoscale.py:38) with 5 output partitions
  21/01/11 01:45:59 INFO DAGScheduler: Final stage: ResultStage 1 (collect at /opt/spark/tests/autoscale.py:38)
  21/01/11 01:45:59 INFO DAGScheduler: Parents of final stage: List(ShuffleMapStage 0)
  21/01/11 01:45:59 INFO DAGScheduler: Missing parents: List(ShuffleMapStage 0)
  21/01/11 01:45:59 INFO DAGScheduler: Submitting ShuffleMapStage 0 (PairwiseRDD[2] at groupByKey at /opt/spark/tests/autoscale.py:37), which has no missing parents
  21/01/11 01:45:59 INFO MemoryStore: Block broadcast_0 stored as values in memory (estimated size 10.2 KiB, free 593.9 MiB)
  21/01/11 01:46:00 INFO MemoryStore: Block broadcast_0_piece0 stored as bytes in memory (estimated size 6.3 KiB, free 593.9 MiB)
  21/01/11 01:46:00 INFO BlockManagerInfo: Added broadcast_0_piece0 in memory on spark-test-app-e9479976ef1e7787-driver-svc.3345686f5ea8436bb14117afc77393b7.svc:7079 (size: 6.3 KiB, free: 593.9 MiB)
  21/01/11 01:46:00 INFO SparkContext: Created broadcast 0 from broadcast at DAGScheduler.scala:1383
  21/01/11 01:46:00 INFO DAGScheduler: Submitting 5 missing tasks from ShuffleMapStage 0 (PairwiseRDD[2] at groupByKey at /opt/spark/tests/autoscale.py:37) (first 15 tasks are for partitions Vector(0, 1, 2, 3, 4))
  21/01/11 01:46:00 INFO TaskSchedulerImpl: Adding task set 0.0 with 5 tasks resource profile 0
  21/01/11 01:46:00 INFO TaskSetManager: Starting task 0.0 in stage 0.0 (TID 0) (172.17.0.5, executor 1, partition 0, PROCESS_LOCAL, 7341 bytes) taskResourceAssignments Map()
  21/01/11 01:46:00 INFO ExecutorAllocationManager: Requesting 1 new executor because tasks are backlogged (new desired total will be 2 for resource profile id: 0)
  21/01/11 01:46:00 INFO ExecutorPodsAllocator: Going to request 1 executors from Kubernetes for ResourceProfile Id: 0, target: 2 running: 1.
  21/01/11 01:46:00 INFO BasicExecutorFeatureStep: Adding decommission script to lifecycle
  21/01/11 01:46:00 INFO BlockManagerInfo: Added broadcast_0_piece0 in memory on 172.17.0.5:34319 (size: 6.3 KiB, free: 593.9 MiB)
  21/01/11 01:46:01 INFO ExecutorAllocationManager: Requesting 2 new executors because tasks are backlogged (new desired total will be 4 for resource profile id: 0)
  21/01/11 01:46:02 INFO TaskSetManager: Starting task 1.0 in stage 0.0 (TID 1) (172.17.0.5, executor 1, partition 1, PROCESS_LOCAL, 7341 bytes) taskResourceAssignments Map()
  21/01/11 01:46:02 INFO TaskSetManager: Finished task 0.0 in stage 0.0 (TID 0) in 2157 ms on 172.17.0.5 (executor 1) (1/5)
  21/01/11 01:46:02 INFO ExecutorPodsAllocator: Going to request 2 executors from Kubernetes for ResourceProfile Id: 0, target: 4 running: 2.
  21/01/11 01:46:02 INFO BasicExecutorFeatureStep: Adding decommission script to lifecycle
  21/01/11 01:46:02 INFO PythonAccumulatorV2: Connected to AccumulatorServer at host: 127.0.0.1 port: 57001
  21/01/11 01:46:02 INFO BasicExecutorFeatureStep: Adding decommission script to lifecycle
  21/01/11 01:46:02 INFO TaskSetManager: Starting task 2.0 in stage 0.0 (TID 2) (172.17.0.5, executor 1, partition 2, PROCESS_LOCAL, 7341 bytes) taskResourceAssignments Map()
  21/01/11 01:46:02 INFO TaskSetManager: Finished task 1.0 in stage 0.0 (TID 1) in 128 ms on 172.17.0.5 (executor 1) (2/5)
  21/01/11 01:46:02 INFO TaskSetManager: Starting task 3.0 in stage 0.0 (TID 3) (172.17.0.5, executor 1, partition 3, PROCESS_LOCAL, 7341 bytes) taskResourceAssignments Map()
  21/01/11 01:46:02 INFO TaskSetManager: Finished task 2.0 in stage 0.0 (TID 2) in 105 ms on 172.17.0.5 (executor 1) (3/5)
  21/01/11 01:46:02 INFO TaskSetManager: Starting task 4.0 in stage 0.0 (TID 4) (172.17.0.5, executor 1, partition 4, PROCESS_LOCAL, 7341 bytes) taskResourceAssignments Map()
  21/01/11 01:46:02 INFO TaskSetManager: Finished task 3.0 in stage 0.0 (TID 3) in 103 ms on 172.17.0.5 (executor 1) (4/5)
  21/01/11 01:46:02 INFO TaskSetManager: Finished task 4.0 in stage 0.0 (TID 4) in 92 ms on 172.17.0.5 (executor 1) (5/5)
  21/01/11 01:46:02 INFO TaskSchedulerImpl: Removed TaskSet 0.0, whose tasks have all completed, from pool 
  21/01/11 01:46:02 INFO DAGScheduler: ShuffleMapStage 0 (groupByKey at /opt/spark/tests/autoscale.py:37) finished in 2.965 s
  21/01/11 01:46:02 INFO DAGScheduler: looking for newly runnable stages
  21/01/11 01:46:02 INFO DAGScheduler: running: Set()
  21/01/11 01:46:02 INFO DAGScheduler: waiting: Set(ResultStage 1)
  21/01/11 01:46:02 INFO DAGScheduler: failed: Set()
  21/01/11 01:46:02 INFO DAGScheduler: Submitting ResultStage 1 (PythonRDD[5] at collect at /opt/spark/tests/autoscale.py:38), which has no missing parents
  21/01/11 01:46:02 INFO MemoryStore: Block broadcast_1 stored as values in memory (estimated size 9.3 KiB, free 593.9 MiB)
  21/01/11 01:46:02 INFO MemoryStore: Block broadcast_1_piece0 stored as bytes in memory (estimated size 5.4 KiB, free 593.9 MiB)
  21/01/11 01:46:02 INFO BlockManagerInfo: Added broadcast_1_piece0 in memory on spark-test-app-e9479976ef1e7787-driver-svc.3345686f5ea8436bb14117afc77393b7.svc:7079 (size: 5.4 KiB, free: 593.9 MiB)
  21/01/11 01:46:02 INFO SparkContext: Created broadcast 1 from broadcast at DAGScheduler.scala:1383
  21/01/11 01:46:02 INFO DAGScheduler: Submitting 5 missing tasks from ResultStage 1 (PythonRDD[5] at collect at /opt/spark/tests/autoscale.py:38) (first 15 tasks are for partitions Vector(0, 1, 2, 3, 4))
  21/01/11 01:46:02 INFO TaskSchedulerImpl: Adding task set 1.0 with 5 tasks resource profile 0
  21/01/11 01:46:02 INFO TaskSetManager: Starting task 0.0 in stage 1.0 (TID 5) (172.17.0.5, executor 1, partition 0, NODE_LOCAL, 7162 bytes) taskResourceAssignments Map()
  21/01/11 01:46:02 INFO BlockManagerInfo: Added broadcast_1_piece0 in memory on 172.17.0.5:34319 (size: 5.4 KiB, free: 593.9 MiB)
  21/01/11 01:46:03 INFO MapOutputTrackerMasterEndpoint: Asked to send map output locations for shuffle 0 to 172.17.0.5:59112
  21/01/11 01:46:03 INFO TaskSetManager: Starting task 1.0 in stage 1.0 (TID 6) (172.17.0.5, executor 1, partition 1, NODE_LOCAL, 7162 bytes) taskResourceAssignments Map()
  21/01/11 01:46:03 INFO TaskSetManager: Finished task 0.0 in stage 1.0 (TID 5) in 619 ms on 172.17.0.5 (executor 1) (1/5)
  21/01/11 01:46:03 INFO ExecutorPodsAllocator: Deleting 3 excess pod requests (5,4,3).
  21/01/11 01:46:03 INFO TaskSetManager: Starting task 2.0 in stage 1.0 (TID 7) (172.17.0.5, executor 1, partition 2, NODE_LOCAL, 7162 bytes) taskResourceAssignments Map()
  21/01/11 01:46:03 INFO TaskSetManager: Finished task 1.0 in stage 1.0 (TID 6) in 92 ms on 172.17.0.5 (executor 1) (2/5)
  21/01/11 01:46:03 INFO TaskSetManager: Starting task 3.0 in stage 1.0 (TID 8) (172.17.0.5, executor 1, partition 3, NODE_LOCAL, 7162 bytes) taskResourceAssignments Map()
  21/01/11 01:46:03 INFO TaskSetManager: Finished task 2.0 in stage 1.0 (TID 7) in 76 ms on 172.17.0.5 (executor 1) (3/5)
  21/01/11 01:46:03 INFO TaskSetManager: Starting task 4.0 in stage 1.0 (TID 9) (172.17.0.5, executor 1, partition 4, NODE_LOCAL, 7162 bytes) taskResourceAssignments Map()
  21/01/11 01:46:03 INFO TaskSetManager: Finished task 3.0 in stage 1.0 (TID 8) in 70 ms on 172.17.0.5 (executor 1) (4/5)
  21/01/11 01:46:03 INFO TaskSetManager: Finished task 4.0 in stage 1.0 (TID 9) in 74 ms on 172.17.0.5 (executor 1) (5/5)
  21/01/11 01:46:03 INFO TaskSchedulerImpl: Removed TaskSet 1.0, whose tasks have all completed, from pool 
  21/01/11 01:46:03 INFO DAGScheduler: ResultStage 1 (collect at /opt/spark/tests/autoscale.py:38) finished in 0.942 s
  21/01/11 01:46:03 INFO DAGScheduler: Job 0 is finished. Cancelling potential speculative or zombie tasks for this job
  21/01/11 01:46:03 INFO TaskSchedulerImpl: Killing all running tasks in stage 1: Stage finished
  21/01/11 01:46:03 INFO DAGScheduler: Job 0 finished: collect at /opt/spark/tests/autoscale.py:38, took 4.028812 s
  Have 2
  Waiting for dynamic alloc
  21/01/11 01:46:03 INFO BlockManagerInfo: Removed broadcast_1_piece0 on spark-test-app-e9479976ef1e7787-driver-svc.3345686f5ea8436bb14117afc77393b7.svc:7079 in memory (size: 5.4 KiB, free: 593.9 MiB)
  21/01/11 01:46:03 INFO BlockManagerInfo: Removed broadcast_1_piece0 on 172.17.0.5:34319 in memory (size: 5.4 KiB, free: 593.9 MiB)
  " did not contain "Finished waiting, stopping Spark" The application did not complete, driver log did not contain str Finished waiting, stopping Spark. (KubernetesSuite.scala:405)
- Run SparkR on simple dataframe.R example
Run completed in 25 minutes, 8 seconds.
Total number of tests run: 26
Suites: completed 2, aborted 0
Tests: succeeded 22, failed 4, canceled 0, ignored 0, pending 0
*** 4 TESTS FAILED ***
[INFO] ------------------------------------------------------------------------
[INFO] Reactor Summary for Spark Project Parent POM 3.2.0-SNAPSHOT:
[INFO] 
[INFO] Spark Project Parent POM ........................... SUCCESS [  3.684 s]
[INFO] Spark Project Tags ................................. SUCCESS [  8.296 s]
[INFO] Spark Project Local DB ............................. SUCCESS [  3.713 s]
[INFO] Spark Project Networking ........................... SUCCESS [  5.409 s]
[INFO] Spark Project Shuffle Streaming Service ............ SUCCESS [  3.233 s]
[INFO] Spark Project Unsafe ............................... SUCCESS [ 10.320 s]
[INFO] Spark Project Launcher ............................. SUCCESS [  3.459 s]
[INFO] Spark Project Core ................................. SUCCESS [02:45 min]
[INFO] Spark Project Kubernetes Integration Tests ......... FAILURE [27:54 min]
[INFO] ------------------------------------------------------------------------
[INFO] BUILD FAILURE
[INFO] ------------------------------------------------------------------------
[INFO] Total time:  31:19 min
[INFO] Finished at: 2021-01-10T17:49:28-08:00
[INFO] ------------------------------------------------------------------------
[ERROR] Failed to execute goal org.scalatest:scalatest-maven-plugin:2.0.0:test (integration-test) on project spark-kubernetes-integration-tests_2.12: There are test failures -> [Help 1]
[ERROR] 
[ERROR] To see the full stack trace of the errors, re-run Maven with the -e switch.
[ERROR] Re-run Maven using the -X switch to enable full debug logging.
[ERROR] 
[ERROR] For more information about the errors and possible solutions, please read the following articles:
[ERROR] [Help 1] http://cwiki.apache.org/confluence/display/MAVEN/MojoFailureException
[ERROR] 
[ERROR] After correcting the problems, you can resume the build with the command
[ERROR]   mvn <args> -rf :spark-kubernetes-integration-tests_2.12
+ retcode3=1
+ kill -9 75702
+ minikube stop
:   Stopping "minikube" in kvm2 ...
-   "minikube" stopped.
/tmp/jenkins2998857125740770373.sh: line 68: 75702 Killed                  minikube mount ${PVC_TESTS_HOST_PATH}:${PVC_TESTS_VM_PATH} --9p-version=9p2000.L --gid=0 --uid=185
+ rm -rf /tmp/tmp.GtDx0lsAtr
+ exit 1
Build step 'Execute shell' marked build as failure
Archiving artifacts
Finished: FAILURE