FailedConsole Output

Skipping 188 KB.. Full Log
[INFO] 
[INFO] --- scala-maven-plugin:4.3.0:testCompile (scala-test-compile-first) @ spark-graphx_2.12 ---
[INFO] Using incremental compilation using Mixed compile order
[INFO] Compiler bridge file: /home/jenkins/.sbt/1.0/zinc/org.scala-sbt/org.scala-sbt-compiler-bridge_2.12-1.3.1-bin_2.12.10__52.0-1.3.1_20191012T045515.jar
[INFO] compiler plugin: BasicArtifact(com.github.ghik,silencer-plugin_2.12.10,1.6.0,null)
[INFO] Compiling 19 Scala sources to /home/jenkins/workspace/spark-master-test-k8s/graphx/target/scala-2.12/test-classes ...
[INFO] Done compiling.
[INFO] compile in 22.8 s
[INFO] 
[INFO] --- maven-surefire-plugin:3.0.0-M5:test (default-test) @ spark-graphx_2.12 ---
[INFO] Tests are skipped.
[INFO] 
[INFO] --- maven-surefire-plugin:3.0.0-M5:test (test) @ spark-graphx_2.12 ---
[INFO] Tests are skipped.
[INFO] 
[INFO] --- scalatest-maven-plugin:2.0.0:test (test) @ spark-graphx_2.12 ---
[INFO] Tests are skipped.
[INFO] 
[INFO] --- maven-jar-plugin:3.1.2:test-jar (prepare-test-jar) @ spark-graphx_2.12 ---
[INFO] Building jar: /home/jenkins/workspace/spark-master-test-k8s/graphx/target/spark-graphx_2.12-3.2.0-SNAPSHOT-tests.jar
[INFO] 
[INFO] --- maven-jar-plugin:3.1.2:jar (default-jar) @ spark-graphx_2.12 ---
[INFO] Building jar: /home/jenkins/workspace/spark-master-test-k8s/graphx/target/spark-graphx_2.12-3.2.0-SNAPSHOT.jar
[INFO] 
[INFO] --- maven-site-plugin:3.5.1:attach-descriptor (attach-descriptor) @ spark-graphx_2.12 ---
[INFO] 
[INFO] --- maven-shade-plugin:3.2.1:shade (default) @ spark-graphx_2.12 ---
[INFO] Excluding org.apache.spark:spark-core_2.12:jar:3.2.0-SNAPSHOT from the shaded jar.
[INFO] Excluding org.apache.avro:avro:jar:1.10.1 from the shaded jar.
[INFO] Excluding com.fasterxml.jackson.core:jackson-core:jar:2.11.4 from the shaded jar.
[INFO] Excluding org.apache.commons:commons-compress:jar:1.20 from the shaded jar.
[INFO] Excluding org.apache.avro:avro-mapred:jar:1.10.1 from the shaded jar.
[INFO] Excluding org.apache.avro:avro-ipc:jar:1.10.1 from the shaded jar.
[INFO] Excluding org.tukaani:xz:jar:1.8 from the shaded jar.
[INFO] Excluding com.twitter:chill_2.12:jar:0.9.5 from the shaded jar.
[INFO] Excluding com.esotericsoftware:kryo-shaded:jar:4.0.2 from the shaded jar.
[INFO] Excluding com.esotericsoftware:minlog:jar:1.3.0 from the shaded jar.
[INFO] Excluding com.twitter:chill-java:jar:0.9.5 from the shaded jar.
[INFO] Excluding org.apache.hadoop:hadoop-client-api:jar:3.2.2 from the shaded jar.
[INFO] Excluding org.apache.hadoop:hadoop-client-runtime:jar:3.2.2 from the shaded jar.
[INFO] Excluding org.apache.htrace:htrace-core4:jar:4.1.0-incubating from the shaded jar.
[INFO] Excluding commons-logging:commons-logging:jar:1.1.3 from the shaded jar.
[INFO] Excluding org.apache.spark:spark-launcher_2.12:jar:3.2.0-SNAPSHOT from the shaded jar.
[INFO] Excluding org.apache.spark:spark-kvstore_2.12:jar:3.2.0-SNAPSHOT from the shaded jar.
[INFO] Excluding org.fusesource.leveldbjni:leveldbjni-all:jar:1.8 from the shaded jar.
[INFO] Excluding com.fasterxml.jackson.core:jackson-annotations:jar:2.11.4 from the shaded jar.
[INFO] Excluding org.apache.spark:spark-network-common_2.12:jar:3.2.0-SNAPSHOT from the shaded jar.
[INFO] Excluding org.apache.spark:spark-network-shuffle_2.12:jar:3.2.0-SNAPSHOT from the shaded jar.
[INFO] Excluding org.apache.spark:spark-unsafe_2.12:jar:3.2.0-SNAPSHOT from the shaded jar.
[INFO] Excluding javax.activation:activation:jar:1.1.1 from the shaded jar.
[INFO] Excluding org.apache.curator:curator-recipes:jar:2.13.0 from the shaded jar.
[INFO] Excluding org.apache.curator:curator-framework:jar:2.13.0 from the shaded jar.
[INFO] Excluding org.apache.curator:curator-client:jar:2.13.0 from the shaded jar.
[INFO] Excluding org.apache.zookeeper:zookeeper:jar:3.6.2 from the shaded jar.
[INFO] Excluding commons-lang:commons-lang:jar:2.6 from the shaded jar.
[INFO] Excluding org.apache.zookeeper:zookeeper-jute:jar:3.6.2 from the shaded jar.
[INFO] Excluding org.apache.yetus:audience-annotations:jar:0.5.0 from the shaded jar.
[INFO] Excluding jakarta.servlet:jakarta.servlet-api:jar:4.0.3 from the shaded jar.
[INFO] Excluding commons-codec:commons-codec:jar:1.15 from the shaded jar.
[INFO] Excluding org.apache.commons:commons-lang3:jar:3.11 from the shaded jar.
[INFO] Excluding org.apache.commons:commons-math3:jar:3.4.1 from the shaded jar.
[INFO] Excluding org.apache.commons:commons-text:jar:1.6 from the shaded jar.
[INFO] Excluding commons-io:commons-io:jar:2.8.0 from the shaded jar.
[INFO] Excluding commons-collections:commons-collections:jar:3.2.2 from the shaded jar.
[INFO] Excluding com.google.code.findbugs:jsr305:jar:3.0.0 from the shaded jar.
[INFO] Excluding org.slf4j:slf4j-api:jar:1.7.30 from the shaded jar.
[INFO] Excluding org.slf4j:jul-to-slf4j:jar:1.7.30 from the shaded jar.
[INFO] Excluding org.slf4j:jcl-over-slf4j:jar:1.7.30 from the shaded jar.
[INFO] Excluding log4j:log4j:jar:1.2.17 from the shaded jar.
[INFO] Excluding org.slf4j:slf4j-log4j12:jar:1.7.30 from the shaded jar.
[INFO] Excluding com.ning:compress-lzf:jar:1.0.3 from the shaded jar.
[INFO] Excluding org.xerial.snappy:snappy-java:jar:1.1.8.2 from the shaded jar.
[INFO] Excluding org.lz4:lz4-java:jar:1.7.1 from the shaded jar.
[INFO] Excluding com.github.luben:zstd-jni:jar:1.4.8-5 from the shaded jar.
[INFO] Excluding org.roaringbitmap:RoaringBitmap:jar:0.9.0 from the shaded jar.
[INFO] Excluding org.roaringbitmap:shims:jar:0.9.0 from the shaded jar.
[INFO] Excluding commons-net:commons-net:jar:3.1 from the shaded jar.
[INFO] Excluding org.scala-lang.modules:scala-xml_2.12:jar:1.2.0 from the shaded jar.
[INFO] Excluding org.scala-lang:scala-library:jar:2.12.10 from the shaded jar.
[INFO] Excluding org.scala-lang:scala-reflect:jar:2.12.10 from the shaded jar.
[INFO] Excluding org.json4s:json4s-jackson_2.12:jar:3.7.0-M5 from the shaded jar.
[INFO] Excluding org.json4s:json4s-core_2.12:jar:3.7.0-M5 from the shaded jar.
[INFO] Excluding org.json4s:json4s-ast_2.12:jar:3.7.0-M5 from the shaded jar.
[INFO] Excluding org.json4s:json4s-scalap_2.12:jar:3.7.0-M5 from the shaded jar.
[INFO] Excluding com.thoughtworks.paranamer:paranamer:jar:2.8 from the shaded jar.
[INFO] Excluding org.glassfish.jersey.core:jersey-client:jar:2.30 from the shaded jar.
[INFO] Excluding jakarta.ws.rs:jakarta.ws.rs-api:jar:2.1.6 from the shaded jar.
[INFO] Excluding org.glassfish.hk2.external:jakarta.inject:jar:2.6.1 from the shaded jar.
[INFO] Excluding org.glassfish.jersey.core:jersey-common:jar:2.30 from the shaded jar.
[INFO] Excluding jakarta.annotation:jakarta.annotation-api:jar:1.3.5 from the shaded jar.
[INFO] Excluding org.glassfish.hk2:osgi-resource-locator:jar:1.0.3 from the shaded jar.
[INFO] Excluding org.glassfish.jersey.core:jersey-server:jar:2.30 from the shaded jar.
[INFO] Excluding org.glassfish.jersey.media:jersey-media-jaxb:jar:2.30 from the shaded jar.
[INFO] Excluding jakarta.validation:jakarta.validation-api:jar:2.0.2 from the shaded jar.
[INFO] Excluding org.glassfish.jersey.containers:jersey-container-servlet:jar:2.30 from the shaded jar.
[INFO] Excluding org.glassfish.jersey.containers:jersey-container-servlet-core:jar:2.30 from the shaded jar.
[INFO] Excluding org.glassfish.jersey.inject:jersey-hk2:jar:2.30 from the shaded jar.
[INFO] Excluding org.glassfish.hk2:hk2-locator:jar:2.6.1 from the shaded jar.
[INFO] Excluding org.glassfish.hk2.external:aopalliance-repackaged:jar:2.6.1 from the shaded jar.
[INFO] Excluding org.glassfish.hk2:hk2-api:jar:2.6.1 from the shaded jar.
[INFO] Excluding org.glassfish.hk2:hk2-utils:jar:2.6.1 from the shaded jar.
[INFO] Excluding org.javassist:javassist:jar:3.25.0-GA from the shaded jar.
[INFO] Excluding io.netty:netty-all:jar:4.1.51.Final from the shaded jar.
[INFO] Excluding com.clearspring.analytics:stream:jar:2.9.6 from the shaded jar.
[INFO] Excluding io.dropwizard.metrics:metrics-core:jar:4.1.1 from the shaded jar.
[INFO] Excluding io.dropwizard.metrics:metrics-jvm:jar:4.1.1 from the shaded jar.
[INFO] Excluding io.dropwizard.metrics:metrics-json:jar:4.1.1 from the shaded jar.
[INFO] Excluding io.dropwizard.metrics:metrics-graphite:jar:4.1.1 from the shaded jar.
[INFO] Excluding io.dropwizard.metrics:metrics-jmx:jar:4.1.1 from the shaded jar.
[INFO] Excluding com.fasterxml.jackson.core:jackson-databind:jar:2.11.4 from the shaded jar.
[INFO] Excluding com.fasterxml.jackson.module:jackson-module-scala_2.12:jar:2.11.4 from the shaded jar.
[INFO] Excluding com.fasterxml.jackson.module:jackson-module-paranamer:jar:2.11.4 from the shaded jar.
[INFO] Excluding org.apache.ivy:ivy:jar:2.4.0 from the shaded jar.
[INFO] Excluding oro:oro:jar:2.0.8 from the shaded jar.
[INFO] Excluding net.razorvine:pyrolite:jar:4.30 from the shaded jar.
[INFO] Excluding net.sf.py4j:py4j:jar:0.10.9.1 from the shaded jar.
[INFO] Excluding org.apache.commons:commons-crypto:jar:1.1.0 from the shaded jar.
[INFO] Excluding org.apache.spark:spark-mllib-local_2.12:jar:3.2.0-SNAPSHOT from the shaded jar.
[INFO] Excluding org.scalanlp:breeze_2.12:jar:1.0 from the shaded jar.
[INFO] Excluding org.scalanlp:breeze-macros_2.12:jar:1.0 from the shaded jar.
[INFO] Excluding net.sf.opencsv:opencsv:jar:2.3 from the shaded jar.
[INFO] Excluding com.github.wendykierp:JTransforms:jar:3.1 from the shaded jar.
[INFO] Excluding pl.edu.icm:JLargeArrays:jar:1.5 from the shaded jar.
[INFO] Excluding com.chuusai:shapeless_2.12:jar:2.3.3 from the shaded jar.
[INFO] Excluding org.typelevel:macro-compat_2.12:jar:1.1.1 from the shaded jar.
[INFO] Excluding org.typelevel:spire_2.12:jar:0.17.0-M1 from the shaded jar.
[INFO] Excluding org.typelevel:spire-macros_2.12:jar:0.17.0-M1 from the shaded jar.
[INFO] Excluding org.typelevel:spire-platform_2.12:jar:0.17.0-M1 from the shaded jar.
[INFO] Excluding org.typelevel:spire-util_2.12:jar:0.17.0-M1 from the shaded jar.
[INFO] Excluding org.typelevel:machinist_2.12:jar:0.6.8 from the shaded jar.
[INFO] Excluding org.typelevel:algebra_2.12:jar:2.0.0-M2 from the shaded jar.
[INFO] Excluding org.typelevel:cats-kernel_2.12:jar:2.0.0-M4 from the shaded jar.
[INFO] Excluding org.scala-lang.modules:scala-collection-compat_2.12:jar:2.1.1 from the shaded jar.
[INFO] Excluding org.apache.xbean:xbean-asm7-shaded:jar:4.15 from the shaded jar.
[INFO] Excluding com.github.fommil.netlib:core:jar:1.1.2 from the shaded jar.
[INFO] Excluding net.sourceforge.f2j:arpack_combined_all:jar:0.1 from the shaded jar.
[INFO] Excluding org.apache.spark:spark-tags_2.12:jar:3.2.0-SNAPSHOT from the shaded jar.
[INFO] Including org.spark-project.spark:unused:jar:1.0.0 in the shaded jar.
[INFO] Excluding org.objenesis:objenesis:jar:2.6 from the shaded jar.
[INFO] Replacing original artifact with shaded artifact.
[INFO] Replacing /home/jenkins/workspace/spark-master-test-k8s/graphx/target/spark-graphx_2.12-3.2.0-SNAPSHOT.jar with /home/jenkins/workspace/spark-master-test-k8s/graphx/target/spark-graphx_2.12-3.2.0-SNAPSHOT-shaded.jar
[INFO] 
[INFO] --- maven-source-plugin:3.1.0:jar-no-fork (create-source-jar) @ spark-graphx_2.12 ---
[INFO] Building jar: /home/jenkins/workspace/spark-master-test-k8s/graphx/target/spark-graphx_2.12-3.2.0-SNAPSHOT-sources.jar
[INFO] 
[INFO] --- maven-source-plugin:3.1.0:test-jar-no-fork (create-source-jar) @ spark-graphx_2.12 ---
[INFO] Building jar: /home/jenkins/workspace/spark-master-test-k8s/graphx/target/spark-graphx_2.12-3.2.0-SNAPSHOT-test-sources.jar
[INFO] 
[INFO] ---------------< org.apache.spark:spark-streaming_2.12 >----------------
[INFO] Building Spark Project Streaming 3.2.0-SNAPSHOT                  [12/29]
[INFO] --------------------------------[ jar ]---------------------------------
[INFO] 
[INFO] --- maven-clean-plugin:3.1.0:clean (default-clean) @ spark-streaming_2.12 ---
[INFO] 
[INFO] --- maven-enforcer-plugin:3.0.0-M2:enforce (enforce-versions) @ spark-streaming_2.12 ---
[INFO] 
[INFO] --- maven-enforcer-plugin:3.0.0-M2:enforce (enforce-no-duplicate-dependencies) @ spark-streaming_2.12 ---
[INFO] 
[INFO] --- mvn-scalafmt_2.12:1.0.3:format (default) @ spark-streaming_2.12 ---
[WARNING] format.skipSources set, ignoring main directories
[WARNING] format.skipTestSources set, ignoring validateOnly directories
[WARNING] No sources specified, skipping formatting
[INFO] 
[INFO] --- scala-maven-plugin:4.3.0:add-source (eclipse-add-source) @ spark-streaming_2.12 ---
[INFO] Add Source directory: /home/jenkins/workspace/spark-master-test-k8s/streaming/src/main/scala
[INFO] Add Test Source directory: /home/jenkins/workspace/spark-master-test-k8s/streaming/src/test/scala
[INFO] 
[INFO] --- maven-dependency-plugin:3.1.1:build-classpath (default-cli) @ spark-streaming_2.12 ---
[INFO] Dependencies classpath:
/home/jenkins/.m2/repository/org/scala-lang/scala-reflect/2.12.10/scala-reflect-2.12.10.jar:/home/jenkins/.m2/repository/com/clearspring/analytics/stream/2.9.6/stream-2.9.6.jar:/home/jenkins/.m2/repository/org/glassfish/hk2/external/jakarta.inject/2.6.1/jakarta.inject-2.6.1.jar:/home/jenkins/.m2/repository/org/glassfish/hk2/hk2-locator/2.6.1/hk2-locator-2.6.1.jar:/home/jenkins/.m2/repository/com/fasterxml/jackson/module/jackson-module-scala_2.12/2.11.4/jackson-module-scala_2.12-2.11.4.jar:/home/jenkins/.m2/repository/log4j/log4j/1.2.17/log4j-1.2.17.jar:/home/jenkins/.m2/repository/org/apache/avro/avro-ipc/1.10.1/avro-ipc-1.10.1.jar:/home/jenkins/.m2/repository/org/apache/curator/curator-framework/2.13.0/curator-framework-2.13.0.jar:/home/jenkins/.m2/repository/com/fasterxml/jackson/core/jackson-annotations/2.11.4/jackson-annotations-2.11.4.jar:/home/jenkins/.m2/repository/org/slf4j/slf4j-log4j12/1.7.30/slf4j-log4j12-1.7.30.jar:/home/jenkins/.m2/repository/org/apache/xbean/xbean-asm7-shaded/4.15/xbean-asm7-shaded-4.15.jar:/home/jenkins/.m2/repository/org/glassfish/hk2/hk2-utils/2.6.1/hk2-utils-2.6.1.jar:/home/jenkins/.m2/repository/io/dropwizard/metrics/metrics-core/4.1.1/metrics-core-4.1.1.jar:/home/jenkins/.m2/repository/org/apache/zookeeper/zookeeper-jute/3.6.2/zookeeper-jute-3.6.2.jar:/home/jenkins/.m2/repository/jakarta/servlet/jakarta.servlet-api/4.0.3/jakarta.servlet-api-4.0.3.jar:/home/jenkins/.m2/repository/org/apache/commons/commons-lang3/3.11/commons-lang3-3.11.jar:/home/jenkins/.m2/repository/com/thoughtworks/paranamer/paranamer/2.8/paranamer-2.8.jar:/home/jenkins/.m2/repository/io/netty/netty-all/4.1.51.Final/netty-all-4.1.51.Final.jar:/home/jenkins/.m2/repository/io/dropwizard/metrics/metrics-json/4.1.1/metrics-json-4.1.1.jar:/home/jenkins/.m2/repository/org/glassfish/hk2/hk2-api/2.6.1/hk2-api-2.6.1.jar:/home/jenkins/.m2/repository/org/roaringbitmap/shims/0.9.0/shims-0.9.0.jar:/home/jenkins/.m2/repository/com/google/code/findbugs/jsr305/3.0.0/jsr305-3.0.0.jar:/home/jenkins/.m2/repository/com/github/luben/zstd-jni/1.4.8-5/zstd-jni-1.4.8-5.jar:/home/jenkins/.m2/repository/org/objenesis/objenesis/2.6/objenesis-2.6.jar:/home/jenkins/.m2/repository/jakarta/annotation/jakarta.annotation-api/1.3.5/jakarta.annotation-api-1.3.5.jar:/home/jenkins/workspace/spark-master-test-k8s/core/target/spark-core_2.12-3.2.0-SNAPSHOT.jar:/home/jenkins/.m2/repository/org/fusesource/leveldbjni/leveldbjni-all/1.8/leveldbjni-all-1.8.jar:/home/jenkins/.m2/repository/org/apache/commons/commons-text/1.6/commons-text-1.6.jar:/home/jenkins/.m2/repository/org/glassfish/jersey/media/jersey-media-jaxb/2.30/jersey-media-jaxb-2.30.jar:/home/jenkins/.m2/repository/jakarta/ws/rs/jakarta.ws.rs-api/2.1.6/jakarta.ws.rs-api-2.1.6.jar:/home/jenkins/.m2/repository/org/glassfish/hk2/osgi-resource-locator/1.0.3/osgi-resource-locator-1.0.3.jar:/home/jenkins/.m2/repository/org/glassfish/hk2/external/aopalliance-repackaged/2.6.1/aopalliance-repackaged-2.6.1.jar:/home/jenkins/.m2/repository/org/apache/zookeeper/zookeeper/3.6.2/zookeeper-3.6.2.jar:/home/jenkins/.m2/repository/org/json4s/json4s-core_2.12/3.7.0-M5/json4s-core_2.12-3.7.0-M5.jar:/home/jenkins/.m2/repository/org/apache/htrace/htrace-core4/4.1.0-incubating/htrace-core4-4.1.0-incubating.jar:/home/jenkins/.m2/repository/org/apache/hadoop/hadoop-client-runtime/3.2.2/hadoop-client-runtime-3.2.2.jar:/home/jenkins/.m2/repository/org/apache/yetus/audience-annotations/0.5.0/audience-annotations-0.5.0.jar:/home/jenkins/.m2/repository/commons-codec/commons-codec/1.15/commons-codec-1.15.jar:/home/jenkins/.m2/repository/commons-io/commons-io/2.8.0/commons-io-2.8.0.jar:/home/jenkins/.m2/repository/io/dropwizard/metrics/metrics-jvm/4.1.1/metrics-jvm-4.1.1.jar:/home/jenkins/.m2/repository/com/fasterxml/jackson/module/jackson-module-paranamer/2.11.4/jackson-module-paranamer-2.11.4.jar:/home/jenkins/workspace/spark-master-test-k8s/common/network-shuffle/target/spark-network-shuffle_2.12-3.2.0-SNAPSHOT.jar:/home/jenkins/.m2/repository/net/sf/py4j/py4j/0.10.9.1/py4j-0.10.9.1.jar:/home/jenkins/.m2/repository/org/scala-lang/modules/scala-xml_2.12/1.2.0/scala-xml_2.12-1.2.0.jar:/home/jenkins/.m2/repository/org/scala-lang/scala-library/2.12.10/scala-library-2.12.10.jar:/home/jenkins/.m2/repository/org/apache/curator/curator-recipes/2.13.0/curator-recipes-2.13.0.jar:/home/jenkins/.m2/repository/com/esotericsoftware/kryo-shaded/4.0.2/kryo-shaded-4.0.2.jar:/home/jenkins/.m2/repository/com/esotericsoftware/minlog/1.3.0/minlog-1.3.0.jar:/home/jenkins/.m2/repository/org/slf4j/slf4j-api/1.7.30/slf4j-api-1.7.30.jar:/home/jenkins/.m2/repository/com/ning/compress-lzf/1.0.3/compress-lzf-1.0.3.jar:/home/jenkins/.m2/repository/org/glassfish/jersey/containers/jersey-container-servlet/2.30/jersey-container-servlet-2.30.jar:/home/jenkins/.m2/repository/com/fasterxml/jackson/core/jackson-databind/2.11.4/jackson-databind-2.11.4.jar:/home/jenkins/.m2/repository/com/twitter/chill-java/0.9.5/chill-java-0.9.5.jar:/home/jenkins/.m2/repository/org/apache/curator/curator-client/2.13.0/curator-client-2.13.0.jar:/home/jenkins/.m2/repository/org/slf4j/jul-to-slf4j/1.7.30/jul-to-slf4j-1.7.30.jar:/home/jenkins/workspace/spark-master-test-k8s/common/network-common/target/spark-network-common_2.12-3.2.0-SNAPSHOT.jar:/home/jenkins/.m2/repository/org/json4s/json4s-scalap_2.12/3.7.0-M5/json4s-scalap_2.12-3.7.0-M5.jar:/home/jenkins/.m2/repository/org/apache/commons/commons-crypto/1.1.0/commons-crypto-1.1.0.jar:/home/jenkins/.m2/repository/org/javassist/javassist/3.25.0-GA/javassist-3.25.0-GA.jar:/home/jenkins/.m2/repository/org/glassfish/jersey/containers/jersey-container-servlet-core/2.30/jersey-container-servlet-core-2.30.jar:/home/jenkins/.m2/repository/commons-net/commons-net/3.1/commons-net-3.1.jar:/home/jenkins/workspace/spark-master-test-k8s/common/unsafe/target/spark-unsafe_2.12-3.2.0-SNAPSHOT.jar:/home/jenkins/workspace/spark-master-test-k8s/common/tags/target/spark-tags_2.12-3.2.0-SNAPSHOT.jar:/home/jenkins/workspace/spark-master-test-k8s/common/kvstore/target/spark-kvstore_2.12-3.2.0-SNAPSHOT.jar:/home/jenkins/.m2/repository/org/lz4/lz4-java/1.7.1/lz4-java-1.7.1.jar:/home/jenkins/.m2/repository/org/apache/avro/avro/1.10.1/avro-1.10.1.jar:/home/jenkins/.m2/repository/org/json4s/json4s-jackson_2.12/3.7.0-M5/json4s-jackson_2.12-3.7.0-M5.jar:/home/jenkins/.m2/repository/commons-lang/commons-lang/2.6/commons-lang-2.6.jar:/home/jenkins/.m2/repository/io/dropwizard/metrics/metrics-graphite/4.1.1/metrics-graphite-4.1.1.jar:/home/jenkins/.m2/repository/org/xerial/snappy/snappy-java/1.1.8.2/snappy-java-1.1.8.2.jar:/home/jenkins/.m2/repository/javax/activation/activation/1.1.1/activation-1.1.1.jar:/home/jenkins/.m2/repository/org/roaringbitmap/RoaringBitmap/0.9.0/RoaringBitmap-0.9.0.jar:/home/jenkins/.m2/repository/org/apache/avro/avro-mapred/1.10.1/avro-mapred-1.10.1.jar:/home/jenkins/.m2/repository/org/slf4j/jcl-over-slf4j/1.7.30/jcl-over-slf4j-1.7.30.jar:/home/jenkins/.m2/repository/org/apache/ivy/ivy/2.4.0/ivy-2.4.0.jar:/home/jenkins/.m2/repository/org/spark-project/spark/unused/1.0.0/unused-1.0.0.jar:/home/jenkins/.m2/repository/com/fasterxml/jackson/core/jackson-core/2.11.4/jackson-core-2.11.4.jar:/home/jenkins/.m2/repository/org/glassfish/jersey/core/jersey-server/2.30/jersey-server-2.30.jar:/home/jenkins/.m2/repository/io/dropwizard/metrics/metrics-jmx/4.1.1/metrics-jmx-4.1.1.jar:/home/jenkins/.m2/repository/com/twitter/chill_2.12/0.9.5/chill_2.12-0.9.5.jar:/home/jenkins/.m2/repository/org/apache/commons/commons-math3/3.4.1/commons-math3-3.4.1.jar:/home/jenkins/.m2/repository/org/glassfish/jersey/core/jersey-client/2.30/jersey-client-2.30.jar:/home/jenkins/.m2/repository/commons-collections/commons-collections/3.2.2/commons-collections-3.2.2.jar:/home/jenkins/.m2/repository/net/razorvine/pyrolite/4.30/pyrolite-4.30.jar:/home/jenkins/.m2/repository/jakarta/validation/jakarta.validation-api/2.0.2/jakarta.validation-api-2.0.2.jar:/home/jenkins/.m2/repository/org/tukaani/xz/1.8/xz-1.8.jar:/home/jenkins/.m2/repository/org/glassfish/jersey/inject/jersey-hk2/2.30/jersey-hk2-2.30.jar:/home/jenkins/.m2/repository/commons-logging/commons-logging/1.1.3/commons-logging-1.1.3.jar:/home/jenkins/workspace/spark-master-test-k8s/launcher/target/spark-launcher_2.12-3.2.0-SNAPSHOT.jar:/home/jenkins/.m2/repository/org/apache/hadoop/hadoop-client-api/3.2.2/hadoop-client-api-3.2.2.jar:/home/jenkins/.m2/repository/org/json4s/json4s-ast_2.12/3.7.0-M5/json4s-ast_2.12-3.7.0-M5.jar:/home/jenkins/.m2/repository/org/glassfish/jersey/core/jersey-common/2.30/jersey-common-2.30.jar:/home/jenkins/.m2/repository/oro/oro/2.0.8/oro-2.0.8.jar:/home/jenkins/.m2/repository/org/apache/commons/commons-compress/1.20/commons-compress-1.20.jar
[INFO] 
[INFO] --- maven-remote-resources-plugin:1.5:process (process-resource-bundles) @ spark-streaming_2.12 ---
[INFO] 
[INFO] --- maven-resources-plugin:2.7:resources (default-resources) @ spark-streaming_2.12 ---
[INFO] Using 'UTF-8' encoding to copy filtered resources.
[INFO] skip non existing resourceDirectory /home/jenkins/workspace/spark-master-test-k8s/streaming/src/main/resources
[INFO] Copying 3 resources
[INFO] 
[INFO] --- maven-compiler-plugin:3.8.1:compile (default-compile) @ spark-streaming_2.12 ---
[INFO] Not compiling main sources
[INFO] 
[INFO] --- scala-maven-plugin:4.3.0:compile (scala-compile-first) @ spark-streaming_2.12 ---
[INFO] Using incremental compilation using Mixed compile order
[INFO] Compiler bridge file: /home/jenkins/.sbt/1.0/zinc/org.scala-sbt/org.scala-sbt-compiler-bridge_2.12-1.3.1-bin_2.12.10__52.0-1.3.1_20191012T045515.jar
[INFO] compiler plugin: BasicArtifact(com.github.ghik,silencer-plugin_2.12.10,1.6.0,null)
[INFO] Compiling 104 Scala sources and 6 Java sources to /home/jenkins/workspace/spark-master-test-k8s/streaming/target/scala-2.12/classes ...
[INFO] Done compiling.
[INFO] compile in 29.1 s
[INFO] 
[INFO] --- maven-antrun-plugin:1.8:run (create-tmp-dir) @ spark-streaming_2.12 ---
[INFO] Executing tasks

main:
    [mkdir] Created dir: /home/jenkins/workspace/spark-master-test-k8s/streaming/target/tmp
[INFO] Executed tasks
[INFO] 
[INFO] --- maven-resources-plugin:2.7:testResources (default-testResources) @ spark-streaming_2.12 ---
[INFO] Using 'UTF-8' encoding to copy filtered resources.
[INFO] Copying 1 resource
[INFO] Copying 3 resources
[INFO] 
[INFO] --- maven-compiler-plugin:3.8.1:testCompile (default-testCompile) @ spark-streaming_2.12 ---
[INFO] Not compiling test sources
[INFO] 
[INFO] --- maven-dependency-plugin:3.1.1:build-classpath (generate-test-classpath) @ spark-streaming_2.12 ---
[INFO] Dependencies classpath:
/home/jenkins/.m2/repository/org/eclipse/jetty/jetty-client/9.4.36.v20210114/jetty-client-9.4.36.v20210114.jar:/home/jenkins/.m2/repository/org/scalatestplus/scalatestplus-mockito_2.12/1.0.0-SNAP5/scalatestplus-mockito_2.12-1.0.0-SNAP5.jar:/home/jenkins/.m2/repository/com/clearspring/analytics/stream/2.9.6/stream-2.9.6.jar:/home/jenkins/.m2/repository/org/glassfish/hk2/external/jakarta.inject/2.6.1/jakarta.inject-2.6.1.jar:/home/jenkins/.m2/repository/org/glassfish/hk2/hk2-locator/2.6.1/hk2-locator-2.6.1.jar:/home/jenkins/.m2/repository/org/slf4j/slf4j-log4j12/1.7.30/slf4j-log4j12-1.7.30.jar:/home/jenkins/.m2/repository/org/glassfish/hk2/hk2-utils/2.6.1/hk2-utils-2.6.1.jar:/home/jenkins/.m2/repository/org/seleniumhq/selenium/htmlunit-driver/2.40.0/htmlunit-driver-2.40.0.jar:/home/jenkins/.m2/repository/org/scalatest/scalatest-freespec_2.12/3.2.3/scalatest-freespec_2.12-3.2.3.jar:/home/jenkins/.m2/repository/org/scalatest/scalatest-funsuite_2.12/3.2.3/scalatest-funsuite_2.12-3.2.3.jar:/home/jenkins/.m2/repository/org/apache/zookeeper/zookeeper-jute/3.6.2/zookeeper-jute-3.6.2.jar:/home/jenkins/.m2/repository/jakarta/servlet/jakarta.servlet-api/4.0.3/jakarta.servlet-api-4.0.3.jar:/home/jenkins/.m2/repository/org/eclipse/jetty/jetty-servlet/9.4.36.v20210114/jetty-servlet-9.4.36.v20210114.jar:/home/jenkins/.m2/repository/com/thoughtworks/paranamer/paranamer/2.8/paranamer-2.8.jar:/home/jenkins/.m2/repository/io/netty/netty-all/4.1.51.Final/netty-all-4.1.51.Final.jar:/home/jenkins/.m2/repository/org/eclipse/jetty/jetty-continuation/9.4.36.v20210114/jetty-continuation-9.4.36.v20210114.jar:/home/jenkins/.m2/repository/org/scalatest/scalatest-funspec_2.12/3.2.3/scalatest-funspec_2.12-3.2.3.jar:/home/jenkins/.m2/repository/com/google/code/findbugs/jsr305/3.0.0/jsr305-3.0.0.jar:/home/jenkins/.m2/repository/com/github/luben/zstd-jni/1.4.8-5/zstd-jni-1.4.8-5.jar:/home/jenkins/.m2/repository/org/objenesis/objenesis/2.6/objenesis-2.6.jar:/home/jenkins/.m2/repository/org/fusesource/leveldbjni/leveldbjni-all/1.8/leveldbjni-all-1.8.jar:/home/jenkins/.m2/repository/xml-apis/xml-apis/1.4.01/xml-apis-1.4.01.jar:/home/jenkins/.m2/repository/org/apache/commons/commons-text/1.6/commons-text-1.6.jar:/home/jenkins/.m2/repository/org/glassfish/jersey/media/jersey-media-jaxb/2.30/jersey-media-jaxb-2.30.jar:/home/jenkins/.m2/repository/org/scalatest/scalatest-diagrams_2.12/3.2.3/scalatest-diagrams_2.12-3.2.3.jar:/home/jenkins/.m2/repository/jakarta/ws/rs/jakarta.ws.rs-api/2.1.6/jakarta.ws.rs-api-2.1.6.jar:/home/jenkins/.m2/repository/org/glassfish/hk2/external/aopalliance-repackaged/2.6.1/aopalliance-repackaged-2.6.1.jar:/home/jenkins/.m2/repository/org/apache/zookeeper/zookeeper/3.6.2/zookeeper-3.6.2.jar:/home/jenkins/.m2/repository/org/json4s/json4s-core_2.12/3.7.0-M5/json4s-core_2.12-3.7.0-M5.jar:/home/jenkins/.m2/repository/org/apache/htrace/htrace-core4/4.1.0-incubating/htrace-core4-4.1.0-incubating.jar:/home/jenkins/.m2/repository/commons-codec/commons-codec/1.15/commons-codec-1.15.jar:/home/jenkins/.m2/repository/commons-io/commons-io/2.8.0/commons-io-2.8.0.jar:/home/jenkins/workspace/spark-master-test-k8s/common/network-shuffle/target/spark-network-shuffle_2.12-3.2.0-SNAPSHOT.jar:/home/jenkins/.m2/repository/net/sf/py4j/py4j/0.10.9.1/py4j-0.10.9.1.jar:/home/jenkins/.m2/repository/xalan/serializer/2.7.2/serializer-2.7.2.jar:/home/jenkins/.m2/repository/org/scala-lang/scala-library/2.12.10/scala-library-2.12.10.jar:/home/jenkins/.m2/repository/com/esotericsoftware/kryo-shaded/4.0.2/kryo-shaded-4.0.2.jar:/home/jenkins/.m2/repository/com/esotericsoftware/minlog/1.3.0/minlog-1.3.0.jar:/home/jenkins/.m2/repository/xalan/xalan/2.7.2/xalan-2.7.2.jar:/home/jenkins/.m2/repository/xerces/xercesImpl/2.12.0/xercesImpl-2.12.0.jar:/home/jenkins/.m2/repository/net/bytebuddy/byte-buddy/1.10.13/byte-buddy-1.10.13.jar:/home/jenkins/.m2/repository/org/scalatest/scalatest_2.12/3.2.3/scalatest_2.12-3.2.3.jar:/home/jenkins/.m2/repository/org/scalatest/scalatest-mustmatchers_2.12/3.2.3/scalatest-mustmatchers_2.12-3.2.3.jar:/home/jenkins/.m2/repository/com/squareup/okhttp3/okhttp/3.11.0/okhttp-3.11.0.jar:/home/jenkins/.m2/repository/com/fasterxml/jackson/core/jackson-databind/2.11.4/jackson-databind-2.11.4.jar:/home/jenkins/.m2/repository/com/twitter/chill-java/0.9.5/chill-java-0.9.5.jar:/home/jenkins/.m2/repository/org/slf4j/jul-to-slf4j/1.7.30/jul-to-slf4j-1.7.30.jar:/home/jenkins/.m2/repository/org/json4s/json4s-scalap_2.12/3.7.0-M5/json4s-scalap_2.12-3.7.0-M5.jar:/home/jenkins/.m2/repository/commons-net/commons-net/3.1/commons-net-3.1.jar:/home/jenkins/workspace/spark-master-test-k8s/common/unsafe/target/spark-unsafe_2.12-3.2.0-SNAPSHOT.jar:/home/jenkins/.m2/repository/org/eclipse/jetty/websocket/websocket-common/9.4.28.v20200408/websocket-common-9.4.28.v20200408.jar:/home/jenkins/workspace/spark-master-test-k8s/common/tags/target/spark-tags_2.12-3.2.0-SNAPSHOT.jar:/home/jenkins/.m2/repository/org/seleniumhq/selenium/selenium-ie-driver/3.141.59/selenium-ie-driver-3.141.59.jar:/home/jenkins/.m2/repository/org/apache/httpcomponents/httpclient/4.5.13/httpclient-4.5.13.jar:/home/jenkins/.m2/repository/org/lz4/lz4-java/1.7.1/lz4-java-1.7.1.jar:/home/jenkins/.m2/repository/org/apache/avro/avro/1.10.1/avro-1.10.1.jar:/home/jenkins/.m2/repository/org/json4s/json4s-jackson_2.12/3.7.0-M5/json4s-jackson_2.12-3.7.0-M5.jar:/home/jenkins/.m2/repository/org/scalatestplus/scalatestplus-scalacheck_2.12/3.1.0.0-RC2/scalatestplus-scalacheck_2.12-3.1.0.0-RC2.jar:/home/jenkins/.m2/repository/commons-lang/commons-lang/2.6/commons-lang-2.6.jar:/home/jenkins/.m2/repository/org/scalatest/scalatest-wordspec_2.12/3.2.3/scalatest-wordspec_2.12-3.2.3.jar:/home/jenkins/.m2/repository/io/dropwizard/metrics/metrics-graphite/4.1.1/metrics-graphite-4.1.1.jar:/home/jenkins/.m2/repository/org/seleniumhq/selenium/selenium-edge-driver/3.141.59/selenium-edge-driver-3.141.59.jar:/home/jenkins/.m2/repository/net/sourceforge/htmlunit/htmlunit-core-js/2.40.0/htmlunit-core-js-2.40.0.jar:/home/jenkins/.m2/repository/org/apache/commons/commons-exec/1.3/commons-exec-1.3.jar:/home/jenkins/.m2/repository/javax/activation/activation/1.1.1/activation-1.1.1.jar:/home/jenkins/.m2/repository/com/google/guava/guava/14.0.1/guava-14.0.1.jar:/home/jenkins/.m2/repository/org/eclipse/jetty/jetty-server/9.4.36.v20210114/jetty-server-9.4.36.v20210114.jar:/home/jenkins/.m2/repository/org/apache/httpcomponents/httpcore/4.4.12/httpcore-4.4.12.jar:/home/jenkins/.m2/repository/org/scalactic/scalactic_2.12/3.2.3/scalactic_2.12-3.2.3.jar:/home/jenkins/.m2/repository/org/apache/ivy/ivy/2.4.0/ivy-2.4.0.jar:/home/jenkins/.m2/repository/javax/servlet/javax.servlet-api/3.1.0/javax.servlet-api-3.1.0.jar:/home/jenkins/.m2/repository/net/sourceforge/htmlunit/htmlunit/2.40.0/htmlunit-2.40.0.jar:/home/jenkins/.m2/repository/com/twitter/chill_2.12/0.9.5/chill_2.12-0.9.5.jar:/home/jenkins/.m2/repository/org/apache/commons/commons-math3/3.4.1/commons-math3-3.4.1.jar:/home/jenkins/.m2/repository/net/razorvine/pyrolite/4.30/pyrolite-4.30.jar:/home/jenkins/.m2/repository/jakarta/validation/jakarta.validation-api/2.0.2/jakarta.validation-api-2.0.2.jar:/home/jenkins/.m2/repository/org/scalatest/scalatest-core_2.12/3.2.3/scalatest-core_2.12-3.2.3.jar:/home/jenkins/.m2/repository/org/tukaani/xz/1.8/xz-1.8.jar:/home/jenkins/.m2/repository/org/glassfish/jersey/inject/jersey-hk2/2.30/jersey-hk2-2.30.jar:/home/jenkins/workspace/spark-master-test-k8s/launcher/target/spark-launcher_2.12-3.2.0-SNAPSHOT.jar:/home/jenkins/.m2/repository/org/apache/hadoop/hadoop-client-api/3.2.2/hadoop-client-api-3.2.2.jar:/home/jenkins/.m2/repository/org/json4s/json4s-ast_2.12/3.7.0-M5/json4s-ast_2.12-3.7.0-M5.jar:/home/jenkins/.m2/repository/org/glassfish/jersey/core/jersey-common/2.30/jersey-common-2.30.jar:/home/jenkins/.m2/repository/oro/oro/2.0.8/oro-2.0.8.jar:/home/jenkins/.m2/repository/org/eclipse/jetty/jetty-util/9.4.36.v20210114/jetty-util-9.4.36.v20210114.jar:/home/jenkins/.m2/repository/org/scala-lang/scala-reflect/2.12.10/scala-reflect-2.12.10.jar:/home/jenkins/.m2/repository/com/fasterxml/jackson/module/jackson-module-scala_2.12/2.11.4/jackson-module-scala_2.12-2.11.4.jar:/home/jenkins/.m2/repository/log4j/log4j/1.2.17/log4j-1.2.17.jar:/home/jenkins/.m2/repository/com/novocode/junit-interface/0.11/junit-interface-0.11.jar:/home/jenkins/.m2/repository/org/apache/avro/avro-ipc/1.10.1/avro-ipc-1.10.1.jar:/home/jenkins/.m2/repository/org/apache/curator/curator-framework/2.13.0/curator-framework-2.13.0.jar:/home/jenkins/.m2/repository/com/fasterxml/jackson/core/jackson-annotations/2.11.4/jackson-annotations-2.11.4.jar:/home/jenkins/.m2/repository/org/eclipse/jetty/jetty-plus/9.4.36.v20210114/jetty-plus-9.4.36.v20210114.jar:/home/jenkins/.m2/repository/org/apache/xbean/xbean-asm7-shaded/4.15/xbean-asm7-shaded-4.15.jar:/home/jenkins/.m2/repository/io/dropwizard/metrics/metrics-core/4.1.1/metrics-core-4.1.1.jar:/home/jenkins/.m2/repository/junit/junit/4.13.1/junit-4.13.1.jar:/home/jenkins/.m2/repository/org/apache/commons/commons-lang3/3.11/commons-lang3-3.11.jar:/home/jenkins/.m2/repository/com/shapesecurity/salvation/2.7.1/salvation-2.7.1.jar:/home/jenkins/.m2/repository/io/dropwizard/metrics/metrics-json/4.1.1/metrics-json-4.1.1.jar:/home/jenkins/.m2/repository/org/glassfish/hk2/hk2-api/2.6.1/hk2-api-2.6.1.jar:/home/jenkins/.m2/repository/org/roaringbitmap/shims/0.9.0/shims-0.9.0.jar:/home/jenkins/.m2/repository/org/seleniumhq/selenium/selenium-chrome-driver/3.141.59/selenium-chrome-driver-3.141.59.jar:/home/jenkins/.m2/repository/org/seleniumhq/selenium/selenium-opera-driver/3.141.59/selenium-opera-driver-3.141.59.jar:/home/jenkins/.m2/repository/jakarta/annotation/jakarta.annotation-api/1.3.5/jakarta.annotation-api-1.3.5.jar:/home/jenkins/workspace/spark-master-test-k8s/core/target/spark-core_2.12-3.2.0-SNAPSHOT.jar:/home/jenkins/.m2/repository/org/glassfish/hk2/osgi-resource-locator/1.0.3/osgi-resource-locator-1.0.3.jar:/home/jenkins/.m2/repository/net/bytebuddy/byte-buddy-agent/1.10.13/byte-buddy-agent-1.10.13.jar:/home/jenkins/.m2/repository/org/apache/hadoop/hadoop-client-runtime/3.2.2/hadoop-client-runtime-3.2.2.jar:/home/jenkins/.m2/repository/org/apache/yetus/audience-annotations/0.5.0/audience-annotations-0.5.0.jar:/home/jenkins/.m2/repository/io/dropwizard/metrics/metrics-jvm/4.1.1/metrics-jvm-4.1.1.jar:/home/jenkins/workspace/spark-master-test-k8s/common/tags/target/spark-tags_2.12-3.2.0-SNAPSHOT-tests.jar:/home/jenkins/.m2/repository/org/scalatestplus/scalatestplus-selenium_2.12/1.0.0-SNAP5/scalatestplus-selenium_2.12-1.0.0-SNAP5.jar:/home/jenkins/workspace/spark-master-test-k8s/core/target/spark-core_2.12-3.2.0-SNAPSHOT-tests.jar:/home/jenkins/.m2/repository/org/scala-sbt/test-interface/1.0/test-interface-1.0.jar:/home/jenkins/.m2/repository/com/fasterxml/jackson/module/jackson-module-paranamer/2.11.4/jackson-module-paranamer-2.11.4.jar:/home/jenkins/.m2/repository/com/squareup/okio/okio/1.14.0/okio-1.14.0.jar:/home/jenkins/.m2/repository/org/eclipse/jetty/jetty-proxy/9.4.36.v20210114/jetty-proxy-9.4.36.v20210114.jar:/home/jenkins/.m2/repository/org/hamcrest/hamcrest-core/1.3/hamcrest-core-1.3.jar:/home/jenkins/.m2/repository/org/eclipse/jetty/jetty-xml/9.4.36.v20210114/jetty-xml-9.4.36.v20210114.jar:/home/jenkins/.m2/repository/org/seleniumhq/selenium/selenium-support/3.141.59/selenium-support-3.141.59.jar:/home/jenkins/.m2/repository/org/scala-lang/modules/scala-xml_2.12/1.2.0/scala-xml_2.12-1.2.0.jar:/home/jenkins/.m2/repository/org/apache/curator/curator-recipes/2.13.0/curator-recipes-2.13.0.jar:/home/jenkins/.m2/repository/org/slf4j/slf4j-api/1.7.30/slf4j-api-1.7.30.jar:/home/jenkins/.m2/repository/com/ning/compress-lzf/1.0.3/compress-lzf-1.0.3.jar:/home/jenkins/.m2/repository/org/glassfish/jersey/containers/jersey-container-servlet/2.30/jersey-container-servlet-2.30.jar:/home/jenkins/.m2/repository/org/eclipse/jetty/jetty-webapp/9.4.36.v20210114/jetty-webapp-9.4.36.v20210114.jar:/home/jenkins/.m2/repository/org/eclipse/jetty/jetty-io/9.4.36.v20210114/jetty-io-9.4.36.v20210114.jar:/home/jenkins/.m2/repository/org/seleniumhq/selenium/selenium-remote-driver/3.141.59/selenium-remote-driver-3.141.59.jar:/home/jenkins/.m2/repository/org/apache/httpcomponents/httpmime/4.5.13/httpmime-4.5.13.jar:/home/jenkins/.m2/repository/org/apache/curator/curator-client/2.13.0/curator-client-2.13.0.jar:/home/jenkins/workspace/spark-master-test-k8s/common/network-common/target/spark-network-common_2.12-3.2.0-SNAPSHOT.jar:/home/jenkins/.m2/repository/org/apache/commons/commons-crypto/1.1.0/commons-crypto-1.1.0.jar:/home/jenkins/.m2/repository/org/javassist/javassist/3.25.0-GA/javassist-3.25.0-GA.jar:/home/jenkins/.m2/repository/org/glassfish/jersey/containers/jersey-container-servlet-core/2.30/jersey-container-servlet-core-2.30.jar:/home/jenkins/.m2/repository/org/eclipse/jetty/jetty-servlets/9.4.36.v20210114/jetty-servlets-9.4.36.v20210114.jar:/home/jenkins/.m2/repository/org/brotli/dec/0.1.2/dec-0.1.2.jar:/home/jenkins/workspace/spark-master-test-k8s/common/kvstore/target/spark-kvstore_2.12-3.2.0-SNAPSHOT.jar:/home/jenkins/.m2/repository/net/sourceforge/htmlunit/neko-htmlunit/2.40.0/neko-htmlunit-2.40.0.jar:/home/jenkins/.m2/repository/org/scalatest/scalatest-flatspec_2.12/3.2.3/scalatest-flatspec_2.12-3.2.3.jar:/home/jenkins/.m2/repository/org/scalatest/scalatest-refspec_2.12/3.2.3/scalatest-refspec_2.12-3.2.3.jar:/home/jenkins/.m2/repository/org/seleniumhq/selenium/selenium-api/3.141.59/selenium-api-3.141.59.jar:/home/jenkins/.m2/repository/org/seleniumhq/selenium/selenium-java/3.141.59/selenium-java-3.141.59.jar:/home/jenkins/.m2/repository/org/mockito/mockito-core/3.4.6/mockito-core-3.4.6.jar:/home/jenkins/.m2/repository/org/xerial/snappy/snappy-java/1.1.8.2/snappy-java-1.1.8.2.jar:/home/jenkins/.m2/repository/org/scalacheck/scalacheck_2.12/1.14.2/scalacheck_2.12-1.14.2.jar:/home/jenkins/.m2/repository/org/roaringbitmap/RoaringBitmap/0.9.0/RoaringBitmap-0.9.0.jar:/home/jenkins/.m2/repository/org/eclipse/jetty/jetty-security/9.4.36.v20210114/jetty-security-9.4.36.v20210114.jar:/home/jenkins/.m2/repository/org/apache/avro/avro-mapred/1.10.1/avro-mapred-1.10.1.jar:/home/jenkins/.m2/repository/org/slf4j/jcl-over-slf4j/1.7.30/jcl-over-slf4j-1.7.30.jar:/home/jenkins/.m2/repository/org/spark-project/spark/unused/1.0.0/unused-1.0.0.jar:/home/jenkins/.m2/repository/com/fasterxml/jackson/core/jackson-core/2.11.4/jackson-core-2.11.4.jar:/home/jenkins/.m2/repository/org/glassfish/jersey/core/jersey-server/2.30/jersey-server-2.30.jar:/home/jenkins/.m2/repository/io/dropwizard/metrics/metrics-jmx/4.1.1/metrics-jmx-4.1.1.jar:/home/jenkins/.m2/repository/org/glassfish/jersey/core/jersey-client/2.30/jersey-client-2.30.jar:/home/jenkins/.m2/repository/commons-collections/commons-collections/3.2.2/commons-collections-3.2.2.jar:/home/jenkins/.m2/repository/org/scalatest/scalatest-compatible/3.2.3/scalatest-compatible-3.2.3.jar:/home/jenkins/.m2/repository/org/scalatest/scalatest-propspec_2.12/3.2.3/scalatest-propspec_2.12-3.2.3.jar:/home/jenkins/.m2/repository/org/scalatest/scalatest-featurespec_2.12/3.2.3/scalatest-featurespec_2.12-3.2.3.jar:/home/jenkins/.m2/repository/org/eclipse/jetty/jetty-http/9.4.36.v20210114/jetty-http-9.4.36.v20210114.jar:/home/jenkins/.m2/repository/org/seleniumhq/selenium/selenium-firefox-driver/3.141.59/selenium-firefox-driver-3.141.59.jar:/home/jenkins/.m2/repository/commons-logging/commons-logging/1.1.3/commons-logging-1.1.3.jar:/home/jenkins/.m2/repository/org/eclipse/jetty/jetty-util-ajax/9.4.36.v20210114/jetty-util-ajax-9.4.36.v20210114.jar:/home/jenkins/.m2/repository/org/eclipse/jetty/websocket/websocket-api/9.4.28.v20200408/websocket-api-9.4.28.v20200408.jar:/home/jenkins/.m2/repository/org/seleniumhq/selenium/selenium-safari-driver/3.141.59/selenium-safari-driver-3.141.59.jar:/home/jenkins/.m2/repository/org/eclipse/jetty/websocket/websocket-client/9.4.28.v20200408/websocket-client-9.4.28.v20200408.jar:/home/jenkins/.m2/repository/org/scalatest/scalatest-shouldmatchers_2.12/3.2.3/scalatest-shouldmatchers_2.12-3.2.3.jar:/home/jenkins/.m2/repository/org/eclipse/jetty/jetty-jndi/9.4.36.v20210114/jetty-jndi-9.4.36.v20210114.jar:/home/jenkins/.m2/repository/org/apache/commons/commons-compress/1.20/commons-compress-1.20.jar:/home/jenkins/.m2/repository/net/sourceforge/htmlunit/htmlunit-cssparser/1.5.0/htmlunit-cssparser-1.5.0.jar:/home/jenkins/.m2/repository/org/scalatest/scalatest-matchers-core_2.12/3.2.3/scalatest-matchers-core_2.12-3.2.3.jar
[INFO] 
[INFO] --- scala-maven-plugin:4.3.0:testCompile (scala-test-compile-first) @ spark-streaming_2.12 ---
[INFO] Using incremental compilation using Mixed compile order
[INFO] Compiler bridge file: /home/jenkins/.sbt/1.0/zinc/org.scala-sbt/org.scala-sbt-compiler-bridge_2.12-1.3.1-bin_2.12.10__52.0-1.3.1_20191012T045515.jar
[INFO] compiler plugin: BasicArtifact(com.github.ghik,silencer-plugin_2.12.10,1.6.0,null)
[INFO] Compiling 41 Scala sources and 9 Java sources to /home/jenkins/workspace/spark-master-test-k8s/streaming/target/scala-2.12/test-classes ...
[INFO] Done compiling.
[INFO] compile in 32.5 s
[INFO] 
[INFO] --- maven-surefire-plugin:3.0.0-M5:test (default-test) @ spark-streaming_2.12 ---
[INFO] Tests are skipped.
[INFO] 
[INFO] --- maven-surefire-plugin:3.0.0-M5:test (test) @ spark-streaming_2.12 ---
[INFO] Tests are skipped.
[INFO] 
[INFO] --- scalatest-maven-plugin:2.0.0:test (test) @ spark-streaming_2.12 ---
[INFO] Tests are skipped.
[INFO] 
[INFO] --- maven-jar-plugin:3.1.2:test-jar (prepare-test-jar) @ spark-streaming_2.12 ---
[INFO] Building jar: /home/jenkins/workspace/spark-master-test-k8s/streaming/target/spark-streaming_2.12-3.2.0-SNAPSHOT-tests.jar
[INFO] 
[INFO] --- maven-jar-plugin:3.1.2:jar (default-jar) @ spark-streaming_2.12 ---
[INFO] Building jar: /home/jenkins/workspace/spark-master-test-k8s/streaming/target/spark-streaming_2.12-3.2.0-SNAPSHOT.jar
[INFO] 
[INFO] --- maven-site-plugin:3.5.1:attach-descriptor (attach-descriptor) @ spark-streaming_2.12 ---
[INFO] 
[INFO] --- maven-shade-plugin:3.2.1:shade (default) @ spark-streaming_2.12 ---
[INFO] Excluding org.apache.spark:spark-core_2.12:jar:3.2.0-SNAPSHOT from the shaded jar.
[INFO] Excluding org.apache.avro:avro:jar:1.10.1 from the shaded jar.
[INFO] Excluding com.fasterxml.jackson.core:jackson-core:jar:2.11.4 from the shaded jar.
[INFO] Excluding org.apache.commons:commons-compress:jar:1.20 from the shaded jar.
[INFO] Excluding org.apache.avro:avro-mapred:jar:1.10.1 from the shaded jar.
[INFO] Excluding org.apache.avro:avro-ipc:jar:1.10.1 from the shaded jar.
[INFO] Excluding org.tukaani:xz:jar:1.8 from the shaded jar.
[INFO] Excluding com.twitter:chill_2.12:jar:0.9.5 from the shaded jar.
[INFO] Excluding com.esotericsoftware:kryo-shaded:jar:4.0.2 from the shaded jar.
[INFO] Excluding com.esotericsoftware:minlog:jar:1.3.0 from the shaded jar.
[INFO] Excluding com.twitter:chill-java:jar:0.9.5 from the shaded jar.
[INFO] Excluding org.apache.xbean:xbean-asm7-shaded:jar:4.15 from the shaded jar.
[INFO] Excluding org.apache.hadoop:hadoop-client-api:jar:3.2.2 from the shaded jar.
[INFO] Excluding org.apache.hadoop:hadoop-client-runtime:jar:3.2.2 from the shaded jar.
[INFO] Excluding org.apache.htrace:htrace-core4:jar:4.1.0-incubating from the shaded jar.
[INFO] Excluding commons-logging:commons-logging:jar:1.1.3 from the shaded jar.
[INFO] Excluding org.apache.spark:spark-launcher_2.12:jar:3.2.0-SNAPSHOT from the shaded jar.
[INFO] Excluding org.apache.spark:spark-kvstore_2.12:jar:3.2.0-SNAPSHOT from the shaded jar.
[INFO] Excluding org.fusesource.leveldbjni:leveldbjni-all:jar:1.8 from the shaded jar.
[INFO] Excluding com.fasterxml.jackson.core:jackson-annotations:jar:2.11.4 from the shaded jar.
[INFO] Excluding org.apache.spark:spark-network-common_2.12:jar:3.2.0-SNAPSHOT from the shaded jar.
[INFO] Excluding org.apache.spark:spark-network-shuffle_2.12:jar:3.2.0-SNAPSHOT from the shaded jar.
[INFO] Excluding org.apache.spark:spark-unsafe_2.12:jar:3.2.0-SNAPSHOT from the shaded jar.
[INFO] Excluding javax.activation:activation:jar:1.1.1 from the shaded jar.
[INFO] Excluding org.apache.curator:curator-recipes:jar:2.13.0 from the shaded jar.
[INFO] Excluding org.apache.curator:curator-framework:jar:2.13.0 from the shaded jar.
[INFO] Excluding org.apache.curator:curator-client:jar:2.13.0 from the shaded jar.
[INFO] Excluding org.apache.zookeeper:zookeeper:jar:3.6.2 from the shaded jar.
[INFO] Excluding commons-lang:commons-lang:jar:2.6 from the shaded jar.
[INFO] Excluding org.apache.zookeeper:zookeeper-jute:jar:3.6.2 from the shaded jar.
[INFO] Excluding org.apache.yetus:audience-annotations:jar:0.5.0 from the shaded jar.
[INFO] Excluding jakarta.servlet:jakarta.servlet-api:jar:4.0.3 from the shaded jar.
[INFO] Excluding commons-codec:commons-codec:jar:1.15 from the shaded jar.
[INFO] Excluding org.apache.commons:commons-lang3:jar:3.11 from the shaded jar.
[INFO] Excluding org.apache.commons:commons-math3:jar:3.4.1 from the shaded jar.
[INFO] Excluding org.apache.commons:commons-text:jar:1.6 from the shaded jar.
[INFO] Excluding commons-io:commons-io:jar:2.8.0 from the shaded jar.
[INFO] Excluding commons-collections:commons-collections:jar:3.2.2 from the shaded jar.
[INFO] Excluding com.google.code.findbugs:jsr305:jar:3.0.0 from the shaded jar.
[INFO] Excluding org.slf4j:slf4j-api:jar:1.7.30 from the shaded jar.
[INFO] Excluding org.slf4j:jul-to-slf4j:jar:1.7.30 from the shaded jar.
[INFO] Excluding org.slf4j:jcl-over-slf4j:jar:1.7.30 from the shaded jar.
[INFO] Excluding log4j:log4j:jar:1.2.17 from the shaded jar.
[INFO] Excluding org.slf4j:slf4j-log4j12:jar:1.7.30 from the shaded jar.
[INFO] Excluding com.ning:compress-lzf:jar:1.0.3 from the shaded jar.
[INFO] Excluding org.xerial.snappy:snappy-java:jar:1.1.8.2 from the shaded jar.
[INFO] Excluding org.lz4:lz4-java:jar:1.7.1 from the shaded jar.
[INFO] Excluding com.github.luben:zstd-jni:jar:1.4.8-5 from the shaded jar.
[INFO] Excluding org.roaringbitmap:RoaringBitmap:jar:0.9.0 from the shaded jar.
[INFO] Excluding org.roaringbitmap:shims:jar:0.9.0 from the shaded jar.
[INFO] Excluding commons-net:commons-net:jar:3.1 from the shaded jar.
[INFO] Excluding org.scala-lang.modules:scala-xml_2.12:jar:1.2.0 from the shaded jar.
[INFO] Excluding org.scala-lang:scala-reflect:jar:2.12.10 from the shaded jar.
[INFO] Excluding org.json4s:json4s-jackson_2.12:jar:3.7.0-M5 from the shaded jar.
[INFO] Excluding org.json4s:json4s-core_2.12:jar:3.7.0-M5 from the shaded jar.
[INFO] Excluding org.json4s:json4s-ast_2.12:jar:3.7.0-M5 from the shaded jar.
[INFO] Excluding org.json4s:json4s-scalap_2.12:jar:3.7.0-M5 from the shaded jar.
[INFO] Excluding com.thoughtworks.paranamer:paranamer:jar:2.8 from the shaded jar.
[INFO] Excluding org.glassfish.jersey.core:jersey-client:jar:2.30 from the shaded jar.
[INFO] Excluding jakarta.ws.rs:jakarta.ws.rs-api:jar:2.1.6 from the shaded jar.
[INFO] Excluding org.glassfish.hk2.external:jakarta.inject:jar:2.6.1 from the shaded jar.
[INFO] Excluding org.glassfish.jersey.core:jersey-common:jar:2.30 from the shaded jar.
[INFO] Excluding jakarta.annotation:jakarta.annotation-api:jar:1.3.5 from the shaded jar.
[INFO] Excluding org.glassfish.hk2:osgi-resource-locator:jar:1.0.3 from the shaded jar.
[INFO] Excluding org.glassfish.jersey.core:jersey-server:jar:2.30 from the shaded jar.
[INFO] Excluding org.glassfish.jersey.media:jersey-media-jaxb:jar:2.30 from the shaded jar.
[INFO] Excluding jakarta.validation:jakarta.validation-api:jar:2.0.2 from the shaded jar.
[INFO] Excluding org.glassfish.jersey.containers:jersey-container-servlet:jar:2.30 from the shaded jar.
[INFO] Excluding org.glassfish.jersey.containers:jersey-container-servlet-core:jar:2.30 from the shaded jar.
[INFO] Excluding org.glassfish.jersey.inject:jersey-hk2:jar:2.30 from the shaded jar.
[INFO] Excluding org.glassfish.hk2:hk2-locator:jar:2.6.1 from the shaded jar.
[INFO] Excluding org.glassfish.hk2.external:aopalliance-repackaged:jar:2.6.1 from the shaded jar.
[INFO] Excluding org.glassfish.hk2:hk2-api:jar:2.6.1 from the shaded jar.
[INFO] Excluding org.glassfish.hk2:hk2-utils:jar:2.6.1 from the shaded jar.
[INFO] Excluding org.javassist:javassist:jar:3.25.0-GA from the shaded jar.
[INFO] Excluding io.netty:netty-all:jar:4.1.51.Final from the shaded jar.
[INFO] Excluding com.clearspring.analytics:stream:jar:2.9.6 from the shaded jar.
[INFO] Excluding io.dropwizard.metrics:metrics-core:jar:4.1.1 from the shaded jar.
[INFO] Excluding io.dropwizard.metrics:metrics-jvm:jar:4.1.1 from the shaded jar.
[INFO] Excluding io.dropwizard.metrics:metrics-json:jar:4.1.1 from the shaded jar.
[INFO] Excluding io.dropwizard.metrics:metrics-graphite:jar:4.1.1 from the shaded jar.
[INFO] Excluding io.dropwizard.metrics:metrics-jmx:jar:4.1.1 from the shaded jar.
[INFO] Excluding com.fasterxml.jackson.core:jackson-databind:jar:2.11.4 from the shaded jar.
[INFO] Excluding com.fasterxml.jackson.module:jackson-module-scala_2.12:jar:2.11.4 from the shaded jar.
[INFO] Excluding com.fasterxml.jackson.module:jackson-module-paranamer:jar:2.11.4 from the shaded jar.
[INFO] Excluding org.apache.ivy:ivy:jar:2.4.0 from the shaded jar.
[INFO] Excluding oro:oro:jar:2.0.8 from the shaded jar.
[INFO] Excluding net.razorvine:pyrolite:jar:4.30 from the shaded jar.
[INFO] Excluding net.sf.py4j:py4j:jar:0.10.9.1 from the shaded jar.
[INFO] Excluding org.apache.commons:commons-crypto:jar:1.1.0 from the shaded jar.
[INFO] Excluding org.apache.spark:spark-tags_2.12:jar:3.2.0-SNAPSHOT from the shaded jar.
[INFO] Excluding org.scala-lang:scala-library:jar:2.12.10 from the shaded jar.
[INFO] Excluding org.objenesis:objenesis:jar:2.6 from the shaded jar.
[INFO] Including org.spark-project.spark:unused:jar:1.0.0 in the shaded jar.
[INFO] Replacing original artifact with shaded artifact.
[INFO] Replacing /home/jenkins/workspace/spark-master-test-k8s/streaming/target/spark-streaming_2.12-3.2.0-SNAPSHOT.jar with /home/jenkins/workspace/spark-master-test-k8s/streaming/target/spark-streaming_2.12-3.2.0-SNAPSHOT-shaded.jar
[INFO] Replacing original test artifact with shaded test artifact.
[INFO] Replacing /home/jenkins/workspace/spark-master-test-k8s/streaming/target/spark-streaming_2.12-3.2.0-SNAPSHOT-tests.jar with /home/jenkins/workspace/spark-master-test-k8s/streaming/target/spark-streaming_2.12-3.2.0-SNAPSHOT-shaded-tests.jar
[INFO] 
[INFO] --- maven-source-plugin:3.1.0:jar-no-fork (create-source-jar) @ spark-streaming_2.12 ---
[INFO] Building jar: /home/jenkins/workspace/spark-master-test-k8s/streaming/target/spark-streaming_2.12-3.2.0-SNAPSHOT-sources.jar
[INFO] 
[INFO] --- maven-source-plugin:3.1.0:test-jar-no-fork (create-source-jar) @ spark-streaming_2.12 ---
[INFO] Building jar: /home/jenkins/workspace/spark-master-test-k8s/streaming/target/spark-streaming_2.12-3.2.0-SNAPSHOT-test-sources.jar
[INFO] 
[INFO] ----------------< org.apache.spark:spark-catalyst_2.12 >----------------
[INFO] Building Spark Project Catalyst 3.2.0-SNAPSHOT                   [13/29]
[INFO] --------------------------------[ jar ]---------------------------------
[INFO] 
[INFO] --- maven-clean-plugin:3.1.0:clean (default-clean) @ spark-catalyst_2.12 ---
[INFO] 
[INFO] --- maven-enforcer-plugin:3.0.0-M2:enforce (enforce-versions) @ spark-catalyst_2.12 ---
[INFO] 
[INFO] --- maven-enforcer-plugin:3.0.0-M2:enforce (enforce-no-duplicate-dependencies) @ spark-catalyst_2.12 ---
[INFO] 
[INFO] --- mvn-scalafmt_2.12:1.0.3:format (default) @ spark-catalyst_2.12 ---
[WARNING] format.skipSources set, ignoring main directories
[WARNING] format.skipTestSources set, ignoring validateOnly directories
[WARNING] No sources specified, skipping formatting
[INFO] 
[INFO] --- build-helper-maven-plugin:3.2.0:timestamp-property (module-timestamp-property) @ spark-catalyst_2.12 ---
[WARNING] Using platform locale (en_US actually) to format date/time, i.e. build is platform dependent!
[INFO] 
[INFO] --- build-helper-maven-plugin:3.2.0:timestamp-property (local-timestamp-property) @ spark-catalyst_2.12 ---
[WARNING] Using platform locale (en_US actually) to format date/time, i.e. build is platform dependent!
[INFO] 
[INFO] --- scala-maven-plugin:4.3.0:add-source (eclipse-add-source) @ spark-catalyst_2.12 ---
[INFO] Add Source directory: /home/jenkins/workspace/spark-master-test-k8s/sql/catalyst/src/main/scala
[INFO] Add Test Source directory: /home/jenkins/workspace/spark-master-test-k8s/sql/catalyst/src/test/scala
[INFO] 
[INFO] --- maven-dependency-plugin:3.1.1:build-classpath (default-cli) @ spark-catalyst_2.12 ---
[INFO] Dependencies classpath:
/home/jenkins/.m2/repository/com/clearspring/analytics/stream/2.9.6/stream-2.9.6.jar:/home/jenkins/.m2/repository/org/glassfish/hk2/external/jakarta.inject/2.6.1/jakarta.inject-2.6.1.jar:/home/jenkins/.m2/repository/org/glassfish/hk2/hk2-locator/2.6.1/hk2-locator-2.6.1.jar:/home/jenkins/.m2/repository/org/slf4j/slf4j-log4j12/1.7.30/slf4j-log4j12-1.7.30.jar:/home/jenkins/.m2/repository/org/glassfish/hk2/hk2-utils/2.6.1/hk2-utils-2.6.1.jar:/home/jenkins/.m2/repository/org/apache/zookeeper/zookeeper-jute/3.6.2/zookeeper-jute-3.6.2.jar:/home/jenkins/.m2/repository/jakarta/servlet/jakarta.servlet-api/4.0.3/jakarta.servlet-api-4.0.3.jar:/home/jenkins/.m2/repository/com/thoughtworks/paranamer/paranamer/2.8/paranamer-2.8.jar:/home/jenkins/.m2/repository/io/netty/netty-all/4.1.51.Final/netty-all-4.1.51.Final.jar:/home/jenkins/.m2/repository/org/apache/arrow/arrow-memory-netty/2.0.0/arrow-memory-netty-2.0.0.jar:/home/jenkins/.m2/repository/com/google/code/findbugs/jsr305/3.0.0/jsr305-3.0.0.jar:/home/jenkins/.m2/repository/com/github/luben/zstd-jni/1.4.8-5/zstd-jni-1.4.8-5.jar:/home/jenkins/.m2/repository/org/objenesis/objenesis/2.6/objenesis-2.6.jar:/home/jenkins/.m2/repository/org/fusesource/leveldbjni/leveldbjni-all/1.8/leveldbjni-all-1.8.jar:/home/jenkins/.m2/repository/org/apache/commons/commons-text/1.6/commons-text-1.6.jar:/home/jenkins/.m2/repository/org/glassfish/jersey/media/jersey-media-jaxb/2.30/jersey-media-jaxb-2.30.jar:/home/jenkins/.m2/repository/jakarta/ws/rs/jakarta.ws.rs-api/2.1.6/jakarta.ws.rs-api-2.1.6.jar:/home/jenkins/.m2/repository/org/glassfish/hk2/external/aopalliance-repackaged/2.6.1/aopalliance-repackaged-2.6.1.jar:/home/jenkins/.m2/repository/org/apache/zookeeper/zookeeper/3.6.2/zookeeper-3.6.2.jar:/home/jenkins/.m2/repository/org/json4s/json4s-core_2.12/3.7.0-M5/json4s-core_2.12-3.7.0-M5.jar:/home/jenkins/.m2/repository/org/apache/htrace/htrace-core4/4.1.0-incubating/htrace-core4-4.1.0-incubating.jar:/home/jenkins/.m2/repository/org/apache/arrow/arrow-memory-core/2.0.0/arrow-memory-core-2.0.0.jar:/home/jenkins/.m2/repository/commons-io/commons-io/2.8.0/commons-io-2.8.0.jar:/home/jenkins/.m2/repository/commons-codec/commons-codec/1.15/commons-codec-1.15.jar:/home/jenkins/workspace/spark-master-test-k8s/common/network-shuffle/target/spark-network-shuffle_2.12-3.2.0-SNAPSHOT.jar:/home/jenkins/.m2/repository/net/sf/py4j/py4j/0.10.9.1/py4j-0.10.9.1.jar:/home/jenkins/.m2/repository/org/scala-lang/scala-library/2.12.10/scala-library-2.12.10.jar:/home/jenkins/.m2/repository/com/esotericsoftware/kryo-shaded/4.0.2/kryo-shaded-4.0.2.jar:/home/jenkins/.m2/repository/com/esotericsoftware/minlog/1.3.0/minlog-1.3.0.jar:/home/jenkins/.m2/repository/org/apache/arrow/arrow-format/2.0.0/arrow-format-2.0.0.jar:/home/jenkins/.m2/repository/com/fasterxml/jackson/core/jackson-databind/2.11.4/jackson-databind-2.11.4.jar:/home/jenkins/.m2/repository/com/twitter/chill-java/0.9.5/chill-java-0.9.5.jar:/home/jenkins/.m2/repository/org/slf4j/jul-to-slf4j/1.7.30/jul-to-slf4j-1.7.30.jar:/home/jenkins/.m2/repository/org/json4s/json4s-scalap_2.12/3.7.0-M5/json4s-scalap_2.12-3.7.0-M5.jar:/home/jenkins/.m2/repository/commons-net/commons-net/3.1/commons-net-3.1.jar:/home/jenkins/workspace/spark-master-test-k8s/common/unsafe/target/spark-unsafe_2.12-3.2.0-SNAPSHOT.jar:/home/jenkins/workspace/spark-master-test-k8s/common/sketch/target/spark-sketch_2.12-3.2.0-SNAPSHOT.jar:/home/jenkins/workspace/spark-master-test-k8s/common/tags/target/spark-tags_2.12-3.2.0-SNAPSHOT.jar:/home/jenkins/.m2/repository/org/lz4/lz4-java/1.7.1/lz4-java-1.7.1.jar:/home/jenkins/.m2/repository/com/google/flatbuffers/flatbuffers-java/1.9.0/flatbuffers-java-1.9.0.jar:/home/jenkins/.m2/repository/org/apache/avro/avro/1.10.1/avro-1.10.1.jar:/home/jenkins/.m2/repository/org/json4s/json4s-jackson_2.12/3.7.0-M5/json4s-jackson_2.12-3.7.0-M5.jar:/home/jenkins/.m2/repository/commons-lang/commons-lang/2.6/commons-lang-2.6.jar:/home/jenkins/.m2/repository/org/scala-lang/modules/scala-parser-combinators_2.12/1.1.2/scala-parser-combinators_2.12-1.1.2.jar:/home/jenkins/.m2/repository/io/dropwizard/metrics/metrics-graphite/4.1.1/metrics-graphite-4.1.1.jar:/home/jenkins/.m2/repository/org/codehaus/janino/janino/3.0.16/janino-3.0.16.jar:/home/jenkins/.m2/repository/javax/activation/activation/1.1.1/activation-1.1.1.jar:/home/jenkins/.m2/repository/org/apache/ivy/ivy/2.4.0/ivy-2.4.0.jar:/home/jenkins/.m2/repository/org/apache/arrow/arrow-vector/2.0.0/arrow-vector-2.0.0.jar:/home/jenkins/.m2/repository/com/twitter/chill_2.12/0.9.5/chill_2.12-0.9.5.jar:/home/jenkins/.m2/repository/org/apache/commons/commons-math3/3.4.1/commons-math3-3.4.1.jar:/home/jenkins/.m2/repository/net/razorvine/pyrolite/4.30/pyrolite-4.30.jar:/home/jenkins/.m2/repository/jakarta/validation/jakarta.validation-api/2.0.2/jakarta.validation-api-2.0.2.jar:/home/jenkins/.m2/repository/org/tukaani/xz/1.8/xz-1.8.jar:/home/jenkins/.m2/repository/org/glassfish/jersey/inject/jersey-hk2/2.30/jersey-hk2-2.30.jar:/home/jenkins/workspace/spark-master-test-k8s/launcher/target/spark-launcher_2.12-3.2.0-SNAPSHOT.jar:/home/jenkins/.m2/repository/org/apache/hadoop/hadoop-client-api/3.2.2/hadoop-client-api-3.2.2.jar:/home/jenkins/.m2/repository/org/json4s/json4s-ast_2.12/3.7.0-M5/json4s-ast_2.12-3.7.0-M5.jar:/home/jenkins/.m2/repository/org/glassfish/jersey/core/jersey-common/2.30/jersey-common-2.30.jar:/home/jenkins/.m2/repository/oro/oro/2.0.8/oro-2.0.8.jar:/home/jenkins/.m2/repository/org/scala-lang/scala-reflect/2.12.10/scala-reflect-2.12.10.jar:/home/jenkins/.m2/repository/com/fasterxml/jackson/module/jackson-module-scala_2.12/2.11.4/jackson-module-scala_2.12-2.11.4.jar:/home/jenkins/.m2/repository/log4j/log4j/1.2.17/log4j-1.2.17.jar:/home/jenkins/.m2/repository/org/codehaus/janino/commons-compiler/3.0.16/commons-compiler-3.0.16.jar:/home/jenkins/.m2/repository/org/apache/avro/avro-ipc/1.10.1/avro-ipc-1.10.1.jar:/home/jenkins/.m2/repository/org/apache/curator/curator-framework/2.13.0/curator-framework-2.13.0.jar:/home/jenkins/.m2/repository/com/fasterxml/jackson/core/jackson-annotations/2.11.4/jackson-annotations-2.11.4.jar:/home/jenkins/.m2/repository/org/apache/xbean/xbean-asm7-shaded/4.15/xbean-asm7-shaded-4.15.jar:/home/jenkins/.m2/repository/org/antlr/antlr4-runtime/4.8-1/antlr4-runtime-4.8-1.jar:/home/jenkins/.m2/repository/io/dropwizard/metrics/metrics-core/4.1.1/metrics-core-4.1.1.jar:/home/jenkins/.m2/repository/org/apache/commons/commons-lang3/3.11/commons-lang3-3.11.jar:/home/jenkins/.m2/repository/io/dropwizard/metrics/metrics-json/4.1.1/metrics-json-4.1.1.jar:/home/jenkins/.m2/repository/org/glassfish/hk2/hk2-api/2.6.1/hk2-api-2.6.1.jar:/home/jenkins/.m2/repository/org/roaringbitmap/shims/0.9.0/shims-0.9.0.jar:/home/jenkins/.m2/repository/jakarta/annotation/jakarta.annotation-api/1.3.5/jakarta.annotation-api-1.3.5.jar:/home/jenkins/workspace/spark-master-test-k8s/core/target/spark-core_2.12-3.2.0-SNAPSHOT.jar:/home/jenkins/.m2/repository/org/glassfish/hk2/osgi-resource-locator/1.0.3/osgi-resource-locator-1.0.3.jar:/home/jenkins/.m2/repository/org/apache/hadoop/hadoop-client-runtime/3.2.2/hadoop-client-runtime-3.2.2.jar:/home/jenkins/.m2/repository/org/apache/yetus/audience-annotations/0.5.0/audience-annotations-0.5.0.jar:/home/jenkins/.m2/repository/io/dropwizard/metrics/metrics-jvm/4.1.1/metrics-jvm-4.1.1.jar:/home/jenkins/.m2/repository/com/fasterxml/jackson/module/jackson-module-paranamer/2.11.4/jackson-module-paranamer-2.11.4.jar:/home/jenkins/.m2/repository/javax/xml/bind/jaxb-api/2.2.11/jaxb-api-2.2.11.jar:/home/jenkins/.m2/repository/org/scala-lang/modules/scala-xml_2.12/1.2.0/scala-xml_2.12-1.2.0.jar:/home/jenkins/.m2/repository/org/apache/curator/curator-recipes/2.13.0/curator-recipes-2.13.0.jar:/home/jenkins/.m2/repository/org/slf4j/slf4j-api/1.7.30/slf4j-api-1.7.30.jar:/home/jenkins/.m2/repository/com/ning/compress-lzf/1.0.3/compress-lzf-1.0.3.jar:/home/jenkins/.m2/repository/org/glassfish/jersey/containers/jersey-container-servlet/2.30/jersey-container-servlet-2.30.jar:/home/jenkins/.m2/repository/org/apache/curator/curator-client/2.13.0/curator-client-2.13.0.jar:/home/jenkins/workspace/spark-master-test-k8s/common/network-common/target/spark-network-common_2.12-3.2.0-SNAPSHOT.jar:/home/jenkins/.m2/repository/org/apache/commons/commons-crypto/1.1.0/commons-crypto-1.1.0.jar:/home/jenkins/.m2/repository/org/javassist/javassist/3.25.0-GA/javassist-3.25.0-GA.jar:/home/jenkins/.m2/repository/org/glassfish/jersey/containers/jersey-container-servlet-core/2.30/jersey-container-servlet-core-2.30.jar:/home/jenkins/workspace/spark-master-test-k8s/common/kvstore/target/spark-kvstore_2.12-3.2.0-SNAPSHOT.jar:/home/jenkins/.m2/repository/org/xerial/snappy/snappy-java/1.1.8.2/snappy-java-1.1.8.2.jar:/home/jenkins/.m2/repository/org/roaringbitmap/RoaringBitmap/0.9.0/RoaringBitmap-0.9.0.jar:/home/jenkins/.m2/repository/org/apache/avro/avro-mapred/1.10.1/avro-mapred-1.10.1.jar:/home/jenkins/.m2/repository/com/univocity/univocity-parsers/2.9.1/univocity-parsers-2.9.1.jar:/home/jenkins/.m2/repository/org/slf4j/jcl-over-slf4j/1.7.30/jcl-over-slf4j-1.7.30.jar:/home/jenkins/.m2/repository/org/spark-project/spark/unused/1.0.0/unused-1.0.0.jar:/home/jenkins/.m2/repository/com/fasterxml/jackson/core/jackson-core/2.11.4/jackson-core-2.11.4.jar:/home/jenkins/.m2/repository/org/glassfish/jersey/core/jersey-server/2.30/jersey-server-2.30.jar:/home/jenkins/.m2/repository/io/dropwizard/metrics/metrics-jmx/4.1.1/metrics-jmx-4.1.1.jar:/home/jenkins/.m2/repository/org/glassfish/jersey/core/jersey-client/2.30/jersey-client-2.30.jar:/home/jenkins/.m2/repository/commons-collections/commons-collections/3.2.2/commons-collections-3.2.2.jar:/home/jenkins/.m2/repository/commons-logging/commons-logging/1.1.3/commons-logging-1.1.3.jar:/home/jenkins/.m2/repository/org/apache/commons/commons-compress/1.20/commons-compress-1.20.jar
[INFO] 
[INFO] --- antlr4-maven-plugin:4.8-1:antlr4 (default) @ spark-catalyst_2.12 ---
[INFO] ANTLR 4: Processing source directory /home/jenkins/workspace/spark-master-test-k8s/sql/catalyst/src/main/antlr4
[INFO] Processing grammar: org/apache/spark/sql/catalyst/parser/SqlBase.g4
[INFO] 
[INFO] --- build-helper-maven-plugin:3.2.0:add-source (add-sources) @ spark-catalyst_2.12 ---
[INFO] Source directory: /home/jenkins/workspace/spark-master-test-k8s/sql/catalyst/src/main/scala-2.12 added.
[INFO] 
[INFO] --- maven-remote-resources-plugin:1.5:process (process-resource-bundles) @ spark-catalyst_2.12 ---
[INFO] 
[INFO] --- maven-resources-plugin:2.7:resources (default-resources) @ spark-catalyst_2.12 ---
[INFO] Using 'UTF-8' encoding to copy filtered resources.
[INFO] Copying 2 resources
[INFO] Copying 3 resources
[INFO] 
[INFO] --- maven-compiler-plugin:3.8.1:compile (default-compile) @ spark-catalyst_2.12 ---
[INFO] Not compiling main sources
[INFO] 
[INFO] --- scala-maven-plugin:4.3.0:compile (scala-compile-first) @ spark-catalyst_2.12 ---
[INFO] Using incremental compilation using Mixed compile order
[INFO] Compiler bridge file: /home/jenkins/.sbt/1.0/zinc/org.scala-sbt/org.scala-sbt-compiler-bridge_2.12-1.3.1-bin_2.12.10__52.0-1.3.1_20191012T045515.jar
[INFO] compiler plugin: BasicArtifact(com.github.ghik,silencer-plugin_2.12.10,1.6.0,null)
[INFO] Compiling 330 Scala sources and 114 Java sources to /home/jenkins/workspace/spark-master-test-k8s/sql/catalyst/target/scala-2.12/classes ...
[WARNING] [Warn] /home/jenkins/workspace/spark-master-test-k8s/sql/catalyst/src/main/java/org/apache/spark/sql/connector/catalog/SupportsAtomicPartitionManagement.java:54: found raw type: java.util.Map
  missing type arguments for generic class java.util.Map<K,V>
[WARNING] [Warn] /home/jenkins/workspace/spark-master-test-k8s/sql/catalyst/src/main/java/org/apache/spark/sql/connector/catalog/SupportsAtomicPartitionManagement.java:54: unchecked method invocation: method createPartitions in interface org.apache.spark.sql.connector.catalog.SupportsAtomicPartitionManagement is applied to given types
  required: org.apache.spark.sql.catalyst.InternalRow[],java.util.Map<java.lang.String,java.lang.String>[]
  found: org.apache.spark.sql.catalyst.InternalRow[],java.util.Map[]
[WARNING] [Warn] /home/jenkins/workspace/spark-master-test-k8s/sql/catalyst/src/main/java/org/apache/spark/sql/connector/catalog/SupportsAtomicPartitionManagement.java:54: unchecked conversion
  required: java.util.Map<java.lang.String,java.lang.String>[]
  found:    java.util.Map[]
[INFO] Done compiling.
[INFO] compile in 71.2 s
[INFO] 
[INFO] --- maven-antrun-plugin:1.8:run (create-tmp-dir) @ spark-catalyst_2.12 ---
[INFO] Executing tasks

main:
    [mkdir] Created dir: /home/jenkins/workspace/spark-master-test-k8s/sql/catalyst/target/tmp
[INFO] Executed tasks
[INFO] 
[INFO] --- maven-resources-plugin:2.7:testResources (default-testResources) @ spark-catalyst_2.12 ---
[INFO] Using 'UTF-8' encoding to copy filtered resources.
[INFO] Copying 2 resources
[INFO] Copying 3 resources
[INFO] 
[INFO] --- maven-compiler-plugin:3.8.1:testCompile (default-testCompile) @ spark-catalyst_2.12 ---
[INFO] Not compiling test sources
[INFO] 
[INFO] --- maven-dependency-plugin:3.1.1:build-classpath (generate-test-classpath) @ spark-catalyst_2.12 ---
[INFO] Dependencies classpath:
/home/jenkins/.m2/repository/org/eclipse/jetty/jetty-client/9.4.36.v20210114/jetty-client-9.4.36.v20210114.jar:/home/jenkins/.m2/repository/org/scalatestplus/scalatestplus-mockito_2.12/1.0.0-SNAP5/scalatestplus-mockito_2.12-1.0.0-SNAP5.jar:/home/jenkins/.m2/repository/com/clearspring/analytics/stream/2.9.6/stream-2.9.6.jar:/home/jenkins/.m2/repository/org/glassfish/hk2/external/jakarta.inject/2.6.1/jakarta.inject-2.6.1.jar:/home/jenkins/.m2/repository/org/glassfish/hk2/hk2-locator/2.6.1/hk2-locator-2.6.1.jar:/home/jenkins/.m2/repository/org/slf4j/slf4j-log4j12/1.7.30/slf4j-log4j12-1.7.30.jar:/home/jenkins/.m2/repository/org/glassfish/hk2/hk2-utils/2.6.1/hk2-utils-2.6.1.jar:/home/jenkins/.m2/repository/org/scalatest/scalatest-freespec_2.12/3.2.3/scalatest-freespec_2.12-3.2.3.jar:/home/jenkins/.m2/repository/org/scalatest/scalatest-funsuite_2.12/3.2.3/scalatest-funsuite_2.12-3.2.3.jar:/home/jenkins/.m2/repository/org/apache/zookeeper/zookeeper-jute/3.6.2/zookeeper-jute-3.6.2.jar:/home/jenkins/.m2/repository/org/eclipse/jetty/jetty-servlet/9.4.36.v20210114/jetty-servlet-9.4.36.v20210114.jar:/home/jenkins/.m2/repository/jakarta/servlet/jakarta.servlet-api/4.0.3/jakarta.servlet-api-4.0.3.jar:/home/jenkins/.m2/repository/com/thoughtworks/paranamer/paranamer/2.8/paranamer-2.8.jar:/home/jenkins/.m2/repository/io/netty/netty-all/4.1.51.Final/netty-all-4.1.51.Final.jar:/home/jenkins/.m2/repository/org/eclipse/jetty/jetty-continuation/9.4.36.v20210114/jetty-continuation-9.4.36.v20210114.jar:/home/jenkins/.m2/repository/org/scalatest/scalatest-funspec_2.12/3.2.3/scalatest-funspec_2.12-3.2.3.jar:/home/jenkins/.m2/repository/org/apache/arrow/arrow-memory-netty/2.0.0/arrow-memory-netty-2.0.0.jar:/home/jenkins/.m2/repository/com/google/code/findbugs/jsr305/3.0.0/jsr305-3.0.0.jar:/home/jenkins/.m2/repository/com/github/luben/zstd-jni/1.4.8-5/zstd-jni-1.4.8-5.jar:/home/jenkins/.m2/repository/org/objenesis/objenesis/2.6/objenesis-2.6.jar:/home/jenkins/.m2/repository/org/fusesource/leveldbjni/leveldbjni-all/1.8/leveldbjni-all-1.8.jar:/home/jenkins/.m2/repository/org/apache/commons/commons-text/1.6/commons-text-1.6.jar:/home/jenkins/.m2/repository/org/glassfish/jersey/media/jersey-media-jaxb/2.30/jersey-media-jaxb-2.30.jar:/home/jenkins/.m2/repository/org/scalatest/scalatest-diagrams_2.12/3.2.3/scalatest-diagrams_2.12-3.2.3.jar:/home/jenkins/.m2/repository/jakarta/ws/rs/jakarta.ws.rs-api/2.1.6/jakarta.ws.rs-api-2.1.6.jar:/home/jenkins/.m2/repository/org/glassfish/hk2/external/aopalliance-repackaged/2.6.1/aopalliance-repackaged-2.6.1.jar:/home/jenkins/.m2/repository/org/apache/zookeeper/zookeeper/3.6.2/zookeeper-3.6.2.jar:/home/jenkins/.m2/repository/org/json4s/json4s-core_2.12/3.7.0-M5/json4s-core_2.12-3.7.0-M5.jar:/home/jenkins/.m2/repository/org/apache/htrace/htrace-core4/4.1.0-incubating/htrace-core4-4.1.0-incubating.jar:/home/jenkins/.m2/repository/org/apache/arrow/arrow-memory-core/2.0.0/arrow-memory-core-2.0.0.jar:/home/jenkins/.m2/repository/commons-io/commons-io/2.8.0/commons-io-2.8.0.jar:/home/jenkins/.m2/repository/commons-codec/commons-codec/1.15/commons-codec-1.15.jar:/home/jenkins/workspace/spark-master-test-k8s/common/network-shuffle/target/spark-network-shuffle_2.12-3.2.0-SNAPSHOT.jar:/home/jenkins/.m2/repository/net/sf/py4j/py4j/0.10.9.1/py4j-0.10.9.1.jar:/home/jenkins/.m2/repository/org/scala-lang/scala-library/2.12.10/scala-library-2.12.10.jar:/home/jenkins/.m2/repository/com/esotericsoftware/kryo-shaded/4.0.2/kryo-shaded-4.0.2.jar:/home/jenkins/.m2/repository/com/esotericsoftware/minlog/1.3.0/minlog-1.3.0.jar:/home/jenkins/.m2/repository/org/apache/arrow/arrow-format/2.0.0/arrow-format-2.0.0.jar:/home/jenkins/.m2/repository/net/bytebuddy/byte-buddy/1.10.13/byte-buddy-1.10.13.jar:/home/jenkins/.m2/repository/org/scalatest/scalatest_2.12/3.2.3/scalatest_2.12-3.2.3.jar:/home/jenkins/.m2/repository/org/scalatest/scalatest-mustmatchers_2.12/3.2.3/scalatest-mustmatchers_2.12-3.2.3.jar:/home/jenkins/.m2/repository/com/squareup/okhttp3/okhttp/3.11.0/okhttp-3.11.0.jar:/home/jenkins/.m2/repository/com/fasterxml/jackson/core/jackson-databind/2.11.4/jackson-databind-2.11.4.jar:/home/jenkins/.m2/repository/com/twitter/chill-java/0.9.5/chill-java-0.9.5.jar:/home/jenkins/.m2/repository/org/slf4j/jul-to-slf4j/1.7.30/jul-to-slf4j-1.7.30.jar:/home/jenkins/.m2/repository/org/json4s/json4s-scalap_2.12/3.7.0-M5/json4s-scalap_2.12-3.7.0-M5.jar:/home/jenkins/.m2/repository/commons-net/commons-net/3.1/commons-net-3.1.jar:/home/jenkins/workspace/spark-master-test-k8s/common/unsafe/target/spark-unsafe_2.12-3.2.0-SNAPSHOT.jar:/home/jenkins/workspace/spark-master-test-k8s/common/sketch/target/spark-sketch_2.12-3.2.0-SNAPSHOT.jar:/home/jenkins/workspace/spark-master-test-k8s/common/tags/target/spark-tags_2.12-3.2.0-SNAPSHOT.jar:/home/jenkins/.m2/repository/org/seleniumhq/selenium/selenium-ie-driver/3.141.59/selenium-ie-driver-3.141.59.jar:/home/jenkins/.m2/repository/org/lz4/lz4-java/1.7.1/lz4-java-1.7.1.jar:/home/jenkins/.m2/repository/com/google/flatbuffers/flatbuffers-java/1.9.0/flatbuffers-java-1.9.0.jar:/home/jenkins/.m2/repository/org/apache/avro/avro/1.10.1/avro-1.10.1.jar:/home/jenkins/.m2/repository/org/json4s/json4s-jackson_2.12/3.7.0-M5/json4s-jackson_2.12-3.7.0-M5.jar:/home/jenkins/.m2/repository/org/scalatestplus/scalatestplus-scalacheck_2.12/3.1.0.0-RC2/scalatestplus-scalacheck_2.12-3.1.0.0-RC2.jar:/home/jenkins/.m2/repository/commons-lang/commons-lang/2.6/commons-lang-2.6.jar:/home/jenkins/.m2/repository/org/scalatest/scalatest-wordspec_2.12/3.2.3/scalatest-wordspec_2.12-3.2.3.jar:/home/jenkins/.m2/repository/org/scala-lang/modules/scala-parser-combinators_2.12/1.1.2/scala-parser-combinators_2.12-1.1.2.jar:/home/jenkins/.m2/repository/io/dropwizard/metrics/metrics-graphite/4.1.1/metrics-graphite-4.1.1.jar:/home/jenkins/.m2/repository/org/seleniumhq/selenium/selenium-edge-driver/3.141.59/selenium-edge-driver-3.141.59.jar:/home/jenkins/.m2/repository/org/codehaus/janino/janino/3.0.16/janino-3.0.16.jar:/home/jenkins/.m2/repository/org/apache/commons/commons-exec/1.3/commons-exec-1.3.jar:/home/jenkins/.m2/repository/javax/activation/activation/1.1.1/activation-1.1.1.jar:/home/jenkins/.m2/repository/com/google/guava/guava/14.0.1/guava-14.0.1.jar:/home/jenkins/.m2/repository/org/eclipse/jetty/jetty-server/9.4.36.v20210114/jetty-server-9.4.36.v20210114.jar:/home/jenkins/.m2/repository/org/scalactic/scalactic_2.12/3.2.3/scalactic_2.12-3.2.3.jar:/home/jenkins/.m2/repository/org/apache/ivy/ivy/2.4.0/ivy-2.4.0.jar:/home/jenkins/.m2/repository/org/apache/arrow/arrow-vector/2.0.0/arrow-vector-2.0.0.jar:/home/jenkins/.m2/repository/javax/servlet/javax.servlet-api/3.1.0/javax.servlet-api-3.1.0.jar:/home/jenkins/.m2/repository/com/twitter/chill_2.12/0.9.5/chill_2.12-0.9.5.jar:/home/jenkins/.m2/repository/org/apache/commons/commons-math3/3.4.1/commons-math3-3.4.1.jar:/home/jenkins/.m2/repository/net/razorvine/pyrolite/4.30/pyrolite-4.30.jar:/home/jenkins/.m2/repository/jakarta/validation/jakarta.validation-api/2.0.2/jakarta.validation-api-2.0.2.jar:/home/jenkins/.m2/repository/org/scalatest/scalatest-core_2.12/3.2.3/scalatest-core_2.12-3.2.3.jar:/home/jenkins/.m2/repository/org/tukaani/xz/1.8/xz-1.8.jar:/home/jenkins/.m2/repository/org/glassfish/jersey/inject/jersey-hk2/2.30/jersey-hk2-2.30.jar:/home/jenkins/workspace/spark-master-test-k8s/launcher/target/spark-launcher_2.12-3.2.0-SNAPSHOT.jar:/home/jenkins/.m2/repository/org/apache/hadoop/hadoop-client-api/3.2.2/hadoop-client-api-3.2.2.jar:/home/jenkins/.m2/repository/org/json4s/json4s-ast_2.12/3.7.0-M5/json4s-ast_2.12-3.7.0-M5.jar:/home/jenkins/.m2/repository/org/glassfish/jersey/core/jersey-common/2.30/jersey-common-2.30.jar:/home/jenkins/.m2/repository/oro/oro/2.0.8/oro-2.0.8.jar:/home/jenkins/.m2/repository/org/eclipse/jetty/jetty-util/9.4.36.v20210114/jetty-util-9.4.36.v20210114.jar:/home/jenkins/.m2/repository/org/scala-lang/scala-reflect/2.12.10/scala-reflect-2.12.10.jar:/home/jenkins/.m2/repository/com/fasterxml/jackson/module/jackson-module-scala_2.12/2.11.4/jackson-module-scala_2.12-2.11.4.jar:/home/jenkins/.m2/repository/log4j/log4j/1.2.17/log4j-1.2.17.jar:/home/jenkins/.m2/repository/org/codehaus/janino/commons-compiler/3.0.16/commons-compiler-3.0.16.jar:/home/jenkins/.m2/repository/com/novocode/junit-interface/0.11/junit-interface-0.11.jar:/home/jenkins/.m2/repository/org/apache/avro/avro-ipc/1.10.1/avro-ipc-1.10.1.jar:/home/jenkins/.m2/repository/org/apache/curator/curator-framework/2.13.0/curator-framework-2.13.0.jar:/home/jenkins/.m2/repository/com/fasterxml/jackson/core/jackson-annotations/2.11.4/jackson-annotations-2.11.4.jar:/home/jenkins/.m2/repository/org/eclipse/jetty/jetty-plus/9.4.36.v20210114/jetty-plus-9.4.36.v20210114.jar:/home/jenkins/.m2/repository/org/apache/xbean/xbean-asm7-shaded/4.15/xbean-asm7-shaded-4.15.jar:/home/jenkins/.m2/repository/org/antlr/antlr4-runtime/4.8-1/antlr4-runtime-4.8-1.jar:/home/jenkins/.m2/repository/io/dropwizard/metrics/metrics-core/4.1.1/metrics-core-4.1.1.jar:/home/jenkins/.m2/repository/junit/junit/4.13.1/junit-4.13.1.jar:/home/jenkins/.m2/repository/org/apache/commons/commons-lang3/3.11/commons-lang3-3.11.jar:/home/jenkins/.m2/repository/io/dropwizard/metrics/metrics-json/4.1.1/metrics-json-4.1.1.jar:/home/jenkins/.m2/repository/org/glassfish/hk2/hk2-api/2.6.1/hk2-api-2.6.1.jar:/home/jenkins/.m2/repository/org/roaringbitmap/shims/0.9.0/shims-0.9.0.jar:/home/jenkins/.m2/repository/org/seleniumhq/selenium/selenium-chrome-driver/3.141.59/selenium-chrome-driver-3.141.59.jar:/home/jenkins/.m2/repository/org/seleniumhq/selenium/selenium-opera-driver/3.141.59/selenium-opera-driver-3.141.59.jar:/home/jenkins/.m2/repository/jakarta/annotation/jakarta.annotation-api/1.3.5/jakarta.annotation-api-1.3.5.jar:/home/jenkins/workspace/spark-master-test-k8s/core/target/spark-core_2.12-3.2.0-SNAPSHOT.jar:/home/jenkins/.m2/repository/org/glassfish/hk2/osgi-resource-locator/1.0.3/osgi-resource-locator-1.0.3.jar:/home/jenkins/.m2/repository/net/bytebuddy/byte-buddy-agent/1.10.13/byte-buddy-agent-1.10.13.jar:/home/jenkins/.m2/repository/org/apache/hadoop/hadoop-client-runtime/3.2.2/hadoop-client-runtime-3.2.2.jar:/home/jenkins/.m2/repository/org/apache/yetus/audience-annotations/0.5.0/audience-annotations-0.5.0.jar:/home/jenkins/.m2/repository/io/dropwizard/metrics/metrics-jvm/4.1.1/metrics-jvm-4.1.1.jar:/home/jenkins/workspace/spark-master-test-k8s/common/tags/target/spark-tags_2.12-3.2.0-SNAPSHOT-tests.jar:/home/jenkins/.m2/repository/org/scalatestplus/scalatestplus-selenium_2.12/1.0.0-SNAP5/scalatestplus-selenium_2.12-1.0.0-SNAP5.jar:/home/jenkins/workspace/spark-master-test-k8s/core/target/spark-core_2.12-3.2.0-SNAPSHOT-tests.jar:/home/jenkins/.m2/repository/org/scala-sbt/test-interface/1.0/test-interface-1.0.jar:/home/jenkins/.m2/repository/com/fasterxml/jackson/module/jackson-module-paranamer/2.11.4/jackson-module-paranamer-2.11.4.jar:/home/jenkins/.m2/repository/com/squareup/okio/okio/1.14.0/okio-1.14.0.jar:/home/jenkins/.m2/repository/org/eclipse/jetty/jetty-proxy/9.4.36.v20210114/jetty-proxy-9.4.36.v20210114.jar:/home/jenkins/.m2/repository/org/hamcrest/hamcrest-core/1.3/hamcrest-core-1.3.jar:/home/jenkins/.m2/repository/javax/xml/bind/jaxb-api/2.2.11/jaxb-api-2.2.11.jar:/home/jenkins/.m2/repository/org/eclipse/jetty/jetty-xml/9.4.36.v20210114/jetty-xml-9.4.36.v20210114.jar:/home/jenkins/.m2/repository/org/seleniumhq/selenium/selenium-support/3.141.59/selenium-support-3.141.59.jar:/home/jenkins/.m2/repository/org/scala-lang/modules/scala-xml_2.12/1.2.0/scala-xml_2.12-1.2.0.jar:/home/jenkins/.m2/repository/org/apache/curator/curator-recipes/2.13.0/curator-recipes-2.13.0.jar:/home/jenkins/.m2/repository/org/slf4j/slf4j-api/1.7.30/slf4j-api-1.7.30.jar:/home/jenkins/.m2/repository/com/ning/compress-lzf/1.0.3/compress-lzf-1.0.3.jar:/home/jenkins/.m2/repository/org/glassfish/jersey/containers/jersey-container-servlet/2.30/jersey-container-servlet-2.30.jar:/home/jenkins/.m2/repository/org/eclipse/jetty/jetty-webapp/9.4.36.v20210114/jetty-webapp-9.4.36.v20210114.jar:/home/jenkins/.m2/repository/org/eclipse/jetty/jetty-io/9.4.36.v20210114/jetty-io-9.4.36.v20210114.jar:/home/jenkins/.m2/repository/org/seleniumhq/selenium/selenium-remote-driver/3.141.59/selenium-remote-driver-3.141.59.jar:/home/jenkins/.m2/repository/org/apache/curator/curator-client/2.13.0/curator-client-2.13.0.jar:/home/jenkins/workspace/spark-master-test-k8s/common/network-common/target/spark-network-common_2.12-3.2.0-SNAPSHOT.jar:/home/jenkins/.m2/repository/org/apache/commons/commons-crypto/1.1.0/commons-crypto-1.1.0.jar:/home/jenkins/.m2/repository/org/javassist/javassist/3.25.0-GA/javassist-3.25.0-GA.jar:/home/jenkins/.m2/repository/org/glassfish/jersey/containers/jersey-container-servlet-core/2.30/jersey-container-servlet-core-2.30.jar:/home/jenkins/.m2/repository/org/eclipse/jetty/jetty-servlets/9.4.36.v20210114/jetty-servlets-9.4.36.v20210114.jar:/home/jenkins/workspace/spark-master-test-k8s/common/kvstore/target/spark-kvstore_2.12-3.2.0-SNAPSHOT.jar:/home/jenkins/.m2/repository/org/scalatest/scalatest-flatspec_2.12/3.2.3/scalatest-flatspec_2.12-3.2.3.jar:/home/jenkins/.m2/repository/org/scalatest/scalatest-refspec_2.12/3.2.3/scalatest-refspec_2.12-3.2.3.jar:/home/jenkins/.m2/repository/org/seleniumhq/selenium/selenium-api/3.141.59/selenium-api-3.141.59.jar:/home/jenkins/.m2/repository/org/seleniumhq/selenium/selenium-java/3.141.59/selenium-java-3.141.59.jar:/home/jenkins/.m2/repository/org/mockito/mockito-core/3.4.6/mockito-core-3.4.6.jar:/home/jenkins/.m2/repository/org/xerial/snappy/snappy-java/1.1.8.2/snappy-java-1.1.8.2.jar:/home/jenkins/.m2/repository/org/scalacheck/scalacheck_2.12/1.14.2/scalacheck_2.12-1.14.2.jar:/home/jenkins/.m2/repository/org/roaringbitmap/RoaringBitmap/0.9.0/RoaringBitmap-0.9.0.jar:/home/jenkins/.m2/repository/org/eclipse/jetty/jetty-security/9.4.36.v20210114/jetty-security-9.4.36.v20210114.jar:/home/jenkins/.m2/repository/org/apache/avro/avro-mapred/1.10.1/avro-mapred-1.10.1.jar:/home/jenkins/.m2/repository/com/univocity/univocity-parsers/2.9.1/univocity-parsers-2.9.1.jar:/home/jenkins/.m2/repository/org/slf4j/jcl-over-slf4j/1.7.30/jcl-over-slf4j-1.7.30.jar:/home/jenkins/.m2/repository/org/spark-project/spark/unused/1.0.0/unused-1.0.0.jar:/home/jenkins/.m2/repository/com/fasterxml/jackson/core/jackson-core/2.11.4/jackson-core-2.11.4.jar:/home/jenkins/.m2/repository/org/glassfish/jersey/core/jersey-server/2.30/jersey-server-2.30.jar:/home/jenkins/.m2/repository/io/dropwizard/metrics/metrics-jmx/4.1.1/metrics-jmx-4.1.1.jar:/home/jenkins/.m2/repository/org/glassfish/jersey/core/jersey-client/2.30/jersey-client-2.30.jar:/home/jenkins/.m2/repository/commons-collections/commons-collections/3.2.2/commons-collections-3.2.2.jar:/home/jenkins/.m2/repository/org/scalatest/scalatest-compatible/3.2.3/scalatest-compatible-3.2.3.jar:/home/jenkins/.m2/repository/org/scalatest/scalatest-propspec_2.12/3.2.3/scalatest-propspec_2.12-3.2.3.jar:/home/jenkins/.m2/repository/org/scalatest/scalatest-featurespec_2.12/3.2.3/scalatest-featurespec_2.12-3.2.3.jar:/home/jenkins/.m2/repository/org/eclipse/jetty/jetty-http/9.4.36.v20210114/jetty-http-9.4.36.v20210114.jar:/home/jenkins/.m2/repository/org/seleniumhq/selenium/selenium-firefox-driver/3.141.59/selenium-firefox-driver-3.141.59.jar:/home/jenkins/.m2/repository/commons-logging/commons-logging/1.1.3/commons-logging-1.1.3.jar:/home/jenkins/.m2/repository/org/eclipse/jetty/jetty-util-ajax/9.4.36.v20210114/jetty-util-ajax-9.4.36.v20210114.jar:/home/jenkins/.m2/repository/org/seleniumhq/selenium/selenium-safari-driver/3.141.59/selenium-safari-driver-3.141.59.jar:/home/jenkins/.m2/repository/org/scalatest/scalatest-shouldmatchers_2.12/3.2.3/scalatest-shouldmatchers_2.12-3.2.3.jar:/home/jenkins/.m2/repository/org/eclipse/jetty/jetty-jndi/9.4.36.v20210114/jetty-jndi-9.4.36.v20210114.jar:/home/jenkins/.m2/repository/org/apache/commons/commons-compress/1.20/commons-compress-1.20.jar:/home/jenkins/.m2/repository/org/scalatest/scalatest-matchers-core_2.12/3.2.3/scalatest-matchers-core_2.12-3.2.3.jar
[INFO] 
[INFO] --- scala-maven-plugin:4.3.0:testCompile (scala-test-compile-first) @ spark-catalyst_2.12 ---
[INFO] Using incremental compilation using Mixed compile order
[INFO] Compiler bridge file: /home/jenkins/.sbt/1.0/zinc/org.scala-sbt/org.scala-sbt-compiler-bridge_2.12-1.3.1-bin_2.12.10__52.0-1.3.1_20191012T045515.jar
[INFO] compiler plugin: BasicArtifact(com.github.ghik,silencer-plugin_2.12.10,1.6.0,null)
[INFO] Compiling 279 Scala sources and 6 Java sources to /home/jenkins/workspace/spark-master-test-k8s/sql/catalyst/target/scala-2.12/test-classes ...
[INFO] Done compiling.
[INFO] compile in 67.2 s
[INFO] 
[INFO] --- maven-jar-plugin:3.1.2:test-jar (prepare-test-jar) @ spark-catalyst_2.12 ---
[INFO] Building jar: /home/jenkins/workspace/spark-master-test-k8s/sql/catalyst/target/spark-catalyst_2.12-3.2.0-SNAPSHOT-tests.jar
[INFO] 
[INFO] --- maven-surefire-plugin:3.0.0-M5:test (default-test) @ spark-catalyst_2.12 ---
[INFO] Tests are skipped.
[INFO] 
[INFO] --- maven-surefire-plugin:3.0.0-M5:test (test) @ spark-catalyst_2.12 ---
[INFO] Tests are skipped.
[INFO] 
[INFO] --- scalatest-maven-plugin:2.0.0:test (test) @ spark-catalyst_2.12 ---
[INFO] Tests are skipped.
[INFO] 
[INFO] --- maven-jar-plugin:3.1.2:jar (default-jar) @ spark-catalyst_2.12 ---
[INFO] Building jar: /home/jenkins/workspace/spark-master-test-k8s/sql/catalyst/target/spark-catalyst_2.12-3.2.0-SNAPSHOT.jar
[INFO] 
[INFO] --- maven-site-plugin:3.5.1:attach-descriptor (attach-descriptor) @ spark-catalyst_2.12 ---
[INFO] 
[INFO] --- maven-shade-plugin:3.2.1:shade (default) @ spark-catalyst_2.12 ---
[INFO] Excluding org.scala-lang:scala-reflect:jar:2.12.10 from the shaded jar.
[INFO] Excluding org.scala-lang:scala-library:jar:2.12.10 from the shaded jar.
[INFO] Excluding org.scala-lang.modules:scala-parser-combinators_2.12:jar:1.1.2 from the shaded jar.
[INFO] Excluding org.apache.spark:spark-core_2.12:jar:3.2.0-SNAPSHOT from the shaded jar.
[INFO] Excluding org.apache.avro:avro:jar:1.10.1 from the shaded jar.
[INFO] Excluding com.fasterxml.jackson.core:jackson-core:jar:2.11.4 from the shaded jar.
[INFO] Excluding org.apache.commons:commons-compress:jar:1.20 from the shaded jar.
[INFO] Excluding org.apache.avro:avro-mapred:jar:1.10.1 from the shaded jar.
[INFO] Excluding org.apache.avro:avro-ipc:jar:1.10.1 from the shaded jar.
[INFO] Excluding org.tukaani:xz:jar:1.8 from the shaded jar.
[INFO] Excluding com.twitter:chill_2.12:jar:0.9.5 from the shaded jar.
[INFO] Excluding com.esotericsoftware:kryo-shaded:jar:4.0.2 from the shaded jar.
[INFO] Excluding com.esotericsoftware:minlog:jar:1.3.0 from the shaded jar.
[INFO] Excluding com.twitter:chill-java:jar:0.9.5 from the shaded jar.
[INFO] Excluding org.apache.xbean:xbean-asm7-shaded:jar:4.15 from the shaded jar.
[INFO] Excluding org.apache.hadoop:hadoop-client-api:jar:3.2.2 from the shaded jar.
[INFO] Excluding org.apache.hadoop:hadoop-client-runtime:jar:3.2.2 from the shaded jar.
[INFO] Excluding org.apache.htrace:htrace-core4:jar:4.1.0-incubating from the shaded jar.
[INFO] Excluding commons-logging:commons-logging:jar:1.1.3 from the shaded jar.
[INFO] Excluding org.apache.spark:spark-launcher_2.12:jar:3.2.0-SNAPSHOT from the shaded jar.
[INFO] Excluding org.apache.spark:spark-kvstore_2.12:jar:3.2.0-SNAPSHOT from the shaded jar.
[INFO] Excluding org.fusesource.leveldbjni:leveldbjni-all:jar:1.8 from the shaded jar.
[INFO] Excluding com.fasterxml.jackson.core:jackson-annotations:jar:2.11.4 from the shaded jar.
[INFO] Excluding org.apache.spark:spark-network-common_2.12:jar:3.2.0-SNAPSHOT from the shaded jar.
[INFO] Excluding org.apache.spark:spark-network-shuffle_2.12:jar:3.2.0-SNAPSHOT from the shaded jar.
[INFO] Excluding javax.activation:activation:jar:1.1.1 from the shaded jar.
[INFO] Excluding org.apache.curator:curator-recipes:jar:2.13.0 from the shaded jar.
[INFO] Excluding org.apache.curator:curator-framework:jar:2.13.0 from the shaded jar.
[INFO] Excluding org.apache.curator:curator-client:jar:2.13.0 from the shaded jar.
[INFO] Excluding org.apache.zookeeper:zookeeper:jar:3.6.2 from the shaded jar.
[INFO] Excluding commons-lang:commons-lang:jar:2.6 from the shaded jar.
[INFO] Excluding org.apache.zookeeper:zookeeper-jute:jar:3.6.2 from the shaded jar.
[INFO] Excluding org.apache.yetus:audience-annotations:jar:0.5.0 from the shaded jar.
[INFO] Excluding jakarta.servlet:jakarta.servlet-api:jar:4.0.3 from the shaded jar.
[INFO] Excluding org.apache.commons:commons-lang3:jar:3.11 from the shaded jar.
[INFO] Excluding org.apache.commons:commons-math3:jar:3.4.1 from the shaded jar.
[INFO] Excluding org.apache.commons:commons-text:jar:1.6 from the shaded jar.
[INFO] Excluding commons-io:commons-io:jar:2.8.0 from the shaded jar.
[INFO] Excluding commons-collections:commons-collections:jar:3.2.2 from the shaded jar.
[INFO] Excluding com.google.code.findbugs:jsr305:jar:3.0.0 from the shaded jar.
[INFO] Excluding org.slf4j:slf4j-api:jar:1.7.30 from the shaded jar.
[INFO] Excluding org.slf4j:jul-to-slf4j:jar:1.7.30 from the shaded jar.
[INFO] Excluding org.slf4j:jcl-over-slf4j:jar:1.7.30 from the shaded jar.
[INFO] Excluding log4j:log4j:jar:1.2.17 from the shaded jar.
[INFO] Excluding org.slf4j:slf4j-log4j12:jar:1.7.30 from the shaded jar.
[INFO] Excluding com.ning:compress-lzf:jar:1.0.3 from the shaded jar.
[INFO] Excluding org.xerial.snappy:snappy-java:jar:1.1.8.2 from the shaded jar.
[INFO] Excluding org.lz4:lz4-java:jar:1.7.1 from the shaded jar.
[INFO] Excluding com.github.luben:zstd-jni:jar:1.4.8-5 from the shaded jar.
[INFO] Excluding org.roaringbitmap:RoaringBitmap:jar:0.9.0 from the shaded jar.
[INFO] Excluding org.roaringbitmap:shims:jar:0.9.0 from the shaded jar.
[INFO] Excluding commons-net:commons-net:jar:3.1 from the shaded jar.
[INFO] Excluding org.scala-lang.modules:scala-xml_2.12:jar:1.2.0 from the shaded jar.
[INFO] Excluding org.json4s:json4s-jackson_2.12:jar:3.7.0-M5 from the shaded jar.
[INFO] Excluding org.json4s:json4s-core_2.12:jar:3.7.0-M5 from the shaded jar.
[INFO] Excluding org.json4s:json4s-ast_2.12:jar:3.7.0-M5 from the shaded jar.
[INFO] Excluding org.json4s:json4s-scalap_2.12:jar:3.7.0-M5 from the shaded jar.
[INFO] Excluding com.thoughtworks.paranamer:paranamer:jar:2.8 from the shaded jar.
[INFO] Excluding org.glassfish.jersey.core:jersey-client:jar:2.30 from the shaded jar.
[INFO] Excluding jakarta.ws.rs:jakarta.ws.rs-api:jar:2.1.6 from the shaded jar.
[INFO] Excluding org.glassfish.hk2.external:jakarta.inject:jar:2.6.1 from the shaded jar.
[INFO] Excluding org.glassfish.jersey.core:jersey-common:jar:2.30 from the shaded jar.
[INFO] Excluding jakarta.annotation:jakarta.annotation-api:jar:1.3.5 from the shaded jar.
[INFO] Excluding org.glassfish.hk2:osgi-resource-locator:jar:1.0.3 from the shaded jar.
[INFO] Excluding org.glassfish.jersey.core:jersey-server:jar:2.30 from the shaded jar.
[INFO] Excluding org.glassfish.jersey.media:jersey-media-jaxb:jar:2.30 from the shaded jar.
[INFO] Excluding jakarta.validation:jakarta.validation-api:jar:2.0.2 from the shaded jar.
[INFO] Excluding org.glassfish.jersey.containers:jersey-container-servlet:jar:2.30 from the shaded jar.
[INFO] Excluding org.glassfish.jersey.containers:jersey-container-servlet-core:jar:2.30 from the shaded jar.
[INFO] Excluding org.glassfish.jersey.inject:jersey-hk2:jar:2.30 from the shaded jar.
[INFO] Excluding org.glassfish.hk2:hk2-locator:jar:2.6.1 from the shaded jar.
[INFO] Excluding org.glassfish.hk2.external:aopalliance-repackaged:jar:2.6.1 from the shaded jar.
[INFO] Excluding org.glassfish.hk2:hk2-api:jar:2.6.1 from the shaded jar.
[INFO] Excluding org.glassfish.hk2:hk2-utils:jar:2.6.1 from the shaded jar.
[INFO] Excluding org.javassist:javassist:jar:3.25.0-GA from the shaded jar.
[INFO] Excluding io.netty:netty-all:jar:4.1.51.Final from the shaded jar.
[INFO] Excluding com.clearspring.analytics:stream:jar:2.9.6 from the shaded jar.
[INFO] Excluding io.dropwizard.metrics:metrics-core:jar:4.1.1 from the shaded jar.
[INFO] Excluding io.dropwizard.metrics:metrics-jvm:jar:4.1.1 from the shaded jar.
[INFO] Excluding io.dropwizard.metrics:metrics-json:jar:4.1.1 from the shaded jar.
[INFO] Excluding io.dropwizard.metrics:metrics-graphite:jar:4.1.1 from the shaded jar.
[INFO] Excluding io.dropwizard.metrics:metrics-jmx:jar:4.1.1 from the shaded jar.
[INFO] Excluding com.fasterxml.jackson.core:jackson-databind:jar:2.11.4 from the shaded jar.
[INFO] Excluding com.fasterxml.jackson.module:jackson-module-scala_2.12:jar:2.11.4 from the shaded jar.
[INFO] Excluding com.fasterxml.jackson.module:jackson-module-paranamer:jar:2.11.4 from the shaded jar.
[INFO] Excluding org.apache.ivy:ivy:jar:2.4.0 from the shaded jar.
[INFO] Excluding oro:oro:jar:2.0.8 from the shaded jar.
[INFO] Excluding net.razorvine:pyrolite:jar:4.30 from the shaded jar.
[INFO] Excluding net.sf.py4j:py4j:jar:0.10.9.1 from the shaded jar.
[INFO] Excluding org.apache.commons:commons-crypto:jar:1.1.0 from the shaded jar.
[INFO] Excluding org.apache.spark:spark-tags_2.12:jar:3.2.0-SNAPSHOT from the shaded jar.
[INFO] Excluding org.objenesis:objenesis:jar:2.6 from the shaded jar.
[INFO] Excluding org.apache.spark:spark-unsafe_2.12:jar:3.2.0-SNAPSHOT from the shaded jar.
[INFO] Excluding org.apache.spark:spark-sketch_2.12:jar:3.2.0-SNAPSHOT from the shaded jar.
[INFO] Excluding org.codehaus.janino:janino:jar:3.0.16 from the shaded jar.
[INFO] Excluding org.codehaus.janino:commons-compiler:jar:3.0.16 from the shaded jar.
[INFO] Excluding org.antlr:antlr4-runtime:jar:4.8-1 from the shaded jar.
[INFO] Excluding javax.xml.bind:jaxb-api:jar:2.2.11 from the shaded jar.
[INFO] Excluding commons-codec:commons-codec:jar:1.15 from the shaded jar.
[INFO] Excluding com.univocity:univocity-parsers:jar:2.9.1 from the shaded jar.
[INFO] Excluding org.apache.arrow:arrow-vector:jar:2.0.0 from the shaded jar.
[INFO] Excluding org.apache.arrow:arrow-format:jar:2.0.0 from the shaded jar.
[INFO] Excluding org.apache.arrow:arrow-memory-core:jar:2.0.0 from the shaded jar.
[INFO] Excluding com.google.flatbuffers:flatbuffers-java:jar:1.9.0 from the shaded jar.
[INFO] Excluding org.apache.arrow:arrow-memory-netty:jar:2.0.0 from the shaded jar.
[INFO] Including org.spark-project.spark:unused:jar:1.0.0 in the shaded jar.
[INFO] Replacing original artifact with shaded artifact.
[INFO] Replacing /home/jenkins/workspace/spark-master-test-k8s/sql/catalyst/target/spark-catalyst_2.12-3.2.0-SNAPSHOT.jar with /home/jenkins/workspace/spark-master-test-k8s/sql/catalyst/target/spark-catalyst_2.12-3.2.0-SNAPSHOT-shaded.jar
[INFO] 
[INFO] --- maven-source-plugin:3.1.0:jar-no-fork (create-source-jar) @ spark-catalyst_2.12 ---
[INFO] Building jar: /home/jenkins/workspace/spark-master-test-k8s/sql/catalyst/target/spark-catalyst_2.12-3.2.0-SNAPSHOT-sources.jar
[INFO] 
[INFO] --- maven-source-plugin:3.1.0:test-jar-no-fork (create-source-jar) @ spark-catalyst_2.12 ---
[INFO] Building jar: /home/jenkins/workspace/spark-master-test-k8s/sql/catalyst/target/spark-catalyst_2.12-3.2.0-SNAPSHOT-test-sources.jar
[INFO] 
[INFO] ------------------< org.apache.spark:spark-sql_2.12 >-------------------
[INFO] Building Spark Project SQL 3.2.0-SNAPSHOT                        [14/29]
[INFO] --------------------------------[ jar ]---------------------------------
[INFO] 
[INFO] --- maven-clean-plugin:3.1.0:clean (default-clean) @ spark-sql_2.12 ---
[INFO] 
[INFO] --- maven-enforcer-plugin:3.0.0-M2:enforce (enforce-versions) @ spark-sql_2.12 ---
[INFO] 
[INFO] --- maven-enforcer-plugin:3.0.0-M2:enforce (enforce-no-duplicate-dependencies) @ spark-sql_2.12 ---
[INFO] 
[INFO] --- mvn-scalafmt_2.12:1.0.3:format (default) @ spark-sql_2.12 ---
[WARNING] format.skipSources set, ignoring main directories
[WARNING] format.skipTestSources set, ignoring validateOnly directories
[WARNING] No sources specified, skipping formatting
[INFO] 
[INFO] --- build-helper-maven-plugin:3.2.0:timestamp-property (module-timestamp-property) @ spark-sql_2.12 ---
[WARNING] Using platform locale (en_US actually) to format date/time, i.e. build is platform dependent!
[INFO] 
[INFO] --- build-helper-maven-plugin:3.2.0:timestamp-property (local-timestamp-property) @ spark-sql_2.12 ---
[WARNING] Using platform locale (en_US actually) to format date/time, i.e. build is platform dependent!
[INFO] 
[INFO] --- scala-maven-plugin:4.3.0:add-source (eclipse-add-source) @ spark-sql_2.12 ---
[INFO] Add Source directory: /home/jenkins/workspace/spark-master-test-k8s/sql/core/src/main/scala
[INFO] Add Test Source directory: /home/jenkins/workspace/spark-master-test-k8s/sql/core/src/test/scala
[INFO] 
[INFO] --- maven-dependency-plugin:3.1.1:build-classpath (default-cli) @ spark-sql_2.12 ---
[INFO] Dependencies classpath:
/home/jenkins/.m2/repository/com/clearspring/analytics/stream/2.9.6/stream-2.9.6.jar:/home/jenkins/.m2/repository/org/threeten/threeten-extra/1.5.0/threeten-extra-1.5.0.jar:/home/jenkins/.m2/repository/org/glassfish/hk2/external/jakarta.inject/2.6.1/jakarta.inject-2.6.1.jar:/home/jenkins/.m2/repository/org/glassfish/hk2/hk2-locator/2.6.1/hk2-locator-2.6.1.jar:/home/jenkins/.m2/repository/org/slf4j/slf4j-log4j12/1.7.30/slf4j-log4j12-1.7.30.jar:/home/jenkins/.m2/repository/com/google/protobuf/protobuf-java/2.5.0/protobuf-java-2.5.0.jar:/home/jenkins/.m2/repository/org/glassfish/hk2/hk2-utils/2.6.1/hk2-utils-2.6.1.jar:/home/jenkins/.m2/repository/org/apache/zookeeper/zookeeper-jute/3.6.2/zookeeper-jute-3.6.2.jar:/home/jenkins/.m2/repository/jakarta/servlet/jakarta.servlet-api/4.0.3/jakarta.servlet-api-4.0.3.jar:/home/jenkins/.m2/repository/com/thoughtworks/paranamer/paranamer/2.8/paranamer-2.8.jar:/home/jenkins/.m2/repository/io/netty/netty-all/4.1.51.Final/netty-all-4.1.51.Final.jar:/home/jenkins/.m2/repository/org/apache/arrow/arrow-memory-netty/2.0.0/arrow-memory-netty-2.0.0.jar:/home/jenkins/.m2/repository/com/google/code/findbugs/jsr305/3.0.0/jsr305-3.0.0.jar:/home/jenkins/.m2/repository/com/github/luben/zstd-jni/1.4.8-5/zstd-jni-1.4.8-5.jar:/home/jenkins/.m2/repository/org/objenesis/objenesis/2.6/objenesis-2.6.jar:/home/jenkins/.m2/repository/org/fusesource/leveldbjni/leveldbjni-all/1.8/leveldbjni-all-1.8.jar:/home/jenkins/.m2/repository/org/apache/commons/commons-text/1.6/commons-text-1.6.jar:/home/jenkins/.m2/repository/org/glassfish/jersey/media/jersey-media-jaxb/2.30/jersey-media-jaxb-2.30.jar:/home/jenkins/.m2/repository/jakarta/ws/rs/jakarta.ws.rs-api/2.1.6/jakarta.ws.rs-api-2.1.6.jar:/home/jenkins/.m2/repository/org/glassfish/hk2/external/aopalliance-repackaged/2.6.1/aopalliance-repackaged-2.6.1.jar:/home/jenkins/.m2/repository/org/apache/zookeeper/zookeeper/3.6.2/zookeeper-3.6.2.jar:/home/jenkins/.m2/repository/org/json4s/json4s-core_2.12/3.7.0-M5/json4s-core_2.12-3.7.0-M5.jar:/home/jenkins/.m2/repository/org/apache/htrace/htrace-core4/4.1.0-incubating/htrace-core4-4.1.0-incubating.jar:/home/jenkins/.m2/repository/org/apache/arrow/arrow-memory-core/2.0.0/arrow-memory-core-2.0.0.jar:/home/jenkins/.m2/repository/commons-codec/commons-codec/1.15/commons-codec-1.15.jar:/home/jenkins/.m2/repository/commons-io/commons-io/2.8.0/commons-io-2.8.0.jar:/home/jenkins/workspace/spark-master-test-k8s/common/network-shuffle/target/spark-network-shuffle_2.12-3.2.0-SNAPSHOT.jar:/home/jenkins/.m2/repository/net/sf/py4j/py4j/0.10.9.1/py4j-0.10.9.1.jar:/home/jenkins/.m2/repository/org/scala-lang/scala-library/2.12.10/scala-library-2.12.10.jar:/home/jenkins/.m2/repository/com/esotericsoftware/kryo-shaded/4.0.2/kryo-shaded-4.0.2.jar:/home/jenkins/.m2/repository/com/esotericsoftware/minlog/1.3.0/minlog-1.3.0.jar:/home/jenkins/.m2/repository/org/apache/arrow/arrow-format/2.0.0/arrow-format-2.0.0.jar:/home/jenkins/.m2/repository/com/fasterxml/jackson/core/jackson-databind/2.11.4/jackson-databind-2.11.4.jar:/home/jenkins/.m2/repository/com/twitter/chill-java/0.9.5/chill-java-0.9.5.jar:/home/jenkins/.m2/repository/org/slf4j/jul-to-slf4j/1.7.30/jul-to-slf4j-1.7.30.jar:/home/jenkins/.m2/repository/org/json4s/json4s-scalap_2.12/3.7.0-M5/json4s-scalap_2.12-3.7.0-M5.jar:/home/jenkins/.m2/repository/org/apache/parquet/parquet-encoding/1.11.1/parquet-encoding-1.11.1.jar:/home/jenkins/.m2/repository/commons-net/commons-net/3.1/commons-net-3.1.jar:/home/jenkins/workspace/spark-master-test-k8s/common/sketch/target/spark-sketch_2.12-3.2.0-SNAPSHOT.jar:/home/jenkins/workspace/spark-master-test-k8s/common/unsafe/target/spark-unsafe_2.12-3.2.0-SNAPSHOT.jar:/home/jenkins/.m2/repository/org/apache/parquet/parquet-hadoop/1.11.1/parquet-hadoop-1.11.1.jar:/home/jenkins/workspace/spark-master-test-k8s/common/tags/target/spark-tags_2.12-3.2.0-SNAPSHOT.jar:/home/jenkins/.m2/repository/org/lz4/lz4-java/1.7.1/lz4-java-1.7.1.jar:/home/jenkins/.m2/repository/com/google/flatbuffers/flatbuffers-java/1.9.0/flatbuffers-java-1.9.0.jar:/home/jenkins/.m2/repository/org/jetbrains/annotations/17.0.0/annotations-17.0.0.jar:/home/jenkins/.m2/repository/org/apache/orc/orc-shims/1.6.7/orc-shims-1.6.7.jar:/home/jenkins/.m2/repository/org/apache/avro/avro/1.10.1/avro-1.10.1.jar:/home/jenkins/.m2/repository/org/json4s/json4s-jackson_2.12/3.7.0-M5/json4s-jackson_2.12-3.7.0-M5.jar:/home/jenkins/.m2/repository/commons-lang/commons-lang/2.6/commons-lang-2.6.jar:/home/jenkins/.m2/repository/org/scala-lang/modules/scala-parser-combinators_2.12/1.1.2/scala-parser-combinators_2.12-1.1.2.jar:/home/jenkins/.m2/repository/org/apache/orc/orc-core/1.6.7/orc-core-1.6.7.jar:/home/jenkins/.m2/repository/io/dropwizard/metrics/metrics-graphite/4.1.1/metrics-graphite-4.1.1.jar:/home/jenkins/.m2/repository/org/codehaus/janino/janino/3.0.16/janino-3.0.16.jar:/home/jenkins/.m2/repository/javax/activation/activation/1.1.1/activation-1.1.1.jar:/home/jenkins/.m2/repository/org/apache/ivy/ivy/2.4.0/ivy-2.4.0.jar:/home/jenkins/.m2/repository/org/apache/arrow/arrow-vector/2.0.0/arrow-vector-2.0.0.jar:/home/jenkins/.m2/repository/com/twitter/chill_2.12/0.9.5/chill_2.12-0.9.5.jar:/home/jenkins/.m2/repository/org/apache/commons/commons-math3/3.4.1/commons-math3-3.4.1.jar:/home/jenkins/.m2/repository/net/razorvine/pyrolite/4.30/pyrolite-4.30.jar:/home/jenkins/.m2/repository/jakarta/validation/jakarta.validation-api/2.0.2/jakarta.validation-api-2.0.2.jar:/home/jenkins/.m2/repository/org/tukaani/xz/1.8/xz-1.8.jar:/home/jenkins/.m2/repository/org/glassfish/jersey/inject/jersey-hk2/2.30/jersey-hk2-2.30.jar:/home/jenkins/workspace/spark-master-test-k8s/launcher/target/spark-launcher_2.12-3.2.0-SNAPSHOT.jar:/home/jenkins/.m2/repository/org/apache/hadoop/hadoop-client-api/3.2.2/hadoop-client-api-3.2.2.jar:/home/jenkins/.m2/repository/org/json4s/json4s-ast_2.12/3.7.0-M5/json4s-ast_2.12-3.7.0-M5.jar:/home/jenkins/.m2/repository/org/glassfish/jersey/core/jersey-common/2.30/jersey-common-2.30.jar:/home/jenkins/.m2/repository/oro/oro/2.0.8/oro-2.0.8.jar:/home/jenkins/.m2/repository/org/scala-lang/scala-reflect/2.12.10/scala-reflect-2.12.10.jar:/home/jenkins/.m2/repository/com/fasterxml/jackson/module/jackson-module-scala_2.12/2.11.4/jackson-module-scala_2.12-2.11.4.jar:/home/jenkins/.m2/repository/log4j/log4j/1.2.17/log4j-1.2.17.jar:/home/jenkins/.m2/repository/org/codehaus/janino/commons-compiler/3.0.16/commons-compiler-3.0.16.jar:/home/jenkins/.m2/repository/org/apache/avro/avro-ipc/1.10.1/avro-ipc-1.10.1.jar:/home/jenkins/.m2/repository/org/apache/curator/curator-framework/2.13.0/curator-framework-2.13.0.jar:/home/jenkins/.m2/repository/com/fasterxml/jackson/core/jackson-annotations/2.11.4/jackson-annotations-2.11.4.jar:/home/jenkins/.m2/repository/org/apache/xbean/xbean-asm7-shaded/4.15/xbean-asm7-shaded-4.15.jar:/home/jenkins/.m2/repository/org/antlr/antlr4-runtime/4.8-1/antlr4-runtime-4.8-1.jar:/home/jenkins/.m2/repository/io/dropwizard/metrics/metrics-core/4.1.1/metrics-core-4.1.1.jar:/home/jenkins/.m2/repository/org/apache/parquet/parquet-format-structures/1.11.1/parquet-format-structures-1.11.1.jar:/home/jenkins/.m2/repository/org/apache/commons/commons-lang3/3.11/commons-lang3-3.11.jar:/home/jenkins/.m2/repository/org/apache/parquet/parquet-common/1.11.1/parquet-common-1.11.1.jar:/home/jenkins/.m2/repository/io/dropwizard/metrics/metrics-json/4.1.1/metrics-json-4.1.1.jar:/home/jenkins/.m2/repository/org/glassfish/hk2/hk2-api/2.6.1/hk2-api-2.6.1.jar:/home/jenkins/.m2/repository/org/roaringbitmap/shims/0.9.0/shims-0.9.0.jar:/home/jenkins/.m2/repository/jakarta/annotation/jakarta.annotation-api/1.3.5/jakarta.annotation-api-1.3.5.jar:/home/jenkins/workspace/spark-master-test-k8s/core/target/spark-core_2.12-3.2.0-SNAPSHOT.jar:/home/jenkins/.m2/repository/org/glassfish/hk2/osgi-resource-locator/1.0.3/osgi-resource-locator-1.0.3.jar:/home/jenkins/.m2/repository/org/apache/hadoop/hadoop-client-runtime/3.2.2/hadoop-client-runtime-3.2.2.jar:/home/jenkins/.m2/repository/org/apache/yetus/audience-annotations/0.5.0/audience-annotations-0.5.0.jar:/home/jenkins/.m2/repository/io/dropwizard/metrics/metrics-jvm/4.1.1/metrics-jvm-4.1.1.jar:/home/jenkins/.m2/repository/com/fasterxml/jackson/module/jackson-module-paranamer/2.11.4/jackson-module-paranamer-2.11.4.jar:/home/jenkins/.m2/repository/javax/xml/bind/jaxb-api/2.2.11/jaxb-api-2.2.11.jar:/home/jenkins/.m2/repository/org/scala-lang/modules/scala-xml_2.12/1.2.0/scala-xml_2.12-1.2.0.jar:/home/jenkins/.m2/repository/org/apache/hive/hive-storage-api/2.7.2/hive-storage-api-2.7.2.jar:/home/jenkins/.m2/repository/org/apache/curator/curator-recipes/2.13.0/curator-recipes-2.13.0.jar:/home/jenkins/.m2/repository/org/slf4j/slf4j-api/1.7.30/slf4j-api-1.7.30.jar:/home/jenkins/.m2/repository/com/ning/compress-lzf/1.0.3/compress-lzf-1.0.3.jar:/home/jenkins/.m2/repository/org/glassfish/jersey/containers/jersey-container-servlet/2.30/jersey-container-servlet-2.30.jar:/home/jenkins/.m2/repository/org/apache/curator/curator-client/2.13.0/curator-client-2.13.0.jar:/home/jenkins/workspace/spark-master-test-k8s/common/network-common/target/spark-network-common_2.12-3.2.0-SNAPSHOT.jar:/home/jenkins/.m2/repository/org/apache/commons/commons-crypto/1.1.0/commons-crypto-1.1.0.jar:/home/jenkins/.m2/repository/org/javassist/javassist/3.25.0-GA/javassist-3.25.0-GA.jar:/home/jenkins/.m2/repository/org/apache/orc/orc-mapreduce/1.6.7/orc-mapreduce-1.6.7.jar:/home/jenkins/.m2/repository/org/glassfish/jersey/containers/jersey-container-servlet-core/2.30/jersey-container-servlet-core-2.30.jar:/home/jenkins/.m2/repository/org/apache/parquet/parquet-jackson/1.11.1/parquet-jackson-1.11.1.jar:/home/jenkins/workspace/spark-master-test-k8s/common/kvstore/target/spark-kvstore_2.12-3.2.0-SNAPSHOT.jar:/home/jenkins/.m2/repository/org/xerial/snappy/snappy-java/1.1.8.2/snappy-java-1.1.8.2.jar:/home/jenkins/.m2/repository/org/roaringbitmap/RoaringBitmap/0.9.0/RoaringBitmap-0.9.0.jar:/home/jenkins/.m2/repository/com/univocity/univocity-parsers/2.9.1/univocity-parsers-2.9.1.jar:/home/jenkins/.m2/repository/org/apache/avro/avro-mapred/1.10.1/avro-mapred-1.10.1.jar:/home/jenkins/.m2/repository/org/slf4j/jcl-over-slf4j/1.7.30/jcl-over-slf4j-1.7.30.jar:/home/jenkins/.m2/repository/org/spark-project/spark/unused/1.0.0/unused-1.0.0.jar:/home/jenkins/.m2/repository/org/apache/parquet/parquet-column/1.11.1/parquet-column-1.11.1.jar:/home/jenkins/.m2/repository/io/airlift/aircompressor/0.16/aircompressor-0.16.jar:/home/jenkins/.m2/repository/com/fasterxml/jackson/core/jackson-core/2.11.4/jackson-core-2.11.4.jar:/home/jenkins/.m2/repository/org/glassfish/jersey/core/jersey-server/2.30/jersey-server-2.30.jar:/home/jenkins/.m2/repository/io/dropwizard/metrics/metrics-jmx/4.1.1/metrics-jmx-4.1.1.jar:/home/jenkins/.m2/repository/org/glassfish/jersey/core/jersey-client/2.30/jersey-client-2.30.jar:/home/jenkins/.m2/repository/commons-collections/commons-collections/3.2.2/commons-collections-3.2.2.jar:/home/jenkins/.m2/repository/commons-logging/commons-logging/1.1.3/commons-logging-1.1.3.jar:/home/jenkins/workspace/spark-master-test-k8s/sql/catalyst/target/spark-catalyst_2.12-3.2.0-SNAPSHOT.jar:/home/jenkins/.m2/repository/org/apache/commons/commons-compress/1.20/commons-compress-1.20.jar
[INFO] 
[INFO] --- build-helper-maven-plugin:3.2.0:add-source (add-sources) @ spark-sql_2.12 ---
[INFO] Source directory: /home/jenkins/workspace/spark-master-test-k8s/sql/core/src/main/scala-2.12 added.
[INFO] 
[INFO] --- maven-remote-resources-plugin:1.5:process (process-resource-bundles) @ spark-sql_2.12 ---
[INFO] 
[INFO] --- maven-resources-plugin:2.7:resources (default-resources) @ spark-sql_2.12 ---
[INFO] Using 'UTF-8' encoding to copy filtered resources.
[INFO] Copying 6 resources
[INFO] Copying 3 resources
[INFO] 
[INFO] --- maven-compiler-plugin:3.8.1:compile (default-compile) @ spark-sql_2.12 ---
[INFO] Not compiling main sources
[INFO] 
[INFO] --- scala-maven-plugin:4.3.0:compile (scala-compile-first) @ spark-sql_2.12 ---
[INFO] Using incremental compilation using Mixed compile order
[INFO] Compiler bridge file: /home/jenkins/.sbt/1.0/zinc/org.scala-sbt/org.scala-sbt-compiler-bridge_2.12-1.3.1-bin_2.12.10__52.0-1.3.1_20191012T045515.jar
[INFO] compiler plugin: BasicArtifact(com.github.ghik,silencer-plugin_2.12.10,1.6.0,null)
[INFO] Compiling 498 Scala sources and 59 Java sources to /home/jenkins/workspace/spark-master-test-k8s/sql/core/target/scala-2.12/classes ...
[WARNING] [Warn] /home/jenkins/workspace/spark-master-test-k8s/sql/core/src/main/java/org/apache/spark/sql/execution/datasources/parquet/SpecificParquetRecordReaderBase.java:55: org.apache.parquet.hadoop.ParquetInputSplit in org.apache.parquet.hadoop has been deprecated
[WARNING] [Warn] /home/jenkins/workspace/spark-master-test-k8s/sql/core/src/main/java/org/apache/spark/sql/execution/datasources/parquet/VectorizedColumnReader.java:34: org.apache.parquet.schema.DecimalMetadata in org.apache.parquet.schema has been deprecated
[WARNING] [Warn] /home/jenkins/workspace/spark-master-test-k8s/sql/core/src/main/java/org/apache/spark/sql/execution/datasources/parquet/VectorizedColumnReader.java:35: org.apache.parquet.schema.OriginalType in org.apache.parquet.schema has been deprecated
[WARNING] [Warn] /home/jenkins/workspace/spark-master-test-k8s/sql/core/src/main/java/org/apache/spark/sql/execution/datasources/parquet/SpecificParquetRecordReaderBase.java:95: org.apache.parquet.hadoop.ParquetInputSplit in org.apache.parquet.hadoop has been deprecated
[WARNING] [Warn] /home/jenkins/workspace/spark-master-test-k8s/sql/core/src/main/java/org/apache/spark/sql/execution/datasources/parquet/SpecificParquetRecordReaderBase.java:95: org.apache.parquet.hadoop.ParquetInputSplit in org.apache.parquet.hadoop has been deprecated
[WARNING] [Warn] /home/jenkins/workspace/spark-master-test-k8s/sql/core/src/main/java/org/apache/spark/sql/execution/datasources/parquet/SpecificParquetRecordReaderBase.java:97: getRowGroupOffsets() in org.apache.parquet.hadoop.ParquetInputSplit has been deprecated
[WARNING] [Warn] /home/jenkins/workspace/spark-master-test-k8s/sql/core/src/main/java/org/apache/spark/sql/execution/datasources/parquet/SpecificParquetRecordReaderBase.java:105: readFooter(org.apache.hadoop.conf.Configuration,org.apache.hadoop.fs.Path,org.apache.parquet.format.converter.ParquetMetadataConverter.MetadataFilter) in org.apache.parquet.hadoop.ParquetFileReader has been deprecated
[WARNING] [Warn] /home/jenkins/workspace/spark-master-test-k8s/sql/core/src/main/java/org/apache/spark/sql/execution/datasources/parquet/SpecificParquetRecordReaderBase.java:108: filterRowGroups(org.apache.parquet.filter2.compat.FilterCompat.Filter,java.util.List<org.apache.parquet.hadoop.metadata.BlockMetaData>,org.apache.parquet.schema.MessageType) in org.apache.parquet.filter2.compat.RowGroupFilter has been deprecated
[WARNING] [Warn] /home/jenkins/workspace/spark-master-test-k8s/sql/core/src/main/java/org/apache/spark/sql/execution/datasources/parquet/SpecificParquetRecordReaderBase.java:118: readFooter(org.apache.hadoop.conf.Configuration,org.apache.hadoop.fs.Path,org.apache.parquet.format.converter.ParquetMetadataConverter.MetadataFilter) in org.apache.parquet.hadoop.ParquetFileReader has been deprecated
[WARNING] [Warn] /home/jenkins/workspace/spark-master-test-k8s/sql/core/src/main/java/org/apache/spark/sql/execution/datasources/parquet/SpecificParquetRecordReaderBase.java:154: ParquetFileReader(org.apache.hadoop.conf.Configuration,org.apache.parquet.hadoop.metadata.FileMetaData,org.apache.hadoop.fs.Path,java.util.List<org.apache.parquet.hadoop.metadata.BlockMetaData>,java.util.List<org.apache.parquet.column.ColumnDescriptor>) in org.apache.parquet.hadoop.ParquetFileReader has been deprecated
[WARNING] [Warn] /home/jenkins/workspace/spark-master-test-k8s/sql/core/src/main/java/org/apache/spark/sql/execution/datasources/parquet/SpecificParquetRecordReaderBase.java:207: readFooter(org.apache.hadoop.conf.Configuration,org.apache.hadoop.fs.Path,org.apache.parquet.format.converter.ParquetMetadataConverter.MetadataFilter) in org.apache.parquet.hadoop.ParquetFileReader has been deprecated
[WARNING] [Warn] /home/jenkins/workspace/spark-master-test-k8s/sql/core/src/main/java/org/apache/spark/sql/execution/datasources/parquet/SpecificParquetRecordReaderBase.java:230: ParquetFileReader(org.apache.hadoop.conf.Configuration,org.apache.parquet.hadoop.metadata.FileMetaData,org.apache.hadoop.fs.Path,java.util.List<org.apache.parquet.hadoop.metadata.BlockMetaData>,java.util.List<org.apache.parquet.column.ColumnDescriptor>) in org.apache.parquet.hadoop.ParquetFileReader has been deprecated
[WARNING] [Warn] /home/jenkins/workspace/spark-master-test-k8s/sql/core/src/main/java/org/apache/spark/sql/execution/datasources/parquet/VectorizedColumnReader.java:107: org.apache.parquet.schema.OriginalType in org.apache.parquet.schema has been deprecated
[WARNING] [Warn] /home/jenkins/workspace/spark-master-test-k8s/sql/core/src/main/java/org/apache/spark/sql/execution/datasources/parquet/VectorizedColumnReader.java:116: org.apache.parquet.schema.DecimalMetadata in org.apache.parquet.schema has been deprecated
[WARNING] [Warn] /home/jenkins/workspace/spark-master-test-k8s/sql/core/src/main/java/org/apache/spark/sql/execution/datasources/parquet/VectorizedColumnReader.java:116: getDecimalMetadata() in org.apache.parquet.schema.PrimitiveType has been deprecated
[WARNING] [Warn] /home/jenkins/workspace/spark-master-test-k8s/sql/core/src/main/java/org/apache/spark/sql/execution/datasources/parquet/VectorizedColumnReader.java:139: org.apache.parquet.schema.OriginalType in org.apache.parquet.schema has been deprecated
[WARNING] [Warn] /home/jenkins/workspace/spark-master-test-k8s/sql/core/src/main/java/org/apache/spark/sql/execution/datasources/parquet/VectorizedColumnReader.java:195: org.apache.parquet.schema.OriginalType in org.apache.parquet.schema has been deprecated
[WARNING] [Warn] /home/jenkins/workspace/spark-master-test-k8s/sql/core/src/main/java/org/apache/spark/sql/execution/datasources/parquet/VectorizedColumnReader.java:198: org.apache.parquet.schema.OriginalType in org.apache.parquet.schema has been deprecated
[WARNING] [Warn] /home/jenkins/workspace/spark-master-test-k8s/sql/core/src/main/java/org/apache/spark/sql/execution/datasources/parquet/VectorizedColumnReader.java:201: org.apache.parquet.schema.OriginalType in org.apache.parquet.schema has been deprecated
[WARNING] [Warn] /home/jenkins/workspace/spark-master-test-k8s/sql/core/src/main/java/org/apache/spark/sql/execution/datasources/parquet/VectorizedColumnReader.java:282: org.apache.parquet.schema.OriginalType in org.apache.parquet.schema has been deprecated
[WARNING] [Warn] /home/jenkins/workspace/spark-master-test-k8s/sql/core/src/main/java/org/apache/spark/sql/execution/datasources/parquet/VectorizedColumnReader.java:283: getDecimalMetadata() in org.apache.parquet.schema.PrimitiveType has been deprecated
[WARNING] [Warn] /home/jenkins/workspace/spark-master-test-k8s/sql/core/src/main/java/org/apache/spark/sql/execution/datasources/parquet/VectorizedColumnReader.java:401: org.apache.parquet.schema.OriginalType in org.apache.parquet.schema has been deprecated
[WARNING] [Warn] /home/jenkins/workspace/spark-master-test-k8s/sql/core/src/main/java/org/apache/spark/sql/execution/datasources/parquet/VectorizedColumnReader.java:408: org.apache.parquet.schema.OriginalType in org.apache.parquet.schema has been deprecated
[WARNING] [Warn] /home/jenkins/workspace/spark-master-test-k8s/sql/core/src/main/java/org/apache/spark/sql/execution/datasources/parquet/VectorizedColumnReader.java:426: org.apache.parquet.schema.OriginalType in org.apache.parquet.schema has been deprecated
[WARNING] [Warn] /home/jenkins/workspace/spark-master-test-k8s/sql/core/src/main/java/org/apache/spark/sql/execution/datasources/parquet/VectorizedColumnReader.java:595: org.apache.parquet.schema.OriginalType in org.apache.parquet.schema has been deprecated
[WARNING] [Warn] /home/jenkins/workspace/spark-master-test-k8s/sql/core/src/main/java/org/apache/spark/sql/execution/datasources/parquet/VectorizedColumnReader.java:604: org.apache.parquet.schema.OriginalType in org.apache.parquet.schema has been deprecated
[INFO] Done compiling.
[INFO] compile in 72.5 s
[INFO] 
[INFO] --- build-helper-maven-plugin:3.2.0:add-test-source (add-scala-test-sources) @ spark-sql_2.12 ---
[INFO] Test Source directory: /home/jenkins/workspace/spark-master-test-k8s/sql/core/src/test/gen-java added.
[INFO] 
[INFO] --- maven-antrun-plugin:1.8:run (create-tmp-dir) @ spark-sql_2.12 ---
[INFO] Executing tasks

main:
    [mkdir] Created dir: /home/jenkins/workspace/spark-master-test-k8s/sql/core/target/tmp
[INFO] Executed tasks
[INFO] 
[INFO] --- maven-resources-plugin:2.7:testResources (default-testResources) @ spark-sql_2.12 ---
[INFO] Using 'UTF-8' encoding to copy filtered resources.
[INFO] Copying 1449 resources
[INFO] Copying 3 resources
[INFO] 
[INFO] --- maven-compiler-plugin:3.8.1:testCompile (default-testCompile) @ spark-sql_2.12 ---
[INFO] Not compiling test sources
[INFO] 
[INFO] --- maven-dependency-plugin:3.1.1:build-classpath (generate-test-classpath) @ spark-sql_2.12 ---
[INFO] Dependencies classpath:
/home/jenkins/.m2/repository/org/glassfish/hk2/external/jakarta.inject/2.6.1/jakarta.inject-2.6.1.jar:/home/jenkins/.m2/repository/com/google/protobuf/protobuf-java/2.5.0/protobuf-java-2.5.0.jar:/home/jenkins/.m2/repository/com/h2database/h2/1.4.195/h2-1.4.195.jar:/home/jenkins/.m2/repository/org/scalatest/scalatest-freespec_2.12/3.2.3/scalatest-freespec_2.12-3.2.3.jar:/home/jenkins/.m2/repository/org/scalatest/scalatest-funsuite_2.12/3.2.3/scalatest-funsuite_2.12-3.2.3.jar:/home/jenkins/.m2/repository/org/apache/zookeeper/zookeeper-jute/3.6.2/zookeeper-jute-3.6.2.jar:/home/jenkins/.m2/repository/jakarta/servlet/jakarta.servlet-api/4.0.3/jakarta.servlet-api-4.0.3.jar:/home/jenkins/.m2/repository/org/eclipse/jetty/jetty-servlet/9.4.36.v20210114/jetty-servlet-9.4.36.v20210114.jar:/home/jenkins/.m2/repository/org/eclipse/jetty/jetty-continuation/9.4.36.v20210114/jetty-continuation-9.4.36.v20210114.jar:/home/jenkins/.m2/repository/org/scalatest/scalatest-funspec_2.12/3.2.3/scalatest-funspec_2.12-3.2.3.jar:/home/jenkins/.m2/repository/org/apache/arrow/arrow-memory-netty/2.0.0/arrow-memory-netty-2.0.0.jar:/home/jenkins/.m2/repository/com/google/code/findbugs/jsr305/3.0.0/jsr305-3.0.0.jar:/home/jenkins/.m2/repository/com/github/luben/zstd-jni/1.4.8-5/zstd-jni-1.4.8-5.jar:/home/jenkins/.m2/repository/org/glassfish/jersey/media/jersey-media-jaxb/2.30/jersey-media-jaxb-2.30.jar:/home/jenkins/.m2/repository/org/apache/zookeeper/zookeeper/3.6.2/zookeeper-3.6.2.jar:/home/jenkins/.m2/repository/org/json4s/json4s-core_2.12/3.7.0-M5/json4s-core_2.12-3.7.0-M5.jar:/home/jenkins/.m2/repository/org/apache/htrace/htrace-core4/4.1.0-incubating/htrace-core4-4.1.0-incubating.jar:/home/jenkins/.m2/repository/commons-codec/commons-codec/1.15/commons-codec-1.15.jar:/home/jenkins/.m2/repository/net/sf/py4j/py4j/0.10.9.1/py4j-0.10.9.1.jar:/home/jenkins/.m2/repository/org/scala-lang/scala-library/2.12.10/scala-library-2.12.10.jar:/home/jenkins/.m2/repository/org/apache/arrow/arrow-format/2.0.0/arrow-format-2.0.0.jar:/home/jenkins/.m2/repository/xerces/xercesImpl/2.12.0/xercesImpl-2.12.0.jar:/home/jenkins/.m2/repository/net/bytebuddy/byte-buddy/1.10.13/byte-buddy-1.10.13.jar:/home/jenkins/.m2/repository/com/twitter/chill-java/0.9.5/chill-java-0.9.5.jar:/home/jenkins/.m2/repository/commons-net/commons-net/3.1/commons-net-3.1.jar:/home/jenkins/workspace/spark-master-test-k8s/common/unsafe/target/spark-unsafe_2.12-3.2.0-SNAPSHOT.jar:/home/jenkins/.m2/repository/org/apache/parquet/parquet-hadoop/1.11.1/parquet-hadoop-1.11.1.jar:/home/jenkins/.m2/repository/com/oracle/database/jdbc/ucp/19.6.0.0/ucp-19.6.0.0.jar:/home/jenkins/.m2/repository/org/eclipse/jetty/websocket/websocket-common/9.4.28.v20200408/websocket-common-9.4.28.v20200408.jar:/home/jenkins/workspace/spark-master-test-k8s/common/tags/target/spark-tags_2.12-3.2.0-SNAPSHOT.jar:/home/jenkins/.m2/repository/org/apache/httpcomponents/httpclient/4.5.13/httpclient-4.5.13.jar:/home/jenkins/.m2/repository/org/jetbrains/annotations/17.0.0/annotations-17.0.0.jar:/home/jenkins/.m2/repository/org/apache/avro/avro/1.10.1/avro-1.10.1.jar:/home/jenkins/.m2/repository/org/scalatestplus/scalatestplus-scalacheck_2.12/3.1.0.0-RC2/scalatestplus-scalacheck_2.12-3.1.0.0-RC2.jar:/home/jenkins/.m2/repository/commons-lang/commons-lang/2.6/commons-lang-2.6.jar:/home/jenkins/.m2/repository/org/scalatest/scalatest-wordspec_2.12/3.2.3/scalatest-wordspec_2.12-3.2.3.jar:/home/jenkins/.m2/repository/org/seleniumhq/selenium/selenium-edge-driver/3.141.59/selenium-edge-driver-3.141.59.jar:/home/jenkins/.m2/repository/org/apache/commons/commons-exec/1.3/commons-exec-1.3.jar:/home/jenkins/.m2/repository/javax/activation/activation/1.1.1/activation-1.1.1.jar:/home/jenkins/.m2/repository/com/oracle/database/ha/simplefan/19.6.0.0/simplefan-19.6.0.0.jar:/home/jenkins/.m2/repository/org/eclipse/jetty/jetty-server/9.4.36.v20210114/jetty-server-9.4.36.v20210114.jar:/home/jenkins/.m2/repository/com/oracle/database/security/osdt_cert/19.6.0.0/osdt_cert-19.6.0.0.jar:/home/jenkins/.m2/repository/org/scalactic/scalactic_2.12/3.2.3/scalactic_2.12-3.2.3.jar:/home/jenkins/.m2/repository/org/apache/ivy/ivy/2.4.0/ivy-2.4.0.jar:/home/jenkins/.m2/repository/com/twitter/chill_2.12/0.9.5/chill_2.12-0.9.5.jar:/home/jenkins/.m2/repository/net/razorvine/pyrolite/4.30/pyrolite-4.30.jar:/home/jenkins/.m2/repository/jakarta/validation/jakarta.validation-api/2.0.2/jakarta.validation-api-2.0.2.jar:/home/jenkins/.m2/repository/org/glassfish/jersey/inject/jersey-hk2/2.30/jersey-hk2-2.30.jar:/home/jenkins/.m2/repository/org/apache/hadoop/hadoop-client-api/3.2.2/hadoop-client-api-3.2.2.jar:/home/jenkins/.m2/repository/org/json4s/json4s-ast_2.12/3.7.0-M5/json4s-ast_2.12-3.7.0-M5.jar:/home/jenkins/.m2/repository/org/eclipse/jetty/jetty-util/9.4.36.v20210114/jetty-util-9.4.36.v20210114.jar:/home/jenkins/.m2/repository/com/oracle/database/security/oraclepki/19.6.0.0/oraclepki-19.6.0.0.jar:/home/jenkins/.m2/repository/org/scala-lang/scala-reflect/2.12.10/scala-reflect-2.12.10.jar:/home/jenkins/.m2/repository/com/fasterxml/jackson/module/jackson-module-scala_2.12/2.11.4/jackson-module-scala_2.12-2.11.4.jar:/home/jenkins/.m2/repository/log4j/log4j/1.2.17/log4j-1.2.17.jar:/home/jenkins/.m2/repository/org/codehaus/janino/commons-compiler/3.0.16/commons-compiler-3.0.16.jar:/home/jenkins/.m2/repository/org/apache/avro/avro-ipc/1.10.1/avro-ipc-1.10.1.jar:/home/jenkins/.m2/repository/org/apache/curator/curator-framework/2.13.0/curator-framework-2.13.0.jar:/home/jenkins/.m2/repository/org/eclipse/jetty/jetty-plus/9.4.36.v20210114/jetty-plus-9.4.36.v20210114.jar:/home/jenkins/.m2/repository/com/fasterxml/jackson/core/jackson-annotations/2.11.4/jackson-annotations-2.11.4.jar:/home/jenkins/.m2/repository/io/dropwizard/metrics/metrics-core/4.1.1/metrics-core-4.1.1.jar:/home/jenkins/.m2/repository/junit/junit/4.13.1/junit-4.13.1.jar:/home/jenkins/.m2/repository/com/shapesecurity/salvation/2.7.1/salvation-2.7.1.jar:/home/jenkins/.m2/repository/io/dropwizard/metrics/metrics-json/4.1.1/metrics-json-4.1.1.jar:/home/jenkins/.m2/repository/org/roaringbitmap/shims/0.9.0/shims-0.9.0.jar:/home/jenkins/.m2/repository/org/glassfish/hk2/osgi-resource-locator/1.0.3/osgi-resource-locator-1.0.3.jar:/home/jenkins/.m2/repository/net/bytebuddy/byte-buddy-agent/1.10.13/byte-buddy-agent-1.10.13.jar:/home/jenkins/.m2/repository/org/apache/hadoop/hadoop-client-runtime/3.2.2/hadoop-client-runtime-3.2.2.jar:/home/jenkins/workspace/spark-master-test-k8s/common/tags/target/spark-tags_2.12-3.2.0-SNAPSHOT-tests.jar:/home/jenkins/.m2/repository/com/oracle/database/jdbc/ojdbc8/19.6.0.0/ojdbc8-19.6.0.0.jar:/home/jenkins/.m2/repository/org/scala-sbt/test-interface/1.0/test-interface-1.0.jar:/home/jenkins/.m2/repository/com/squareup/okio/okio/1.14.0/okio-1.14.0.jar:/home/jenkins/.m2/repository/javax/xml/bind/jaxb-api/2.2.11/jaxb-api-2.2.11.jar:/home/jenkins/.m2/repository/org/eclipse/jetty/jetty-xml/9.4.36.v20210114/jetty-xml-9.4.36.v20210114.jar:/home/jenkins/.m2/repository/org/apache/hive/hive-storage-api/2.7.2/hive-storage-api-2.7.2.jar:/home/jenkins/.m2/repository/org/slf4j/slf4j-api/1.7.30/slf4j-api-1.7.30.jar:/home/jenkins/.m2/repository/com/ning/compress-lzf/1.0.3/compress-lzf-1.0.3.jar:/home/jenkins/.m2/repository/org/glassfish/jersey/containers/jersey-container-servlet/2.30/jersey-container-servlet-2.30.jar:/home/jenkins/.m2/repository/org/eclipse/jetty/jetty-webapp/9.4.36.v20210114/jetty-webapp-9.4.36.v20210114.jar:/home/jenkins/.m2/repository/org/eclipse/jetty/jetty-io/9.4.36.v20210114/jetty-io-9.4.36.v20210114.jar:/home/jenkins/.m2/repository/org/seleniumhq/selenium/selenium-remote-driver/3.141.59/selenium-remote-driver-3.141.59.jar:/home/jenkins/.m2/repository/org/apache/httpcomponents/httpmime/4.5.13/httpmime-4.5.13.jar:/home/jenkins/.m2/repository/com/oracle/database/ha/ons/19.6.0.0/ons-19.6.0.0.jar:/home/jenkins/workspace/spark-master-test-k8s/common/network-common/target/spark-network-common_2.12-3.2.0-SNAPSHOT.jar:/home/jenkins/.m2/repository/com/microsoft/sqlserver/mssql-jdbc/8.2.2.jre8/mssql-jdbc-8.2.2.jre8.jar:/home/jenkins/.m2/repository/org/javassist/javassist/3.25.0-GA/javassist-3.25.0-GA.jar:/home/jenkins/.m2/repository/org/glassfish/jersey/containers/jersey-container-servlet-core/2.30/jersey-container-servlet-core-2.30.jar:/home/jenkins/.m2/repository/org/eclipse/jetty/jetty-servlets/9.4.36.v20210114/jetty-servlets-9.4.36.v20210114.jar:/home/jenkins/workspace/spark-master-test-k8s/common/kvstore/target/spark-kvstore_2.12-3.2.0-SNAPSHOT.jar:/home/jenkins/.m2/repository/org/scalatest/scalatest-flatspec_2.12/3.2.3/scalatest-flatspec_2.12-3.2.3.jar:/home/jenkins/.m2/repository/org/mockito/mockito-core/3.4.6/mockito-core-3.4.6.jar:/home/jenkins/.m2/repository/org/xerial/snappy/snappy-java/1.1.8.2/snappy-java-1.1.8.2.jar:/home/jenkins/.m2/repository/org/scalacheck/scalacheck_2.12/1.14.2/scalacheck_2.12-1.14.2.jar:/home/jenkins/.m2/repository/org/eclipse/jetty/jetty-security/9.4.36.v20210114/jetty-security-9.4.36.v20210114.jar:/home/jenkins/.m2/repository/org/apache/parquet/parquet-avro/1.11.1/parquet-avro-1.11.1.jar:/home/jenkins/.m2/repository/org/spark-project/spark/unused/1.0.0/unused-1.0.0.jar:/home/jenkins/.m2/repository/org/apache/parquet/parquet-column/1.11.1/parquet-column-1.11.1.jar:/home/jenkins/.m2/repository/commons-collections/commons-collections/3.2.2/commons-collections-3.2.2.jar:/home/jenkins/.m2/repository/org/scalatest/scalatest-compatible/3.2.3/scalatest-compatible-3.2.3.jar:/home/jenkins/.m2/repository/org/scalatest/scalatest-propspec_2.12/3.2.3/scalatest-propspec_2.12-3.2.3.jar:/home/jenkins/.m2/repository/org/eclipse/jetty/jetty-util-ajax/9.4.36.v20210114/jetty-util-ajax-9.4.36.v20210114.jar:/home/jenkins/.m2/repository/org/eclipse/jetty/websocket/websocket-api/9.4.28.v20200408/websocket-api-9.4.28.v20200408.jar:/home/jenkins/.m2/repository/org/apache/commons/commons-compress/1.20/commons-compress-1.20.jar:/home/jenkins/.m2/repository/org/eclipse/jetty/jetty-client/9.4.36.v20210114/jetty-client-9.4.36.v20210114.jar:/home/jenkins/.m2/repository/org/scalatestplus/scalatestplus-mockito_2.12/1.0.0-SNAP5/scalatestplus-mockito_2.12-1.0.0-SNAP5.jar:/home/jenkins/.m2/repository/com/clearspring/analytics/stream/2.9.6/stream-2.9.6.jar:/home/jenkins/.m2/repository/org/threeten/threeten-extra/1.5.0/threeten-extra-1.5.0.jar:/home/jenkins/.m2/repository/org/glassfish/hk2/hk2-locator/2.6.1/hk2-locator-2.6.1.jar:/home/jenkins/.m2/repository/org/slf4j/slf4j-log4j12/1.7.30/slf4j-log4j12-1.7.30.jar:/home/jenkins/.m2/repository/org/glassfish/hk2/hk2-utils/2.6.1/hk2-utils-2.6.1.jar:/home/jenkins/.m2/repository/org/seleniumhq/selenium/htmlunit-driver/2.40.0/htmlunit-driver-2.40.0.jar:/home/jenkins/.m2/repository/com/thoughtworks/paranamer/paranamer/2.8/paranamer-2.8.jar:/home/jenkins/.m2/repository/io/netty/netty-all/4.1.51.Final/netty-all-4.1.51.Final.jar:/home/jenkins/.m2/repository/org/objenesis/objenesis/2.6/objenesis-2.6.jar:/home/jenkins/.m2/repository/org/fusesource/leveldbjni/leveldbjni-all/1.8/leveldbjni-all-1.8.jar:/home/jenkins/.m2/repository/xml-apis/xml-apis/1.4.01/xml-apis-1.4.01.jar:/home/jenkins/.m2/repository/org/apache/commons/commons-text/1.6/commons-text-1.6.jar:/home/jenkins/.m2/repository/org/scalatest/scalatest-diagrams_2.12/3.2.3/scalatest-diagrams_2.12-3.2.3.jar:/home/jenkins/.m2/repository/jakarta/ws/rs/jakarta.ws.rs-api/2.1.6/jakarta.ws.rs-api-2.1.6.jar:/home/jenkins/.m2/repository/org/glassfish/hk2/external/aopalliance-repackaged/2.6.1/aopalliance-repackaged-2.6.1.jar:/home/jenkins/.m2/repository/org/apache/arrow/arrow-memory-core/2.0.0/arrow-memory-core-2.0.0.jar:/home/jenkins/.m2/repository/commons-io/commons-io/2.8.0/commons-io-2.8.0.jar:/home/jenkins/workspace/spark-master-test-k8s/common/network-shuffle/target/spark-network-shuffle_2.12-3.2.0-SNAPSHOT.jar:/home/jenkins/.m2/repository/xalan/serializer/2.7.2/serializer-2.7.2.jar:/home/jenkins/.m2/repository/com/esotericsoftware/kryo-shaded/4.0.2/kryo-shaded-4.0.2.jar:/home/jenkins/.m2/repository/com/esotericsoftware/minlog/1.3.0/minlog-1.3.0.jar:/home/jenkins/.m2/repository/xalan/xalan/2.7.2/xalan-2.7.2.jar:/home/jenkins/.m2/repository/org/scalatest/scalatest_2.12/3.2.3/scalatest_2.12-3.2.3.jar:/home/jenkins/.m2/repository/org/scalatest/scalatest-mustmatchers_2.12/3.2.3/scalatest-mustmatchers_2.12-3.2.3.jar:/home/jenkins/.m2/repository/com/squareup/okhttp3/okhttp/3.11.0/okhttp-3.11.0.jar:/home/jenkins/.m2/repository/com/fasterxml/jackson/core/jackson-databind/2.11.4/jackson-databind-2.11.4.jar:/home/jenkins/.m2/repository/org/postgresql/postgresql/42.2.6/postgresql-42.2.6.jar:/home/jenkins/.m2/repository/org/slf4j/jul-to-slf4j/1.7.30/jul-to-slf4j-1.7.30.jar:/home/jenkins/.m2/repository/org/json4s/json4s-scalap_2.12/3.7.0-M5/json4s-scalap_2.12-3.7.0-M5.jar:/home/jenkins/.m2/repository/org/apache/parquet/parquet-encoding/1.11.1/parquet-encoding-1.11.1.jar:/home/jenkins/workspace/spark-master-test-k8s/common/sketch/target/spark-sketch_2.12-3.2.0-SNAPSHOT.jar:/home/jenkins/.m2/repository/org/seleniumhq/selenium/selenium-ie-driver/3.141.59/selenium-ie-driver-3.141.59.jar:/home/jenkins/.m2/repository/org/lz4/lz4-java/1.7.1/lz4-java-1.7.1.jar:/home/jenkins/.m2/repository/com/google/flatbuffers/flatbuffers-java/1.9.0/flatbuffers-java-1.9.0.jar:/home/jenkins/.m2/repository/org/apache/orc/orc-shims/1.6.7/orc-shims-1.6.7.jar:/home/jenkins/.m2/repository/org/json4s/json4s-jackson_2.12/3.7.0-M5/json4s-jackson_2.12-3.7.0-M5.jar:/home/jenkins/.m2/repository/org/scala-lang/modules/scala-parser-combinators_2.12/1.1.2/scala-parser-combinators_2.12-1.1.2.jar:/home/jenkins/.m2/repository/org/apache/orc/orc-core/1.6.7/orc-core-1.6.7.jar:/home/jenkins/.m2/repository/io/dropwizard/metrics/metrics-graphite/4.1.1/metrics-graphite-4.1.1.jar:/home/jenkins/.m2/repository/net/sourceforge/htmlunit/htmlunit-core-js/2.40.0/htmlunit-core-js-2.40.0.jar:/home/jenkins/.m2/repository/org/codehaus/janino/janino/3.0.16/janino-3.0.16.jar:/home/jenkins/.m2/repository/com/google/guava/guava/14.0.1/guava-14.0.1.jar:/home/jenkins/.m2/repository/org/apache/httpcomponents/httpcore/4.4.12/httpcore-4.4.12.jar:/home/jenkins/.m2/repository/org/apache/arrow/arrow-vector/2.0.0/arrow-vector-2.0.0.jar:/home/jenkins/.m2/repository/javax/servlet/javax.servlet-api/3.1.0/javax.servlet-api-3.1.0.jar:/home/jenkins/.m2/repository/net/sourceforge/htmlunit/htmlunit/2.40.0/htmlunit-2.40.0.jar:/home/jenkins/.m2/repository/org/apache/commons/commons-math3/3.4.1/commons-math3-3.4.1.jar:/home/jenkins/.m2/repository/org/scalatest/scalatest-core_2.12/3.2.3/scalatest-core_2.12-3.2.3.jar:/home/jenkins/.m2/repository/org/tukaani/xz/1.8/xz-1.8.jar:/home/jenkins/workspace/spark-master-test-k8s/launcher/target/spark-launcher_2.12-3.2.0-SNAPSHOT.jar:/home/jenkins/.m2/repository/org/glassfish/jersey/core/jersey-common/2.30/jersey-common-2.30.jar:/home/jenkins/.m2/repository/org/mariadb/jdbc/mariadb-java-client/2.5.4/mariadb-java-client-2.5.4.jar:/home/jenkins/.m2/repository/oro/oro/2.0.8/oro-2.0.8.jar:/home/jenkins/.m2/repository/com/novocode/junit-interface/0.11/junit-interface-0.11.jar:/home/jenkins/.m2/repository/org/apache/xbean/xbean-asm7-shaded/4.15/xbean-asm7-shaded-4.15.jar:/home/jenkins/.m2/repository/org/antlr/antlr4-runtime/4.8-1/antlr4-runtime-4.8-1.jar:/home/jenkins/.m2/repository/org/apache/parquet/parquet-format-structures/1.11.1/parquet-format-structures-1.11.1.jar:/home/jenkins/.m2/repository/org/apache/commons/commons-lang3/3.11/commons-lang3-3.11.jar:/home/jenkins/.m2/repository/org/apache/parquet/parquet-common/1.11.1/parquet-common-1.11.1.jar:/home/jenkins/.m2/repository/org/glassfish/hk2/hk2-api/2.6.1/hk2-api-2.6.1.jar:/home/jenkins/.m2/repository/org/seleniumhq/selenium/selenium-chrome-driver/3.141.59/selenium-chrome-driver-3.141.59.jar:/home/jenkins/.m2/repository/org/seleniumhq/selenium/selenium-opera-driver/3.141.59/selenium-opera-driver-3.141.59.jar:/home/jenkins/.m2/repository/jakarta/annotation/jakarta.annotation-api/1.3.5/jakarta.annotation-api-1.3.5.jar:/home/jenkins/workspace/spark-master-test-k8s/core/target/spark-core_2.12-3.2.0-SNAPSHOT.jar:/home/jenkins/.m2/repository/org/apache/yetus/audience-annotations/0.5.0/audience-annotations-0.5.0.jar:/home/jenkins/.m2/repository/io/dropwizard/metrics/metrics-jvm/4.1.1/metrics-jvm-4.1.1.jar:/home/jenkins/.m2/repository/org/scalatestplus/scalatestplus-selenium_2.12/1.0.0-SNAP5/scalatestplus-selenium_2.12-1.0.0-SNAP5.jar:/home/jenkins/workspace/spark-master-test-k8s/core/target/spark-core_2.12-3.2.0-SNAPSHOT-tests.jar:/home/jenkins/.m2/repository/com/fasterxml/jackson/module/jackson-module-paranamer/2.11.4/jackson-module-paranamer-2.11.4.jar:/home/jenkins/.m2/repository/org/eclipse/jetty/jetty-proxy/9.4.36.v20210114/jetty-proxy-9.4.36.v20210114.jar:/home/jenkins/.m2/repository/org/hamcrest/hamcrest-core/1.3/hamcrest-core-1.3.jar:/home/jenkins/.m2/repository/org/seleniumhq/selenium/selenium-support/3.141.59/selenium-support-3.141.59.jar:/home/jenkins/.m2/repository/org/scala-lang/modules/scala-xml_2.12/1.2.0/scala-xml_2.12-1.2.0.jar:/home/jenkins/.m2/repository/org/apache/curator/curator-recipes/2.13.0/curator-recipes-2.13.0.jar:/home/jenkins/.m2/repository/com/oracle/database/security/osdt_core/19.6.0.0/osdt_core-19.6.0.0.jar:/home/jenkins/.m2/repository/org/apache/curator/curator-client/2.13.0/curator-client-2.13.0.jar:/home/jenkins/.m2/repository/org/apache/commons/commons-crypto/1.1.0/commons-crypto-1.1.0.jar:/home/jenkins/.m2/repository/org/apache/orc/orc-mapreduce/1.6.7/orc-mapreduce-1.6.7.jar:/home/jenkins/.m2/repository/org/apache/parquet/parquet-jackson/1.11.1/parquet-jackson-1.11.1.jar:/home/jenkins/.m2/repository/org/brotli/dec/0.1.2/dec-0.1.2.jar:/home/jenkins/.m2/repository/com/ibm/db2/jcc/11.5.0.0/jcc-11.5.0.0.jar:/home/jenkins/.m2/repository/net/sourceforge/htmlunit/neko-htmlunit/2.40.0/neko-htmlunit-2.40.0.jar:/home/jenkins/.m2/repository/org/scalatest/scalatest-refspec_2.12/3.2.3/scalatest-refspec_2.12-3.2.3.jar:/home/jenkins/workspace/spark-master-test-k8s/sql/catalyst/target/spark-catalyst_2.12-3.2.0-SNAPSHOT-tests.jar:/home/jenkins/.m2/repository/org/seleniumhq/selenium/selenium-api/3.141.59/selenium-api-3.141.59.jar:/home/jenkins/.m2/repository/org/seleniumhq/selenium/selenium-java/3.141.59/selenium-java-3.141.59.jar:/home/jenkins/.m2/repository/org/roaringbitmap/RoaringBitmap/0.9.0/RoaringBitmap-0.9.0.jar:/home/jenkins/.m2/repository/com/univocity/univocity-parsers/2.9.1/univocity-parsers-2.9.1.jar:/home/jenkins/.m2/repository/org/apache/avro/avro-mapred/1.10.1/avro-mapred-1.10.1.jar:/home/jenkins/.m2/repository/org/slf4j/jcl-over-slf4j/1.7.30/jcl-over-slf4j-1.7.30.jar:/home/jenkins/.m2/repository/io/airlift/aircompressor/0.16/aircompressor-0.16.jar:/home/jenkins/.m2/repository/com/fasterxml/jackson/core/jackson-core/2.11.4/jackson-core-2.11.4.jar:/home/jenkins/.m2/repository/org/glassfish/jersey/core/jersey-server/2.30/jersey-server-2.30.jar:/home/jenkins/.m2/repository/io/dropwizard/metrics/metrics-jmx/4.1.1/metrics-jmx-4.1.1.jar:/home/jenkins/.m2/repository/org/glassfish/jersey/core/jersey-client/2.30/jersey-client-2.30.jar:/home/jenkins/.m2/repository/org/scalatest/scalatest-featurespec_2.12/3.2.3/scalatest-featurespec_2.12-3.2.3.jar:/home/jenkins/.m2/repository/org/eclipse/jetty/jetty-http/9.4.36.v20210114/jetty-http-9.4.36.v20210114.jar:/home/jenkins/.m2/repository/org/seleniumhq/selenium/selenium-firefox-driver/3.141.59/selenium-firefox-driver-3.141.59.jar:/home/jenkins/.m2/repository/commons-logging/commons-logging/1.1.3/commons-logging-1.1.3.jar:/home/jenkins/.m2/repository/org/seleniumhq/selenium/selenium-safari-driver/3.141.59/selenium-safari-driver-3.141.59.jar:/home/jenkins/.m2/repository/org/eclipse/jetty/websocket/websocket-client/9.4.28.v20200408/websocket-client-9.4.28.v20200408.jar:/home/jenkins/.m2/repository/org/scalatest/scalatest-shouldmatchers_2.12/3.2.3/scalatest-shouldmatchers_2.12-3.2.3.jar:/home/jenkins/workspace/spark-master-test-k8s/sql/catalyst/target/spark-catalyst_2.12-3.2.0-SNAPSHOT.jar:/home/jenkins/.m2/repository/org/eclipse/jetty/jetty-jndi/9.4.36.v20210114/jetty-jndi-9.4.36.v20210114.jar:/home/jenkins/.m2/repository/net/sourceforge/htmlunit/htmlunit-cssparser/1.5.0/htmlunit-cssparser-1.5.0.jar:/home/jenkins/.m2/repository/org/scalatest/scalatest-matchers-core_2.12/3.2.3/scalatest-matchers-core_2.12-3.2.3.jar
[INFO] 
[INFO] --- scala-maven-plugin:4.3.0:testCompile (scala-test-compile-first) @ spark-sql_2.12 ---
[INFO] Using incremental compilation using Mixed compile order
[INFO] Compiler bridge file: /home/jenkins/.sbt/1.0/zinc/org.scala-sbt/org.scala-sbt-compiler-bridge_2.12-1.3.1-bin_2.12.10__52.0-1.3.1_20191012T045515.jar
[INFO] compiler plugin: BasicArtifact(com.github.ghik,silencer-plugin_2.12.10,1.6.0,null)
[INFO] Compiling 460 Scala sources and 43 Java sources to /home/jenkins/workspace/spark-master-test-k8s/sql/core/target/scala-2.12/test-classes ...
FATAL: command execution failed
java.io.EOFException
	at java.io.ObjectInputStream$PeekInputStream.readFully(ObjectInputStream.java:2799)
	at java.io.ObjectInputStream$BlockDataInputStream.readShort(ObjectInputStream.java:3274)
	at java.io.ObjectInputStream.readStreamHeader(ObjectInputStream.java:934)
	at java.io.ObjectInputStream.<init>(ObjectInputStream.java:396)
	at hudson.remoting.ObjectInputStreamEx.<init>(ObjectInputStreamEx.java:49)
	at hudson.remoting.Command.readFrom(Command.java:142)
	at hudson.remoting.Command.readFrom(Command.java:128)
	at hudson.remoting.AbstractSynchronousByteArrayCommandTransport.read(AbstractSynchronousByteArrayCommandTransport.java:35)
	at hudson.remoting.SynchronousCommandTransport$ReaderThread.run(SynchronousCommandTransport.java:63)
Caused: java.io.IOException: Unexpected termination of the channel
	at hudson.remoting.SynchronousCommandTransport$ReaderThread.run(SynchronousCommandTransport.java:77)
Caused: java.io.IOException: Backing channel 'amp-jenkins-staging-worker-02' is disconnected.
	at hudson.remoting.RemoteInvocationHandler.channelOrFail(RemoteInvocationHandler.java:216)
	at hudson.remoting.RemoteInvocationHandler.invoke(RemoteInvocationHandler.java:286)
	at com.sun.proxy.$Proxy85.isAlive(Unknown Source)
	at hudson.Launcher$RemoteLauncher$ProcImpl.isAlive(Launcher.java:1211)
	at hudson.Launcher$RemoteLauncher$ProcImpl.join(Launcher.java:1203)
	at hudson.tasks.CommandInterpreter.join(CommandInterpreter.java:194)
	at hudson.tasks.CommandInterpreter.perform(CommandInterpreter.java:144)
	at hudson.tasks.CommandInterpreter.perform(CommandInterpreter.java:91)
	at hudson.tasks.BuildStepMonitor$1.perform(BuildStepMonitor.java:20)
	at hudson.model.AbstractBuild$AbstractBuildExecution.perform(AbstractBuild.java:741)
	at hudson.model.Build$BuildExecution.build(Build.java:206)
	at hudson.model.Build$BuildExecution.doRun(Build.java:163)
	at hudson.model.AbstractBuild$AbstractBuildExecution.run(AbstractBuild.java:504)
	at hudson.model.Run.execute(Run.java:1894)
	at hudson.model.FreeStyleBuild.run(FreeStyleBuild.java:43)
	at hudson.model.ResourceController.execute(ResourceController.java:97)
	at hudson.model.Executor.run(Executor.java:428)
FATAL: Unable to delete script file /tmp/jenkins6356507806089731749.sh
java.io.EOFException
	at java.io.ObjectInputStream$PeekInputStream.readFully(ObjectInputStream.java:2799)
	at java.io.ObjectInputStream$BlockDataInputStream.readShort(ObjectInputStream.java:3274)
	at java.io.ObjectInputStream.readStreamHeader(ObjectInputStream.java:934)
	at java.io.ObjectInputStream.<init>(ObjectInputStream.java:396)
	at hudson.remoting.ObjectInputStreamEx.<init>(ObjectInputStreamEx.java:49)
	at hudson.remoting.Command.readFrom(Command.java:142)
	at hudson.remoting.Command.readFrom(Command.java:128)
	at hudson.remoting.AbstractSynchronousByteArrayCommandTransport.read(AbstractSynchronousByteArrayCommandTransport.java:35)
	at hudson.remoting.SynchronousCommandTransport$ReaderThread.run(SynchronousCommandTransport.java:63)
Caused: java.io.IOException: Unexpected termination of the channel
	at hudson.remoting.SynchronousCommandTransport$ReaderThread.run(SynchronousCommandTransport.java:77)
Caused: hudson.remoting.ChannelClosedException: Channel "hudson.remoting.Channel@974a851:amp-jenkins-staging-worker-02": Remote call on amp-jenkins-staging-worker-02 failed. The channel is closing down or has closed down
	at hudson.remoting.Channel.call(Channel.java:994)
	at hudson.FilePath.act(FilePath.java:1070)
	at hudson.FilePath.act(FilePath.java:1059)
	at hudson.FilePath.delete(FilePath.java:1582)
	at hudson.tasks.CommandInterpreter.perform(CommandInterpreter.java:162)
	at hudson.tasks.CommandInterpreter.perform(CommandInterpreter.java:91)
	at hudson.tasks.BuildStepMonitor$1.perform(BuildStepMonitor.java:20)
	at hudson.model.AbstractBuild$AbstractBuildExecution.perform(AbstractBuild.java:741)
	at hudson.model.Build$BuildExecution.build(Build.java:206)
	at hudson.model.Build$BuildExecution.doRun(Build.java:163)
	at hudson.model.AbstractBuild$AbstractBuildExecution.run(AbstractBuild.java:504)
	at hudson.model.Run.execute(Run.java:1894)
	at hudson.model.FreeStyleBuild.run(FreeStyleBuild.java:43)
	at hudson.model.ResourceController.execute(ResourceController.java:97)
	at hudson.model.Executor.run(Executor.java:428)
Build step 'Execute shell' marked build as failure
ERROR: Step ‘Archive the artifacts’ failed: no workspace for spark-master-test-k8s #750
Finished: FAILURE