Console Output

Skipping 1,390 KB.. Full Log
spark-3.2.0-SNAPSHOT-bin-20210623-7f937730ff/examples/src/main/java/org/apache/spark/examples/streaming/JavaDirectKafkaWordCount.java
spark-3.2.0-SNAPSHOT-bin-20210623-7f937730ff/examples/src/main/java/org/apache/spark/examples/streaming/JavaNetworkWordCount.java
spark-3.2.0-SNAPSHOT-bin-20210623-7f937730ff/examples/src/main/java/org/apache/spark/examples/streaming/JavaCustomReceiver.java
spark-3.2.0-SNAPSHOT-bin-20210623-7f937730ff/examples/src/main/java/org/apache/spark/examples/streaming/JavaQueueStream.java
spark-3.2.0-SNAPSHOT-bin-20210623-7f937730ff/examples/src/main/java/org/apache/spark/examples/streaming/JavaDirectKerberizedKafkaWordCount.java
spark-3.2.0-SNAPSHOT-bin-20210623-7f937730ff/examples/src/main/java/org/apache/spark/examples/streaming/JavaRecoverableNetworkWordCount.java
spark-3.2.0-SNAPSHOT-bin-20210623-7f937730ff/examples/src/main/java/org/apache/spark/examples/streaming/JavaSqlNetworkWordCount.java
spark-3.2.0-SNAPSHOT-bin-20210623-7f937730ff/examples/src/main/java/org/apache/spark/examples/streaming/JavaRecord.java
spark-3.2.0-SNAPSHOT-bin-20210623-7f937730ff/examples/src/main/java/org/apache/spark/examples/ml/
spark-3.2.0-SNAPSHOT-bin-20210623-7f937730ff/examples/src/main/java/org/apache/spark/examples/ml/JavaLogisticRegressionSummaryExample.java
spark-3.2.0-SNAPSHOT-bin-20210623-7f937730ff/examples/src/main/java/org/apache/spark/examples/ml/JavaGeneralizedLinearRegressionExample.java
spark-3.2.0-SNAPSHOT-bin-20210623-7f937730ff/examples/src/main/java/org/apache/spark/examples/ml/JavaSQLTransformerExample.java
spark-3.2.0-SNAPSHOT-bin-20210623-7f937730ff/examples/src/main/java/org/apache/spark/examples/ml/JavaLinearRegressionWithElasticNetExample.java
spark-3.2.0-SNAPSHOT-bin-20210623-7f937730ff/examples/src/main/java/org/apache/spark/examples/ml/JavaInteractionExample.java
spark-3.2.0-SNAPSHOT-bin-20210623-7f937730ff/examples/src/main/java/org/apache/spark/examples/ml/JavaVectorAssemblerExample.java
spark-3.2.0-SNAPSHOT-bin-20210623-7f937730ff/examples/src/main/java/org/apache/spark/examples/ml/JavaStopWordsRemoverExample.java
spark-3.2.0-SNAPSHOT-bin-20210623-7f937730ff/examples/src/main/java/org/apache/spark/examples/ml/JavaBucketedRandomProjectionLSHExample.java
spark-3.2.0-SNAPSHOT-bin-20210623-7f937730ff/examples/src/main/java/org/apache/spark/examples/ml/JavaNormalizerExample.java
spark-3.2.0-SNAPSHOT-bin-20210623-7f937730ff/examples/src/main/java/org/apache/spark/examples/ml/JavaGradientBoostedTreeRegressorExample.java
spark-3.2.0-SNAPSHOT-bin-20210623-7f937730ff/examples/src/main/java/org/apache/spark/examples/ml/JavaPCAExample.java
spark-3.2.0-SNAPSHOT-bin-20210623-7f937730ff/examples/src/main/java/org/apache/spark/examples/ml/JavaDCTExample.java
spark-3.2.0-SNAPSHOT-bin-20210623-7f937730ff/examples/src/main/java/org/apache/spark/examples/ml/JavaRandomForestClassifierExample.java
spark-3.2.0-SNAPSHOT-bin-20210623-7f937730ff/examples/src/main/java/org/apache/spark/examples/ml/JavaNGramExample.java
spark-3.2.0-SNAPSHOT-bin-20210623-7f937730ff/examples/src/main/java/org/apache/spark/examples/ml/JavaDocument.java
spark-3.2.0-SNAPSHOT-bin-20210623-7f937730ff/examples/src/main/java/org/apache/spark/examples/ml/JavaCountVectorizerExample.java
spark-3.2.0-SNAPSHOT-bin-20210623-7f937730ff/examples/src/main/java/org/apache/spark/examples/ml/JavaLabeledDocument.java
spark-3.2.0-SNAPSHOT-bin-20210623-7f937730ff/examples/src/main/java/org/apache/spark/examples/ml/JavaPipelineExample.java
spark-3.2.0-SNAPSHOT-bin-20210623-7f937730ff/examples/src/main/java/org/apache/spark/examples/ml/JavaLinearSVCExample.java
spark-3.2.0-SNAPSHOT-bin-20210623-7f937730ff/examples/src/main/java/org/apache/spark/examples/ml/JavaLDAExample.java
spark-3.2.0-SNAPSHOT-bin-20210623-7f937730ff/examples/src/main/java/org/apache/spark/examples/ml/JavaDecisionTreeClassificationExample.java
spark-3.2.0-SNAPSHOT-bin-20210623-7f937730ff/examples/src/main/java/org/apache/spark/examples/ml/JavaMultilayerPerceptronClassifierExample.java
spark-3.2.0-SNAPSHOT-bin-20210623-7f937730ff/examples/src/main/java/org/apache/spark/examples/ml/JavaQuantileDiscretizerExample.java
spark-3.2.0-SNAPSHOT-bin-20210623-7f937730ff/examples/src/main/java/org/apache/spark/examples/ml/JavaBucketizerExample.java
spark-3.2.0-SNAPSHOT-bin-20210623-7f937730ff/examples/src/main/java/org/apache/spark/examples/ml/JavaOneHotEncoderExample.java
spark-3.2.0-SNAPSHOT-bin-20210623-7f937730ff/examples/src/main/java/org/apache/spark/examples/ml/JavaRandomForestRegressorExample.java
spark-3.2.0-SNAPSHOT-bin-20210623-7f937730ff/examples/src/main/java/org/apache/spark/examples/ml/JavaMinMaxScalerExample.java
spark-3.2.0-SNAPSHOT-bin-20210623-7f937730ff/examples/src/main/java/org/apache/spark/examples/ml/JavaPolynomialExpansionExample.java
spark-3.2.0-SNAPSHOT-bin-20210623-7f937730ff/examples/src/main/java/org/apache/spark/examples/ml/JavaVectorIndexerExample.java
spark-3.2.0-SNAPSHOT-bin-20210623-7f937730ff/examples/src/main/java/org/apache/spark/examples/ml/JavaOneVsRestExample.java
spark-3.2.0-SNAPSHOT-bin-20210623-7f937730ff/examples/src/main/java/org/apache/spark/examples/ml/JavaFMClassifierExample.java
spark-3.2.0-SNAPSHOT-bin-20210623-7f937730ff/examples/src/main/java/org/apache/spark/examples/ml/JavaStandardScalerExample.java
spark-3.2.0-SNAPSHOT-bin-20210623-7f937730ff/examples/src/main/java/org/apache/spark/examples/ml/JavaPrefixSpanExample.java
spark-3.2.0-SNAPSHOT-bin-20210623-7f937730ff/examples/src/main/java/org/apache/spark/examples/ml/JavaIsotonicRegressionExample.java
spark-3.2.0-SNAPSHOT-bin-20210623-7f937730ff/examples/src/main/java/org/apache/spark/examples/ml/JavaImputerExample.java
spark-3.2.0-SNAPSHOT-bin-20210623-7f937730ff/examples/src/main/java/org/apache/spark/examples/ml/JavaGradientBoostedTreeClassifierExample.java
spark-3.2.0-SNAPSHOT-bin-20210623-7f937730ff/examples/src/main/java/org/apache/spark/examples/ml/JavaMaxAbsScalerExample.java
spark-3.2.0-SNAPSHOT-bin-20210623-7f937730ff/examples/src/main/java/org/apache/spark/examples/ml/JavaCorrelationExample.java
spark-3.2.0-SNAPSHOT-bin-20210623-7f937730ff/examples/src/main/java/org/apache/spark/examples/ml/JavaMulticlassLogisticRegressionWithElasticNetExample.java
spark-3.2.0-SNAPSHOT-bin-20210623-7f937730ff/examples/src/main/java/org/apache/spark/examples/ml/JavaTokenizerExample.java
spark-3.2.0-SNAPSHOT-bin-20210623-7f937730ff/examples/src/main/java/org/apache/spark/examples/ml/JavaRFormulaExample.java
spark-3.2.0-SNAPSHOT-bin-20210623-7f937730ff/examples/src/main/java/org/apache/spark/examples/ml/JavaRobustScalerExample.java
spark-3.2.0-SNAPSHOT-bin-20210623-7f937730ff/examples/src/main/java/org/apache/spark/examples/ml/JavaFeatureHasherExample.java
spark-3.2.0-SNAPSHOT-bin-20210623-7f937730ff/examples/src/main/java/org/apache/spark/examples/ml/JavaEstimatorTransformerParamExample.java
spark-3.2.0-SNAPSHOT-bin-20210623-7f937730ff/examples/src/main/java/org/apache/spark/examples/ml/JavaFMRegressorExample.java
spark-3.2.0-SNAPSHOT-bin-20210623-7f937730ff/examples/src/main/java/org/apache/spark/examples/ml/JavaNaiveBayesExample.java
spark-3.2.0-SNAPSHOT-bin-20210623-7f937730ff/examples/src/main/java/org/apache/spark/examples/ml/JavaChiSquareTestExample.java
spark-3.2.0-SNAPSHOT-bin-20210623-7f937730ff/examples/src/main/java/org/apache/spark/examples/ml/JavaMinHashLSHExample.java
spark-3.2.0-SNAPSHOT-bin-20210623-7f937730ff/examples/src/main/java/org/apache/spark/examples/ml/JavaTfIdfExample.java
spark-3.2.0-SNAPSHOT-bin-20210623-7f937730ff/examples/src/main/java/org/apache/spark/examples/ml/JavaModelSelectionViaRandomHyperparametersExample.java
spark-3.2.0-SNAPSHOT-bin-20210623-7f937730ff/examples/src/main/java/org/apache/spark/examples/ml/JavaBinarizerExample.java
spark-3.2.0-SNAPSHOT-bin-20210623-7f937730ff/examples/src/main/java/org/apache/spark/examples/ml/JavaUnivariateFeatureSelectorExample.java
spark-3.2.0-SNAPSHOT-bin-20210623-7f937730ff/examples/src/main/java/org/apache/spark/examples/ml/JavaStringIndexerExample.java
spark-3.2.0-SNAPSHOT-bin-20210623-7f937730ff/examples/src/main/java/org/apache/spark/examples/ml/JavaAFTSurvivalRegressionExample.java
spark-3.2.0-SNAPSHOT-bin-20210623-7f937730ff/examples/src/main/java/org/apache/spark/examples/ml/JavaDecisionTreeRegressionExample.java
spark-3.2.0-SNAPSHOT-bin-20210623-7f937730ff/examples/src/main/java/org/apache/spark/examples/ml/JavaVectorSlicerExample.java
spark-3.2.0-SNAPSHOT-bin-20210623-7f937730ff/examples/src/main/java/org/apache/spark/examples/ml/JavaGaussianMixtureExample.java
spark-3.2.0-SNAPSHOT-bin-20210623-7f937730ff/examples/src/main/java/org/apache/spark/examples/ml/JavaKMeansExample.java
spark-3.2.0-SNAPSHOT-bin-20210623-7f937730ff/examples/src/main/java/org/apache/spark/examples/ml/JavaWord2VecExample.java
spark-3.2.0-SNAPSHOT-bin-20210623-7f937730ff/examples/src/main/java/org/apache/spark/examples/ml/JavaPowerIterationClusteringExample.java
spark-3.2.0-SNAPSHOT-bin-20210623-7f937730ff/examples/src/main/java/org/apache/spark/examples/ml/JavaModelSelectionViaCrossValidationExample.java
spark-3.2.0-SNAPSHOT-bin-20210623-7f937730ff/examples/src/main/java/org/apache/spark/examples/ml/JavaChiSqSelectorExample.java
spark-3.2.0-SNAPSHOT-bin-20210623-7f937730ff/examples/src/main/java/org/apache/spark/examples/ml/JavaVectorSizeHintExample.java
spark-3.2.0-SNAPSHOT-bin-20210623-7f937730ff/examples/src/main/java/org/apache/spark/examples/ml/JavaALSExample.java
spark-3.2.0-SNAPSHOT-bin-20210623-7f937730ff/examples/src/main/java/org/apache/spark/examples/ml/JavaModelSelectionViaTrainValidationSplitExample.java
spark-3.2.0-SNAPSHOT-bin-20210623-7f937730ff/examples/src/main/java/org/apache/spark/examples/ml/JavaVarianceThresholdSelectorExample.java
spark-3.2.0-SNAPSHOT-bin-20210623-7f937730ff/examples/src/main/java/org/apache/spark/examples/ml/JavaElementwiseProductExample.java
spark-3.2.0-SNAPSHOT-bin-20210623-7f937730ff/examples/src/main/java/org/apache/spark/examples/ml/JavaIndexToStringExample.java
spark-3.2.0-SNAPSHOT-bin-20210623-7f937730ff/examples/src/main/java/org/apache/spark/examples/ml/JavaLogisticRegressionWithElasticNetExample.java
spark-3.2.0-SNAPSHOT-bin-20210623-7f937730ff/examples/src/main/java/org/apache/spark/examples/ml/JavaFPGrowthExample.java
spark-3.2.0-SNAPSHOT-bin-20210623-7f937730ff/examples/src/main/java/org/apache/spark/examples/ml/JavaSummarizerExample.java
spark-3.2.0-SNAPSHOT-bin-20210623-7f937730ff/examples/src/main/java/org/apache/spark/examples/ml/JavaBisectingKMeansExample.java
spark-3.2.0-SNAPSHOT-bin-20210623-7f937730ff/examples/src/main/java/org/apache/spark/examples/JavaSparkPi.java
spark-3.2.0-SNAPSHOT-bin-20210623-7f937730ff/examples/src/main/java/org/apache/spark/examples/JavaStatusTrackerDemo.java
spark-3.2.0-SNAPSHOT-bin-20210623-7f937730ff/examples/src/main/java/org/apache/spark/examples/mllib/
spark-3.2.0-SNAPSHOT-bin-20210623-7f937730ff/examples/src/main/java/org/apache/spark/examples/mllib/JavaGaussianMixtureExample.java
spark-3.2.0-SNAPSHOT-bin-20210623-7f937730ff/examples/src/main/java/org/apache/spark/examples/mllib/JavaMultiLabelClassificationMetricsExample.java
spark-3.2.0-SNAPSHOT-bin-20210623-7f937730ff/examples/src/main/java/org/apache/spark/examples/mllib/JavaHypothesisTestingExample.java
spark-3.2.0-SNAPSHOT-bin-20210623-7f937730ff/examples/src/main/java/org/apache/spark/examples/mllib/JavaAssociationRulesExample.java
spark-3.2.0-SNAPSHOT-bin-20210623-7f937730ff/examples/src/main/java/org/apache/spark/examples/mllib/JavaPrefixSpanExample.java
spark-3.2.0-SNAPSHOT-bin-20210623-7f937730ff/examples/src/main/java/org/apache/spark/examples/mllib/JavaStreamingTestExample.java
spark-3.2.0-SNAPSHOT-bin-20210623-7f937730ff/examples/src/main/java/org/apache/spark/examples/mllib/JavaRandomForestRegressionExample.java
spark-3.2.0-SNAPSHOT-bin-20210623-7f937730ff/examples/src/main/java/org/apache/spark/examples/mllib/JavaCorrelationsExample.java
spark-3.2.0-SNAPSHOT-bin-20210623-7f937730ff/examples/src/main/java/org/apache/spark/examples/mllib/JavaMulticlassClassificationMetricsExample.java
spark-3.2.0-SNAPSHOT-bin-20210623-7f937730ff/examples/src/main/java/org/apache/spark/examples/mllib/JavaSummaryStatisticsExample.java
spark-3.2.0-SNAPSHOT-bin-20210623-7f937730ff/examples/src/main/java/org/apache/spark/examples/mllib/JavaLatentDirichletAllocationExample.java
spark-3.2.0-SNAPSHOT-bin-20210623-7f937730ff/examples/src/main/java/org/apache/spark/examples/mllib/JavaBisectingKMeansExample.java
spark-3.2.0-SNAPSHOT-bin-20210623-7f937730ff/examples/src/main/java/org/apache/spark/examples/mllib/JavaGradientBoostingClassificationExample.java
spark-3.2.0-SNAPSHOT-bin-20210623-7f937730ff/examples/src/main/java/org/apache/spark/examples/mllib/JavaIsotonicRegressionExample.java
spark-3.2.0-SNAPSHOT-bin-20210623-7f937730ff/examples/src/main/java/org/apache/spark/examples/mllib/JavaSVDExample.java
spark-3.2.0-SNAPSHOT-bin-20210623-7f937730ff/examples/src/main/java/org/apache/spark/examples/mllib/JavaSVMWithSGDExample.java
spark-3.2.0-SNAPSHOT-bin-20210623-7f937730ff/examples/src/main/java/org/apache/spark/examples/mllib/JavaStratifiedSamplingExample.java
spark-3.2.0-SNAPSHOT-bin-20210623-7f937730ff/examples/src/main/java/org/apache/spark/examples/mllib/JavaRandomForestClassificationExample.java
spark-3.2.0-SNAPSHOT-bin-20210623-7f937730ff/examples/src/main/java/org/apache/spark/examples/mllib/JavaALS.java
spark-3.2.0-SNAPSHOT-bin-20210623-7f937730ff/examples/src/main/java/org/apache/spark/examples/mllib/JavaBinaryClassificationMetricsExample.java
spark-3.2.0-SNAPSHOT-bin-20210623-7f937730ff/examples/src/main/java/org/apache/spark/examples/mllib/JavaRecommendationExample.java
spark-3.2.0-SNAPSHOT-bin-20210623-7f937730ff/examples/src/main/java/org/apache/spark/examples/mllib/JavaPowerIterationClusteringExample.java
spark-3.2.0-SNAPSHOT-bin-20210623-7f937730ff/examples/src/main/java/org/apache/spark/examples/mllib/JavaDecisionTreeRegressionExample.java
spark-3.2.0-SNAPSHOT-bin-20210623-7f937730ff/examples/src/main/java/org/apache/spark/examples/mllib/JavaKMeansExample.java
spark-3.2.0-SNAPSHOT-bin-20210623-7f937730ff/examples/src/main/java/org/apache/spark/examples/mllib/JavaKernelDensityEstimationExample.java
spark-3.2.0-SNAPSHOT-bin-20210623-7f937730ff/examples/src/main/java/org/apache/spark/examples/mllib/JavaLBFGSExample.java
spark-3.2.0-SNAPSHOT-bin-20210623-7f937730ff/examples/src/main/java/org/apache/spark/examples/mllib/JavaGradientBoostingRegressionExample.java
spark-3.2.0-SNAPSHOT-bin-20210623-7f937730ff/examples/src/main/java/org/apache/spark/examples/mllib/JavaPCAExample.java
spark-3.2.0-SNAPSHOT-bin-20210623-7f937730ff/examples/src/main/java/org/apache/spark/examples/mllib/JavaHypothesisTestingKolmogorovSmirnovTestExample.java
spark-3.2.0-SNAPSHOT-bin-20210623-7f937730ff/examples/src/main/java/org/apache/spark/examples/mllib/JavaElementwiseProductExample.java
spark-3.2.0-SNAPSHOT-bin-20210623-7f937730ff/examples/src/main/java/org/apache/spark/examples/mllib/JavaNaiveBayesExample.java
spark-3.2.0-SNAPSHOT-bin-20210623-7f937730ff/examples/src/main/java/org/apache/spark/examples/mllib/JavaLogisticRegressionWithLBFGSExample.java
spark-3.2.0-SNAPSHOT-bin-20210623-7f937730ff/examples/src/main/java/org/apache/spark/examples/mllib/JavaChiSqSelectorExample.java
spark-3.2.0-SNAPSHOT-bin-20210623-7f937730ff/examples/src/main/java/org/apache/spark/examples/mllib/JavaDecisionTreeClassificationExample.java
spark-3.2.0-SNAPSHOT-bin-20210623-7f937730ff/examples/src/main/java/org/apache/spark/examples/mllib/JavaSimpleFPGrowth.java
spark-3.2.0-SNAPSHOT-bin-20210623-7f937730ff/examples/src/main/java/org/apache/spark/examples/mllib/JavaRankingMetricsExample.java
spark-3.2.0-SNAPSHOT-bin-20210623-7f937730ff/examples/src/main/python/
spark-3.2.0-SNAPSHOT-bin-20210623-7f937730ff/examples/src/main/python/als.py
spark-3.2.0-SNAPSHOT-bin-20210623-7f937730ff/examples/src/main/python/pagerank.py
spark-3.2.0-SNAPSHOT-bin-20210623-7f937730ff/examples/src/main/python/status_api_demo.py
spark-3.2.0-SNAPSHOT-bin-20210623-7f937730ff/examples/src/main/python/wordcount.py
spark-3.2.0-SNAPSHOT-bin-20210623-7f937730ff/examples/src/main/python/kmeans.py
spark-3.2.0-SNAPSHOT-bin-20210623-7f937730ff/examples/src/main/python/mllib/
spark-3.2.0-SNAPSHOT-bin-20210623-7f937730ff/examples/src/main/python/mllib/naive_bayes_example.py
spark-3.2.0-SNAPSHOT-bin-20210623-7f937730ff/examples/src/main/python/mllib/svd_example.py
spark-3.2.0-SNAPSHOT-bin-20210623-7f937730ff/examples/src/main/python/mllib/normalizer_example.py
spark-3.2.0-SNAPSHOT-bin-20210623-7f937730ff/examples/src/main/python/mllib/kernel_density_estimation_example.py
spark-3.2.0-SNAPSHOT-bin-20210623-7f937730ff/examples/src/main/python/mllib/sampled_rdds.py
spark-3.2.0-SNAPSHOT-bin-20210623-7f937730ff/examples/src/main/python/mllib/streaming_linear_regression_example.py
spark-3.2.0-SNAPSHOT-bin-20210623-7f937730ff/examples/src/main/python/mllib/linear_regression_with_sgd_example.py
spark-3.2.0-SNAPSHOT-bin-20210623-7f937730ff/examples/src/main/python/mllib/random_rdd_generation.py
spark-3.2.0-SNAPSHOT-bin-20210623-7f937730ff/examples/src/main/python/mllib/correlations_example.py
spark-3.2.0-SNAPSHOT-bin-20210623-7f937730ff/examples/src/main/python/mllib/random_forest_classification_example.py
spark-3.2.0-SNAPSHOT-bin-20210623-7f937730ff/examples/src/main/python/mllib/binary_classification_metrics_example.py
spark-3.2.0-SNAPSHOT-bin-20210623-7f937730ff/examples/src/main/python/mllib/multi_class_metrics_example.py
spark-3.2.0-SNAPSHOT-bin-20210623-7f937730ff/examples/src/main/python/mllib/multi_label_metrics_example.py
spark-3.2.0-SNAPSHOT-bin-20210623-7f937730ff/examples/src/main/python/mllib/power_iteration_clustering_example.py
spark-3.2.0-SNAPSHOT-bin-20210623-7f937730ff/examples/src/main/python/mllib/bisecting_k_means_example.py
spark-3.2.0-SNAPSHOT-bin-20210623-7f937730ff/examples/src/main/python/mllib/word2vec_example.py
spark-3.2.0-SNAPSHOT-bin-20210623-7f937730ff/examples/src/main/python/mllib/gradient_boosting_regression_example.py
spark-3.2.0-SNAPSHOT-bin-20210623-7f937730ff/examples/src/main/python/mllib/tf_idf_example.py
spark-3.2.0-SNAPSHOT-bin-20210623-7f937730ff/examples/src/main/python/mllib/hypothesis_testing_kolmogorov_smirnov_test_example.py
spark-3.2.0-SNAPSHOT-bin-20210623-7f937730ff/examples/src/main/python/mllib/k_means_example.py
spark-3.2.0-SNAPSHOT-bin-20210623-7f937730ff/examples/src/main/python/mllib/elementwise_product_example.py
spark-3.2.0-SNAPSHOT-bin-20210623-7f937730ff/examples/src/main/python/mllib/word2vec.py
spark-3.2.0-SNAPSHOT-bin-20210623-7f937730ff/examples/src/main/python/mllib/standard_scaler_example.py
spark-3.2.0-SNAPSHOT-bin-20210623-7f937730ff/examples/src/main/python/mllib/ranking_metrics_example.py
spark-3.2.0-SNAPSHOT-bin-20210623-7f937730ff/examples/src/main/python/mllib/summary_statistics_example.py
spark-3.2.0-SNAPSHOT-bin-20210623-7f937730ff/examples/src/main/python/mllib/decision_tree_classification_example.py
spark-3.2.0-SNAPSHOT-bin-20210623-7f937730ff/examples/src/main/python/mllib/random_forest_regression_example.py
spark-3.2.0-SNAPSHOT-bin-20210623-7f937730ff/examples/src/main/python/mllib/regression_metrics_example.py
spark-3.2.0-SNAPSHOT-bin-20210623-7f937730ff/examples/src/main/python/mllib/fpgrowth_example.py
spark-3.2.0-SNAPSHOT-bin-20210623-7f937730ff/examples/src/main/python/mllib/kmeans.py
spark-3.2.0-SNAPSHOT-bin-20210623-7f937730ff/examples/src/main/python/mllib/latent_dirichlet_allocation_example.py
spark-3.2.0-SNAPSHOT-bin-20210623-7f937730ff/examples/src/main/python/mllib/correlations.py
spark-3.2.0-SNAPSHOT-bin-20210623-7f937730ff/examples/src/main/python/mllib/gaussian_mixture_model.py
spark-3.2.0-SNAPSHOT-bin-20210623-7f937730ff/examples/src/main/python/mllib/gaussian_mixture_example.py
spark-3.2.0-SNAPSHOT-bin-20210623-7f937730ff/examples/src/main/python/mllib/decision_tree_regression_example.py
spark-3.2.0-SNAPSHOT-bin-20210623-7f937730ff/examples/src/main/python/mllib/stratified_sampling_example.py
spark-3.2.0-SNAPSHOT-bin-20210623-7f937730ff/examples/src/main/python/mllib/logistic_regression_with_lbfgs_example.py
spark-3.2.0-SNAPSHOT-bin-20210623-7f937730ff/examples/src/main/python/mllib/streaming_k_means_example.py
spark-3.2.0-SNAPSHOT-bin-20210623-7f937730ff/examples/src/main/python/mllib/recommendation_example.py
spark-3.2.0-SNAPSHOT-bin-20210623-7f937730ff/examples/src/main/python/mllib/isotonic_regression_example.py
spark-3.2.0-SNAPSHOT-bin-20210623-7f937730ff/examples/src/main/python/mllib/logistic_regression.py
spark-3.2.0-SNAPSHOT-bin-20210623-7f937730ff/examples/src/main/python/mllib/svm_with_sgd_example.py
spark-3.2.0-SNAPSHOT-bin-20210623-7f937730ff/examples/src/main/python/mllib/gradient_boosting_classification_example.py
spark-3.2.0-SNAPSHOT-bin-20210623-7f937730ff/examples/src/main/python/mllib/hypothesis_testing_example.py
spark-3.2.0-SNAPSHOT-bin-20210623-7f937730ff/examples/src/main/python/mllib/pca_rowmatrix_example.py
spark-3.2.0-SNAPSHOT-bin-20210623-7f937730ff/examples/src/main/python/ml/
spark-3.2.0-SNAPSHOT-bin-20210623-7f937730ff/examples/src/main/python/ml/lda_example.py
spark-3.2.0-SNAPSHOT-bin-20210623-7f937730ff/examples/src/main/python/ml/decision_tree_regression_example.py
spark-3.2.0-SNAPSHOT-bin-20210623-7f937730ff/examples/src/main/python/ml/model_selection_random_hyperparameters_example.py
spark-3.2.0-SNAPSHOT-bin-20210623-7f937730ff/examples/src/main/python/ml/generalized_linear_regression_example.py
spark-3.2.0-SNAPSHOT-bin-20210623-7f937730ff/examples/src/main/python/ml/pca_example.py
spark-3.2.0-SNAPSHOT-bin-20210623-7f937730ff/examples/src/main/python/ml/max_abs_scaler_example.py
spark-3.2.0-SNAPSHOT-bin-20210623-7f937730ff/examples/src/main/python/ml/min_hash_lsh_example.py
spark-3.2.0-SNAPSHOT-bin-20210623-7f937730ff/examples/src/main/python/ml/pipeline_example.py
spark-3.2.0-SNAPSHOT-bin-20210623-7f937730ff/examples/src/main/python/ml/gaussian_mixture_example.py
spark-3.2.0-SNAPSHOT-bin-20210623-7f937730ff/examples/src/main/python/ml/onehot_encoder_example.py
spark-3.2.0-SNAPSHOT-bin-20210623-7f937730ff/examples/src/main/python/ml/random_forest_regressor_example.py
spark-3.2.0-SNAPSHOT-bin-20210623-7f937730ff/examples/src/main/python/ml/count_vectorizer_example.py
spark-3.2.0-SNAPSHOT-bin-20210623-7f937730ff/examples/src/main/python/ml/fpgrowth_example.py
spark-3.2.0-SNAPSHOT-bin-20210623-7f937730ff/examples/src/main/python/ml/polynomial_expansion_example.py
spark-3.2.0-SNAPSHOT-bin-20210623-7f937730ff/examples/src/main/python/ml/bucketed_random_projection_lsh_example.py
spark-3.2.0-SNAPSHOT-bin-20210623-7f937730ff/examples/src/main/python/ml/n_gram_example.py
spark-3.2.0-SNAPSHOT-bin-20210623-7f937730ff/examples/src/main/python/ml/bucketizer_example.py
spark-3.2.0-SNAPSHOT-bin-20210623-7f937730ff/examples/src/main/python/ml/decision_tree_classification_example.py
spark-3.2.0-SNAPSHOT-bin-20210623-7f937730ff/examples/src/main/python/ml/als_example.py
spark-3.2.0-SNAPSHOT-bin-20210623-7f937730ff/examples/src/main/python/ml/vector_assembler_example.py
spark-3.2.0-SNAPSHOT-bin-20210623-7f937730ff/examples/src/main/python/ml/correlation_example.py
spark-3.2.0-SNAPSHOT-bin-20210623-7f937730ff/examples/src/main/python/ml/dct_example.py
spark-3.2.0-SNAPSHOT-bin-20210623-7f937730ff/examples/src/main/python/ml/linear_regression_with_elastic_net.py
spark-3.2.0-SNAPSHOT-bin-20210623-7f937730ff/examples/src/main/python/ml/train_validation_split.py
spark-3.2.0-SNAPSHOT-bin-20210623-7f937730ff/examples/src/main/python/ml/one_vs_rest_example.py
spark-3.2.0-SNAPSHOT-bin-20210623-7f937730ff/examples/src/main/python/ml/elementwise_product_example.py
spark-3.2.0-SNAPSHOT-bin-20210623-7f937730ff/examples/src/main/python/ml/multilayer_perceptron_classification.py
spark-3.2.0-SNAPSHOT-bin-20210623-7f937730ff/examples/src/main/python/ml/tokenizer_example.py
spark-3.2.0-SNAPSHOT-bin-20210623-7f937730ff/examples/src/main/python/ml/vector_indexer_example.py
spark-3.2.0-SNAPSHOT-bin-20210623-7f937730ff/examples/src/main/python/ml/normalizer_example.py
spark-3.2.0-SNAPSHOT-bin-20210623-7f937730ff/examples/src/main/python/ml/min_max_scaler_example.py
spark-3.2.0-SNAPSHOT-bin-20210623-7f937730ff/examples/src/main/python/ml/binarizer_example.py
spark-3.2.0-SNAPSHOT-bin-20210623-7f937730ff/examples/src/main/python/ml/word2vec_example.py
spark-3.2.0-SNAPSHOT-bin-20210623-7f937730ff/examples/src/main/python/ml/chi_square_test_example.py
spark-3.2.0-SNAPSHOT-bin-20210623-7f937730ff/examples/src/main/python/ml/sql_transformer.py
spark-3.2.0-SNAPSHOT-bin-20210623-7f937730ff/examples/src/main/python/ml/stopwords_remover_example.py
spark-3.2.0-SNAPSHOT-bin-20210623-7f937730ff/examples/src/main/python/ml/linearsvc.py
spark-3.2.0-SNAPSHOT-bin-20210623-7f937730ff/examples/src/main/python/ml/logistic_regression_summary_example.py
spark-3.2.0-SNAPSHOT-bin-20210623-7f937730ff/examples/src/main/python/ml/fm_classifier_example.py
spark-3.2.0-SNAPSHOT-bin-20210623-7f937730ff/examples/src/main/python/ml/imputer_example.py
spark-3.2.0-SNAPSHOT-bin-20210623-7f937730ff/examples/src/main/python/ml/bisecting_k_means_example.py
spark-3.2.0-SNAPSHOT-bin-20210623-7f937730ff/examples/src/main/python/ml/gradient_boosted_tree_classifier_example.py
spark-3.2.0-SNAPSHOT-bin-20210623-7f937730ff/examples/src/main/python/ml/chisq_selector_example.py
spark-3.2.0-SNAPSHOT-bin-20210623-7f937730ff/examples/src/main/python/ml/fm_regressor_example.py
spark-3.2.0-SNAPSHOT-bin-20210623-7f937730ff/examples/src/main/python/ml/estimator_transformer_param_example.py
spark-3.2.0-SNAPSHOT-bin-20210623-7f937730ff/examples/src/main/python/ml/robust_scaler_example.py
spark-3.2.0-SNAPSHOT-bin-20210623-7f937730ff/examples/src/main/python/ml/interaction_example.py
spark-3.2.0-SNAPSHOT-bin-20210623-7f937730ff/examples/src/main/python/ml/power_iteration_clustering_example.py
spark-3.2.0-SNAPSHOT-bin-20210623-7f937730ff/examples/src/main/python/ml/quantile_discretizer_example.py
spark-3.2.0-SNAPSHOT-bin-20210623-7f937730ff/examples/src/main/python/ml/logistic_regression_with_elastic_net.py
spark-3.2.0-SNAPSHOT-bin-20210623-7f937730ff/examples/src/main/python/ml/vector_size_hint_example.py
spark-3.2.0-SNAPSHOT-bin-20210623-7f937730ff/examples/src/main/python/ml/random_forest_classifier_example.py
spark-3.2.0-SNAPSHOT-bin-20210623-7f937730ff/examples/src/main/python/ml/index_to_string_example.py
spark-3.2.0-SNAPSHOT-bin-20210623-7f937730ff/examples/src/main/python/ml/kmeans_example.py
spark-3.2.0-SNAPSHOT-bin-20210623-7f937730ff/examples/src/main/python/ml/feature_hasher_example.py
spark-3.2.0-SNAPSHOT-bin-20210623-7f937730ff/examples/src/main/python/ml/multiclass_logistic_regression_with_elastic_net.py
spark-3.2.0-SNAPSHOT-bin-20210623-7f937730ff/examples/src/main/python/ml/rformula_example.py
spark-3.2.0-SNAPSHOT-bin-20210623-7f937730ff/examples/src/main/python/ml/prefixspan_example.py
spark-3.2.0-SNAPSHOT-bin-20210623-7f937730ff/examples/src/main/python/ml/cross_validator.py
spark-3.2.0-SNAPSHOT-bin-20210623-7f937730ff/examples/src/main/python/ml/gradient_boosted_tree_regressor_example.py
spark-3.2.0-SNAPSHOT-bin-20210623-7f937730ff/examples/src/main/python/ml/isotonic_regression_example.py
spark-3.2.0-SNAPSHOT-bin-20210623-7f937730ff/examples/src/main/python/ml/aft_survival_regression.py
spark-3.2.0-SNAPSHOT-bin-20210623-7f937730ff/examples/src/main/python/ml/summarizer_example.py
spark-3.2.0-SNAPSHOT-bin-20210623-7f937730ff/examples/src/main/python/ml/tf_idf_example.py
spark-3.2.0-SNAPSHOT-bin-20210623-7f937730ff/examples/src/main/python/ml/string_indexer_example.py
spark-3.2.0-SNAPSHOT-bin-20210623-7f937730ff/examples/src/main/python/ml/dataframe_example.py
spark-3.2.0-SNAPSHOT-bin-20210623-7f937730ff/examples/src/main/python/ml/naive_bayes_example.py
spark-3.2.0-SNAPSHOT-bin-20210623-7f937730ff/examples/src/main/python/ml/variance_threshold_selector_example.py
spark-3.2.0-SNAPSHOT-bin-20210623-7f937730ff/examples/src/main/python/ml/univariate_feature_selector_example.py
spark-3.2.0-SNAPSHOT-bin-20210623-7f937730ff/examples/src/main/python/ml/standard_scaler_example.py
spark-3.2.0-SNAPSHOT-bin-20210623-7f937730ff/examples/src/main/python/ml/vector_slicer_example.py
spark-3.2.0-SNAPSHOT-bin-20210623-7f937730ff/examples/src/main/python/logistic_regression.py
spark-3.2.0-SNAPSHOT-bin-20210623-7f937730ff/examples/src/main/python/parquet_inputformat.py
spark-3.2.0-SNAPSHOT-bin-20210623-7f937730ff/examples/src/main/python/sort.py
spark-3.2.0-SNAPSHOT-bin-20210623-7f937730ff/examples/src/main/python/avro_inputformat.py
spark-3.2.0-SNAPSHOT-bin-20210623-7f937730ff/examples/src/main/python/pi.py
spark-3.2.0-SNAPSHOT-bin-20210623-7f937730ff/examples/src/main/python/sql/
spark-3.2.0-SNAPSHOT-bin-20210623-7f937730ff/examples/src/main/python/sql/streaming/
spark-3.2.0-SNAPSHOT-bin-20210623-7f937730ff/examples/src/main/python/sql/streaming/structured_network_wordcount_windowed.py
spark-3.2.0-SNAPSHOT-bin-20210623-7f937730ff/examples/src/main/python/sql/streaming/structured_kafka_wordcount.py
spark-3.2.0-SNAPSHOT-bin-20210623-7f937730ff/examples/src/main/python/sql/streaming/structured_network_wordcount.py
spark-3.2.0-SNAPSHOT-bin-20210623-7f937730ff/examples/src/main/python/sql/datasource.py
spark-3.2.0-SNAPSHOT-bin-20210623-7f937730ff/examples/src/main/python/sql/hive.py
spark-3.2.0-SNAPSHOT-bin-20210623-7f937730ff/examples/src/main/python/sql/basic.py
spark-3.2.0-SNAPSHOT-bin-20210623-7f937730ff/examples/src/main/python/sql/arrow.py
spark-3.2.0-SNAPSHOT-bin-20210623-7f937730ff/examples/src/main/python/streaming/
spark-3.2.0-SNAPSHOT-bin-20210623-7f937730ff/examples/src/main/python/streaming/stateful_network_wordcount.py
spark-3.2.0-SNAPSHOT-bin-20210623-7f937730ff/examples/src/main/python/streaming/sql_network_wordcount.py
spark-3.2.0-SNAPSHOT-bin-20210623-7f937730ff/examples/src/main/python/streaming/recoverable_network_wordcount.py
spark-3.2.0-SNAPSHOT-bin-20210623-7f937730ff/examples/src/main/python/streaming/queue_stream.py
spark-3.2.0-SNAPSHOT-bin-20210623-7f937730ff/examples/src/main/python/streaming/network_wordcount.py
spark-3.2.0-SNAPSHOT-bin-20210623-7f937730ff/examples/src/main/python/streaming/network_wordjoinsentiments.py
spark-3.2.0-SNAPSHOT-bin-20210623-7f937730ff/examples/src/main/python/streaming/hdfs_wordcount.py
spark-3.2.0-SNAPSHOT-bin-20210623-7f937730ff/examples/src/main/python/transitive_closure.py
spark-3.2.0-SNAPSHOT-bin-20210623-7f937730ff/examples/src/main/scripts/
spark-3.2.0-SNAPSHOT-bin-20210623-7f937730ff/examples/src/main/scripts/getGpusResources.sh
spark-3.2.0-SNAPSHOT-bin-20210623-7f937730ff/examples/src/main/r/
spark-3.2.0-SNAPSHOT-bin-20210623-7f937730ff/examples/src/main/r/streaming/
spark-3.2.0-SNAPSHOT-bin-20210623-7f937730ff/examples/src/main/r/streaming/structured_network_wordcount.R
spark-3.2.0-SNAPSHOT-bin-20210623-7f937730ff/examples/src/main/r/data-manipulation.R
spark-3.2.0-SNAPSHOT-bin-20210623-7f937730ff/examples/src/main/r/dataframe.R
spark-3.2.0-SNAPSHOT-bin-20210623-7f937730ff/examples/src/main/r/RSparkSQLExample.R
spark-3.2.0-SNAPSHOT-bin-20210623-7f937730ff/examples/src/main/r/ml/
spark-3.2.0-SNAPSHOT-bin-20210623-7f937730ff/examples/src/main/r/ml/decisionTree.R
spark-3.2.0-SNAPSHOT-bin-20210623-7f937730ff/examples/src/main/r/ml/fmRegressor.R
spark-3.2.0-SNAPSHOT-bin-20210623-7f937730ff/examples/src/main/r/ml/kmeans.R
spark-3.2.0-SNAPSHOT-bin-20210623-7f937730ff/examples/src/main/r/ml/fmClassifier.R
spark-3.2.0-SNAPSHOT-bin-20210623-7f937730ff/examples/src/main/r/ml/als.R
spark-3.2.0-SNAPSHOT-bin-20210623-7f937730ff/examples/src/main/r/ml/randomForest.R
spark-3.2.0-SNAPSHOT-bin-20210623-7f937730ff/examples/src/main/r/ml/naiveBayes.R
spark-3.2.0-SNAPSHOT-bin-20210623-7f937730ff/examples/src/main/r/ml/glm.R
spark-3.2.0-SNAPSHOT-bin-20210623-7f937730ff/examples/src/main/r/ml/powerIterationClustering.R
spark-3.2.0-SNAPSHOT-bin-20210623-7f937730ff/examples/src/main/r/ml/kstest.R
spark-3.2.0-SNAPSHOT-bin-20210623-7f937730ff/examples/src/main/r/ml/logit.R
spark-3.2.0-SNAPSHOT-bin-20210623-7f937730ff/examples/src/main/r/ml/gbt.R
spark-3.2.0-SNAPSHOT-bin-20210623-7f937730ff/examples/src/main/r/ml/isoreg.R
spark-3.2.0-SNAPSHOT-bin-20210623-7f937730ff/examples/src/main/r/ml/lda.R
spark-3.2.0-SNAPSHOT-bin-20210623-7f937730ff/examples/src/main/r/ml/bisectingKmeans.R
spark-3.2.0-SNAPSHOT-bin-20210623-7f937730ff/examples/src/main/r/ml/survreg.R
spark-3.2.0-SNAPSHOT-bin-20210623-7f937730ff/examples/src/main/r/ml/svmLinear.R
spark-3.2.0-SNAPSHOT-bin-20210623-7f937730ff/examples/src/main/r/ml/prefixSpan.R
spark-3.2.0-SNAPSHOT-bin-20210623-7f937730ff/examples/src/main/r/ml/ml.R
spark-3.2.0-SNAPSHOT-bin-20210623-7f937730ff/examples/src/main/r/ml/mlp.R
spark-3.2.0-SNAPSHOT-bin-20210623-7f937730ff/examples/src/main/r/ml/lm_with_elastic_net.R
spark-3.2.0-SNAPSHOT-bin-20210623-7f937730ff/examples/src/main/r/ml/fpm.R
spark-3.2.0-SNAPSHOT-bin-20210623-7f937730ff/examples/src/main/r/ml/gaussianMixture.R
spark-3.2.0-SNAPSHOT-bin-20210623-7f937730ff/LICENSE
spark-3.2.0-SNAPSHOT-bin-20210623-7f937730ff/python/
spark-3.2.0-SNAPSHOT-bin-20210623-7f937730ff/python/.gitignore
spark-3.2.0-SNAPSHOT-bin-20210623-7f937730ff/python/test_coverage/
spark-3.2.0-SNAPSHOT-bin-20210623-7f937730ff/python/test_coverage/conf/
spark-3.2.0-SNAPSHOT-bin-20210623-7f937730ff/python/test_coverage/conf/spark-defaults.conf
spark-3.2.0-SNAPSHOT-bin-20210623-7f937730ff/python/test_coverage/coverage_daemon.py
spark-3.2.0-SNAPSHOT-bin-20210623-7f937730ff/python/test_coverage/sitecustomize.py
spark-3.2.0-SNAPSHOT-bin-20210623-7f937730ff/python/README.md
spark-3.2.0-SNAPSHOT-bin-20210623-7f937730ff/python/test_support/
spark-3.2.0-SNAPSHOT-bin-20210623-7f937730ff/python/test_support/userlib-0.1.zip
spark-3.2.0-SNAPSHOT-bin-20210623-7f937730ff/python/test_support/sql/
spark-3.2.0-SNAPSHOT-bin-20210623-7f937730ff/python/test_support/sql/ages_newlines.csv
spark-3.2.0-SNAPSHOT-bin-20210623-7f937730ff/python/test_support/sql/people_array_utf16le.json
spark-3.2.0-SNAPSHOT-bin-20210623-7f937730ff/python/test_support/sql/ages.csv
spark-3.2.0-SNAPSHOT-bin-20210623-7f937730ff/python/test_support/sql/people_array.json
spark-3.2.0-SNAPSHOT-bin-20210623-7f937730ff/python/test_support/sql/parquet_partitioned/
spark-3.2.0-SNAPSHOT-bin-20210623-7f937730ff/python/test_support/sql/parquet_partitioned/_SUCCESS
spark-3.2.0-SNAPSHOT-bin-20210623-7f937730ff/python/test_support/sql/parquet_partitioned/year=2014/
spark-3.2.0-SNAPSHOT-bin-20210623-7f937730ff/python/test_support/sql/parquet_partitioned/year=2014/month=9/
spark-3.2.0-SNAPSHOT-bin-20210623-7f937730ff/python/test_support/sql/parquet_partitioned/year=2014/month=9/day=1/
spark-3.2.0-SNAPSHOT-bin-20210623-7f937730ff/python/test_support/sql/parquet_partitioned/year=2014/month=9/day=1/part-r-00008.gz.parquet
spark-3.2.0-SNAPSHOT-bin-20210623-7f937730ff/python/test_support/sql/parquet_partitioned/year=2014/month=9/day=1/.part-r-00008.gz.parquet.crc
spark-3.2.0-SNAPSHOT-bin-20210623-7f937730ff/python/test_support/sql/parquet_partitioned/_common_metadata
spark-3.2.0-SNAPSHOT-bin-20210623-7f937730ff/python/test_support/sql/parquet_partitioned/_metadata
spark-3.2.0-SNAPSHOT-bin-20210623-7f937730ff/python/test_support/sql/parquet_partitioned/year=2015/
spark-3.2.0-SNAPSHOT-bin-20210623-7f937730ff/python/test_support/sql/parquet_partitioned/year=2015/month=9/
spark-3.2.0-SNAPSHOT-bin-20210623-7f937730ff/python/test_support/sql/parquet_partitioned/year=2015/month=9/day=1/
spark-3.2.0-SNAPSHOT-bin-20210623-7f937730ff/python/test_support/sql/parquet_partitioned/year=2015/month=9/day=1/.part-r-00007.gz.parquet.crc
spark-3.2.0-SNAPSHOT-bin-20210623-7f937730ff/python/test_support/sql/parquet_partitioned/year=2015/month=9/day=1/part-r-00007.gz.parquet
spark-3.2.0-SNAPSHOT-bin-20210623-7f937730ff/python/test_support/sql/parquet_partitioned/year=2015/month=10/
spark-3.2.0-SNAPSHOT-bin-20210623-7f937730ff/python/test_support/sql/parquet_partitioned/year=2015/month=10/day=26/
spark-3.2.0-SNAPSHOT-bin-20210623-7f937730ff/python/test_support/sql/parquet_partitioned/year=2015/month=10/day=26/part-r-00005.gz.parquet
spark-3.2.0-SNAPSHOT-bin-20210623-7f937730ff/python/test_support/sql/parquet_partitioned/year=2015/month=10/day=26/.part-r-00005.gz.parquet.crc
spark-3.2.0-SNAPSHOT-bin-20210623-7f937730ff/python/test_support/sql/parquet_partitioned/year=2015/month=10/day=25/
spark-3.2.0-SNAPSHOT-bin-20210623-7f937730ff/python/test_support/sql/parquet_partitioned/year=2015/month=10/day=25/.part-r-00002.gz.parquet.crc
spark-3.2.0-SNAPSHOT-bin-20210623-7f937730ff/python/test_support/sql/parquet_partitioned/year=2015/month=10/day=25/part-r-00002.gz.parquet
spark-3.2.0-SNAPSHOT-bin-20210623-7f937730ff/python/test_support/sql/parquet_partitioned/year=2015/month=10/day=25/part-r-00004.gz.parquet
spark-3.2.0-SNAPSHOT-bin-20210623-7f937730ff/python/test_support/sql/parquet_partitioned/year=2015/month=10/day=25/.part-r-00004.gz.parquet.crc
spark-3.2.0-SNAPSHOT-bin-20210623-7f937730ff/python/test_support/sql/people1.json
spark-3.2.0-SNAPSHOT-bin-20210623-7f937730ff/python/test_support/sql/people.json
spark-3.2.0-SNAPSHOT-bin-20210623-7f937730ff/python/test_support/sql/streaming/
spark-3.2.0-SNAPSHOT-bin-20210623-7f937730ff/python/test_support/sql/streaming/text-test.txt
spark-3.2.0-SNAPSHOT-bin-20210623-7f937730ff/python/test_support/sql/text-test.txt
spark-3.2.0-SNAPSHOT-bin-20210623-7f937730ff/python/test_support/sql/orc_partitioned/
spark-3.2.0-SNAPSHOT-bin-20210623-7f937730ff/python/test_support/sql/orc_partitioned/_SUCCESS
spark-3.2.0-SNAPSHOT-bin-20210623-7f937730ff/python/test_support/sql/orc_partitioned/b=0/
spark-3.2.0-SNAPSHOT-bin-20210623-7f937730ff/python/test_support/sql/orc_partitioned/b=0/c=0/
spark-3.2.0-SNAPSHOT-bin-20210623-7f937730ff/python/test_support/sql/orc_partitioned/b=0/c=0/part-r-00000-829af031-b970-49d6-ad39-30460a0be2c8.orc
spark-3.2.0-SNAPSHOT-bin-20210623-7f937730ff/python/test_support/sql/orc_partitioned/b=0/c=0/.part-r-00000-829af031-b970-49d6-ad39-30460a0be2c8.orc.crc
spark-3.2.0-SNAPSHOT-bin-20210623-7f937730ff/python/test_support/sql/orc_partitioned/b=1/
spark-3.2.0-SNAPSHOT-bin-20210623-7f937730ff/python/test_support/sql/orc_partitioned/b=1/c=1/
spark-3.2.0-SNAPSHOT-bin-20210623-7f937730ff/python/test_support/sql/orc_partitioned/b=1/c=1/part-r-00000-829af031-b970-49d6-ad39-30460a0be2c8.orc
spark-3.2.0-SNAPSHOT-bin-20210623-7f937730ff/python/test_support/sql/orc_partitioned/b=1/c=1/.part-r-00000-829af031-b970-49d6-ad39-30460a0be2c8.orc.crc
spark-3.2.0-SNAPSHOT-bin-20210623-7f937730ff/python/test_support/userlibrary.py
spark-3.2.0-SNAPSHOT-bin-20210623-7f937730ff/python/test_support/SimpleHTTPServer.py
spark-3.2.0-SNAPSHOT-bin-20210623-7f937730ff/python/test_support/hello/
spark-3.2.0-SNAPSHOT-bin-20210623-7f937730ff/python/test_support/hello/hello.txt
spark-3.2.0-SNAPSHOT-bin-20210623-7f937730ff/python/test_support/hello/sub_hello/
spark-3.2.0-SNAPSHOT-bin-20210623-7f937730ff/python/test_support/hello/sub_hello/sub_hello.txt
spark-3.2.0-SNAPSHOT-bin-20210623-7f937730ff/python/docs/
spark-3.2.0-SNAPSHOT-bin-20210623-7f937730ff/python/docs/make.bat
spark-3.2.0-SNAPSHOT-bin-20210623-7f937730ff/python/docs/source/
spark-3.2.0-SNAPSHOT-bin-20210623-7f937730ff/python/docs/source/_static/
spark-3.2.0-SNAPSHOT-bin-20210623-7f937730ff/python/docs/source/_static/copybutton.js
spark-3.2.0-SNAPSHOT-bin-20210623-7f937730ff/python/docs/source/_static/css/
spark-3.2.0-SNAPSHOT-bin-20210623-7f937730ff/python/docs/source/_static/css/pyspark.css
spark-3.2.0-SNAPSHOT-bin-20210623-7f937730ff/python/docs/source/migration_guide/
spark-3.2.0-SNAPSHOT-bin-20210623-7f937730ff/python/docs/source/migration_guide/index.rst
spark-3.2.0-SNAPSHOT-bin-20210623-7f937730ff/python/docs/source/migration_guide/pyspark_2.4_to_3.0.rst
spark-3.2.0-SNAPSHOT-bin-20210623-7f937730ff/python/docs/source/migration_guide/pyspark_2.2_to_2.3.rst
spark-3.2.0-SNAPSHOT-bin-20210623-7f937730ff/python/docs/source/migration_guide/pyspark_1.4_to_1.5.rst
spark-3.2.0-SNAPSHOT-bin-20210623-7f937730ff/python/docs/source/migration_guide/pyspark_2.3_to_2.4.rst
spark-3.2.0-SNAPSHOT-bin-20210623-7f937730ff/python/docs/source/migration_guide/pyspark_3.1_to_3.2.rst
spark-3.2.0-SNAPSHOT-bin-20210623-7f937730ff/python/docs/source/migration_guide/pyspark_2.3.0_to_2.3.1_above.rst
spark-3.2.0-SNAPSHOT-bin-20210623-7f937730ff/python/docs/source/migration_guide/pyspark_1.0_1.2_to_1.3.rst
spark-3.2.0-SNAPSHOT-bin-20210623-7f937730ff/python/docs/source/development/
spark-3.2.0-SNAPSHOT-bin-20210623-7f937730ff/python/docs/source/development/setting_ide.rst
spark-3.2.0-SNAPSHOT-bin-20210623-7f937730ff/python/docs/source/development/testing.rst
spark-3.2.0-SNAPSHOT-bin-20210623-7f937730ff/python/docs/source/development/debugging.rst
spark-3.2.0-SNAPSHOT-bin-20210623-7f937730ff/python/docs/source/development/contributing.rst
spark-3.2.0-SNAPSHOT-bin-20210623-7f937730ff/python/docs/source/development/index.rst
spark-3.2.0-SNAPSHOT-bin-20210623-7f937730ff/python/docs/source/index.rst
spark-3.2.0-SNAPSHOT-bin-20210623-7f937730ff/python/docs/source/getting_started/
spark-3.2.0-SNAPSHOT-bin-20210623-7f937730ff/python/docs/source/getting_started/install.rst
spark-3.2.0-SNAPSHOT-bin-20210623-7f937730ff/python/docs/source/getting_started/quickstart.ipynb
spark-3.2.0-SNAPSHOT-bin-20210623-7f937730ff/python/docs/source/getting_started/ps_10mins.ipynb
spark-3.2.0-SNAPSHOT-bin-20210623-7f937730ff/python/docs/source/getting_started/index.rst
spark-3.2.0-SNAPSHOT-bin-20210623-7f937730ff/python/docs/source/user_guide/
spark-3.2.0-SNAPSHOT-bin-20210623-7f937730ff/python/docs/source/user_guide/pandas_on_spark/
spark-3.2.0-SNAPSHOT-bin-20210623-7f937730ff/python/docs/source/user_guide/pandas_on_spark/types.rst
spark-3.2.0-SNAPSHOT-bin-20210623-7f937730ff/python/docs/source/user_guide/pandas_on_spark/from_to_dbms.rst
spark-3.2.0-SNAPSHOT-bin-20210623-7f937730ff/python/docs/source/user_guide/pandas_on_spark/pandas_pyspark.rst
spark-3.2.0-SNAPSHOT-bin-20210623-7f937730ff/python/docs/source/user_guide/pandas_on_spark/options.rst
spark-3.2.0-SNAPSHOT-bin-20210623-7f937730ff/python/docs/source/user_guide/pandas_on_spark/faq.rst
spark-3.2.0-SNAPSHOT-bin-20210623-7f937730ff/python/docs/source/user_guide/pandas_on_spark/best_practices.rst
spark-3.2.0-SNAPSHOT-bin-20210623-7f937730ff/python/docs/source/user_guide/pandas_on_spark/transform_apply.rst
spark-3.2.0-SNAPSHOT-bin-20210623-7f937730ff/python/docs/source/user_guide/pandas_on_spark/typehints.rst
spark-3.2.0-SNAPSHOT-bin-20210623-7f937730ff/python/docs/source/user_guide/pandas_on_spark/index.rst
spark-3.2.0-SNAPSHOT-bin-20210623-7f937730ff/python/docs/source/user_guide/arrow_pandas.rst
spark-3.2.0-SNAPSHOT-bin-20210623-7f937730ff/python/docs/source/user_guide/sql/
spark-3.2.0-SNAPSHOT-bin-20210623-7f937730ff/python/docs/source/user_guide/sql/arrow_pandas.rst
spark-3.2.0-SNAPSHOT-bin-20210623-7f937730ff/python/docs/source/user_guide/sql/index.rst
spark-3.2.0-SNAPSHOT-bin-20210623-7f937730ff/python/docs/source/user_guide/python_packaging.rst
spark-3.2.0-SNAPSHOT-bin-20210623-7f937730ff/python/docs/source/user_guide/index.rst
spark-3.2.0-SNAPSHOT-bin-20210623-7f937730ff/python/docs/source/conf.py
spark-3.2.0-SNAPSHOT-bin-20210623-7f937730ff/python/docs/source/reference/
spark-3.2.0-SNAPSHOT-bin-20210623-7f937730ff/python/docs/source/reference/pyspark.ml.rst
spark-3.2.0-SNAPSHOT-bin-20210623-7f937730ff/python/docs/source/reference/pyspark.streaming.rst
spark-3.2.0-SNAPSHOT-bin-20210623-7f937730ff/python/docs/source/reference/index.rst
spark-3.2.0-SNAPSHOT-bin-20210623-7f937730ff/python/docs/source/reference/pyspark.sql.rst
spark-3.2.0-SNAPSHOT-bin-20210623-7f937730ff/python/docs/source/reference/pyspark.mllib.rst
spark-3.2.0-SNAPSHOT-bin-20210623-7f937730ff/python/docs/source/reference/pyspark.ss.rst
spark-3.2.0-SNAPSHOT-bin-20210623-7f937730ff/python/docs/source/reference/pyspark.pandas/
spark-3.2.0-SNAPSHOT-bin-20210623-7f937730ff/python/docs/source/reference/pyspark.pandas/frame.rst
spark-3.2.0-SNAPSHOT-bin-20210623-7f937730ff/python/docs/source/reference/pyspark.pandas/index.rst
spark-3.2.0-SNAPSHOT-bin-20210623-7f937730ff/python/docs/source/reference/pyspark.pandas/window.rst
spark-3.2.0-SNAPSHOT-bin-20210623-7f937730ff/python/docs/source/reference/pyspark.pandas/general_functions.rst
spark-3.2.0-SNAPSHOT-bin-20210623-7f937730ff/python/docs/source/reference/pyspark.pandas/indexing.rst
spark-3.2.0-SNAPSHOT-bin-20210623-7f937730ff/python/docs/source/reference/pyspark.pandas/io.rst
spark-3.2.0-SNAPSHOT-bin-20210623-7f937730ff/python/docs/source/reference/pyspark.pandas/extensions.rst
spark-3.2.0-SNAPSHOT-bin-20210623-7f937730ff/python/docs/source/reference/pyspark.pandas/ml.rst
spark-3.2.0-SNAPSHOT-bin-20210623-7f937730ff/python/docs/source/reference/pyspark.pandas/series.rst
spark-3.2.0-SNAPSHOT-bin-20210623-7f937730ff/python/docs/source/reference/pyspark.pandas/groupby.rst
spark-3.2.0-SNAPSHOT-bin-20210623-7f937730ff/python/docs/source/reference/pyspark.rst
spark-3.2.0-SNAPSHOT-bin-20210623-7f937730ff/python/docs/source/reference/pyspark.resource.rst
spark-3.2.0-SNAPSHOT-bin-20210623-7f937730ff/python/docs/source/_templates/
spark-3.2.0-SNAPSHOT-bin-20210623-7f937730ff/python/docs/source/_templates/autosummary/
spark-3.2.0-SNAPSHOT-bin-20210623-7f937730ff/python/docs/source/_templates/autosummary/class.rst
spark-3.2.0-SNAPSHOT-bin-20210623-7f937730ff/python/docs/source/_templates/autosummary/class_with_docs.rst
spark-3.2.0-SNAPSHOT-bin-20210623-7f937730ff/python/docs/make2.bat
spark-3.2.0-SNAPSHOT-bin-20210623-7f937730ff/python/docs/Makefile
spark-3.2.0-SNAPSHOT-bin-20210623-7f937730ff/python/lib/
spark-3.2.0-SNAPSHOT-bin-20210623-7f937730ff/python/lib/PY4J_LICENSE.txt
spark-3.2.0-SNAPSHOT-bin-20210623-7f937730ff/python/lib/py4j-0.10.9.2-src.zip
spark-3.2.0-SNAPSHOT-bin-20210623-7f937730ff/python/lib/pyspark.zip
spark-3.2.0-SNAPSHOT-bin-20210623-7f937730ff/python/run-tests
spark-3.2.0-SNAPSHOT-bin-20210623-7f937730ff/python/setup.py
spark-3.2.0-SNAPSHOT-bin-20210623-7f937730ff/python/pyspark/
spark-3.2.0-SNAPSHOT-bin-20210623-7f937730ff/python/pyspark/status.pyi
spark-3.2.0-SNAPSHOT-bin-20210623-7f937730ff/python/pyspark/accumulators.pyi
spark-3.2.0-SNAPSHOT-bin-20210623-7f937730ff/python/pyspark/files.py
spark-3.2.0-SNAPSHOT-bin-20210623-7f937730ff/python/pyspark/cloudpickle/
spark-3.2.0-SNAPSHOT-bin-20210623-7f937730ff/python/pyspark/cloudpickle/cloudpickle.py
spark-3.2.0-SNAPSHOT-bin-20210623-7f937730ff/python/pyspark/cloudpickle/__init__.py
spark-3.2.0-SNAPSHOT-bin-20210623-7f937730ff/python/pyspark/cloudpickle/compat.py
spark-3.2.0-SNAPSHOT-bin-20210623-7f937730ff/python/pyspark/cloudpickle/cloudpickle_fast.py
spark-3.2.0-SNAPSHOT-bin-20210623-7f937730ff/python/pyspark/streaming/
spark-3.2.0-SNAPSHOT-bin-20210623-7f937730ff/python/pyspark/streaming/tests/
spark-3.2.0-SNAPSHOT-bin-20210623-7f937730ff/python/pyspark/streaming/tests/test_listener.py
spark-3.2.0-SNAPSHOT-bin-20210623-7f937730ff/python/pyspark/streaming/tests/__init__.py
spark-3.2.0-SNAPSHOT-bin-20210623-7f937730ff/python/pyspark/streaming/tests/test_dstream.py
spark-3.2.0-SNAPSHOT-bin-20210623-7f937730ff/python/pyspark/streaming/tests/test_kinesis.py
spark-3.2.0-SNAPSHOT-bin-20210623-7f937730ff/python/pyspark/streaming/tests/test_context.py
spark-3.2.0-SNAPSHOT-bin-20210623-7f937730ff/python/pyspark/streaming/dstream.py
spark-3.2.0-SNAPSHOT-bin-20210623-7f937730ff/python/pyspark/streaming/util.py
spark-3.2.0-SNAPSHOT-bin-20210623-7f937730ff/python/pyspark/streaming/dstream.pyi
spark-3.2.0-SNAPSHOT-bin-20210623-7f937730ff/python/pyspark/streaming/kinesis.py
spark-3.2.0-SNAPSHOT-bin-20210623-7f937730ff/python/pyspark/streaming/__init__.py
spark-3.2.0-SNAPSHOT-bin-20210623-7f937730ff/python/pyspark/streaming/kinesis.pyi
spark-3.2.0-SNAPSHOT-bin-20210623-7f937730ff/python/pyspark/streaming/listener.pyi
spark-3.2.0-SNAPSHOT-bin-20210623-7f937730ff/python/pyspark/streaming/context.py
spark-3.2.0-SNAPSHOT-bin-20210623-7f937730ff/python/pyspark/streaming/listener.py
spark-3.2.0-SNAPSHOT-bin-20210623-7f937730ff/python/pyspark/streaming/context.pyi
spark-3.2.0-SNAPSHOT-bin-20210623-7f937730ff/python/pyspark/shuffle.py
spark-3.2.0-SNAPSHOT-bin-20210623-7f937730ff/python/pyspark/resultiterable.pyi
spark-3.2.0-SNAPSHOT-bin-20210623-7f937730ff/python/pyspark/util.py
spark-3.2.0-SNAPSHOT-bin-20210623-7f937730ff/python/pyspark/ml/
spark-3.2.0-SNAPSHOT-bin-20210623-7f937730ff/python/pyspark/ml/base.py
spark-3.2.0-SNAPSHOT-bin-20210623-7f937730ff/python/pyspark/ml/__init__.py
spark-3.2.0-SNAPSHOT-bin-20210623-7f937730ff/python/pyspark/ml/fpm.pyi
spark-3.2.0-SNAPSHOT-bin-20210623-7f937730ff/python/pyspark/ml/functions.py
spark-3.2.0-SNAPSHOT-bin-20210623-7f937730ff/python/pyspark/ml/feature.py
spark-3.2.0-SNAPSHOT-bin-20210623-7f937730ff/python/pyspark/ml/evaluation.py
spark-3.2.0-SNAPSHOT-bin-20210623-7f937730ff/python/pyspark/ml/recommendation.py
spark-3.2.0-SNAPSHOT-bin-20210623-7f937730ff/python/pyspark/ml/regression.pyi
spark-3.2.0-SNAPSHOT-bin-20210623-7f937730ff/python/pyspark/ml/common.pyi
spark-3.2.0-SNAPSHOT-bin-20210623-7f937730ff/python/pyspark/ml/image.py
spark-3.2.0-SNAPSHOT-bin-20210623-7f937730ff/python/pyspark/ml/regression.py
spark-3.2.0-SNAPSHOT-bin-20210623-7f937730ff/python/pyspark/ml/stat.pyi
spark-3.2.0-SNAPSHOT-bin-20210623-7f937730ff/python/pyspark/ml/param/
spark-3.2.0-SNAPSHOT-bin-20210623-7f937730ff/python/pyspark/ml/param/_shared_params_code_gen.py
spark-3.2.0-SNAPSHOT-bin-20210623-7f937730ff/python/pyspark/ml/param/_shared_params_code_gen.pyi
spark-3.2.0-SNAPSHOT-bin-20210623-7f937730ff/python/pyspark/ml/param/shared.pyi
spark-3.2.0-SNAPSHOT-bin-20210623-7f937730ff/python/pyspark/ml/param/__init__.pyi
spark-3.2.0-SNAPSHOT-bin-20210623-7f937730ff/python/pyspark/ml/param/shared.py
spark-3.2.0-SNAPSHOT-bin-20210623-7f937730ff/python/pyspark/ml/param/__init__.py
spark-3.2.0-SNAPSHOT-bin-20210623-7f937730ff/python/pyspark/ml/fpm.py
spark-3.2.0-SNAPSHOT-bin-20210623-7f937730ff/python/pyspark/ml/clustering.pyi
spark-3.2.0-SNAPSHOT-bin-20210623-7f937730ff/python/pyspark/ml/tree.py
spark-3.2.0-SNAPSHOT-bin-20210623-7f937730ff/python/pyspark/ml/tests/
spark-3.2.0-SNAPSHOT-bin-20210623-7f937730ff/python/pyspark/ml/tests/test_wrapper.py
spark-3.2.0-SNAPSHOT-bin-20210623-7f937730ff/python/pyspark/ml/tests/test_stat.py
spark-3.2.0-SNAPSHOT-bin-20210623-7f937730ff/python/pyspark/ml/tests/test_evaluation.py
spark-3.2.0-SNAPSHOT-bin-20210623-7f937730ff/python/pyspark/ml/tests/test_util.py
spark-3.2.0-SNAPSHOT-bin-20210623-7f937730ff/python/pyspark/ml/tests/__init__.py
spark-3.2.0-SNAPSHOT-bin-20210623-7f937730ff/python/pyspark/ml/tests/test_pipeline.py
spark-3.2.0-SNAPSHOT-bin-20210623-7f937730ff/python/pyspark/ml/tests/test_persistence.py
spark-3.2.0-SNAPSHOT-bin-20210623-7f937730ff/python/pyspark/ml/tests/test_tuning.py
spark-3.2.0-SNAPSHOT-bin-20210623-7f937730ff/python/pyspark/ml/tests/test_param.py
spark-3.2.0-SNAPSHOT-bin-20210623-7f937730ff/python/pyspark/ml/tests/test_training_summary.py
spark-3.2.0-SNAPSHOT-bin-20210623-7f937730ff/python/pyspark/ml/tests/test_algorithms.py
spark-3.2.0-SNAPSHOT-bin-20210623-7f937730ff/python/pyspark/ml/tests/test_linalg.py
spark-3.2.0-SNAPSHOT-bin-20210623-7f937730ff/python/pyspark/ml/tests/test_base.py
spark-3.2.0-SNAPSHOT-bin-20210623-7f937730ff/python/pyspark/ml/tests/test_feature.py
spark-3.2.0-SNAPSHOT-bin-20210623-7f937730ff/python/pyspark/ml/tests/test_image.py
spark-3.2.0-SNAPSHOT-bin-20210623-7f937730ff/python/pyspark/ml/base.pyi
spark-3.2.0-SNAPSHOT-bin-20210623-7f937730ff/python/pyspark/ml/linalg/
spark-3.2.0-SNAPSHOT-bin-20210623-7f937730ff/python/pyspark/ml/linalg/__init__.pyi
spark-3.2.0-SNAPSHOT-bin-20210623-7f937730ff/python/pyspark/ml/linalg/__init__.py
spark-3.2.0-SNAPSHOT-bin-20210623-7f937730ff/python/pyspark/ml/common.py
spark-3.2.0-SNAPSHOT-bin-20210623-7f937730ff/python/pyspark/ml/wrapper.pyi
spark-3.2.0-SNAPSHOT-bin-20210623-7f937730ff/python/pyspark/ml/tuning.pyi
spark-3.2.0-SNAPSHOT-bin-20210623-7f937730ff/python/pyspark/ml/classification.py
spark-3.2.0-SNAPSHOT-bin-20210623-7f937730ff/python/pyspark/ml/image.pyi
spark-3.2.0-SNAPSHOT-bin-20210623-7f937730ff/python/pyspark/ml/_typing.pyi
spark-3.2.0-SNAPSHOT-bin-20210623-7f937730ff/python/pyspark/ml/pipeline.py
spark-3.2.0-SNAPSHOT-bin-20210623-7f937730ff/python/pyspark/ml/wrapper.py
spark-3.2.0-SNAPSHOT-bin-20210623-7f937730ff/python/pyspark/ml/classification.pyi
spark-3.2.0-SNAPSHOT-bin-20210623-7f937730ff/python/pyspark/ml/feature.pyi
spark-3.2.0-SNAPSHOT-bin-20210623-7f937730ff/python/pyspark/ml/stat.py
spark-3.2.0-SNAPSHOT-bin-20210623-7f937730ff/python/pyspark/ml/tree.pyi
spark-3.2.0-SNAPSHOT-bin-20210623-7f937730ff/python/pyspark/ml/evaluation.pyi
spark-3.2.0-SNAPSHOT-bin-20210623-7f937730ff/python/pyspark/ml/recommendation.pyi
spark-3.2.0-SNAPSHOT-bin-20210623-7f937730ff/python/pyspark/ml/util.py
spark-3.2.0-SNAPSHOT-bin-20210623-7f937730ff/python/pyspark/ml/clustering.py
spark-3.2.0-SNAPSHOT-bin-20210623-7f937730ff/python/pyspark/ml/tuning.py
spark-3.2.0-SNAPSHOT-bin-20210623-7f937730ff/python/pyspark/ml/pipeline.pyi
spark-3.2.0-SNAPSHOT-bin-20210623-7f937730ff/python/pyspark/ml/functions.pyi
spark-3.2.0-SNAPSHOT-bin-20210623-7f937730ff/python/pyspark/ml/util.pyi
spark-3.2.0-SNAPSHOT-bin-20210623-7f937730ff/python/pyspark/_typing.pyi
spark-3.2.0-SNAPSHOT-bin-20210623-7f937730ff/python/pyspark/rddsampler.py
spark-3.2.0-SNAPSHOT-bin-20210623-7f937730ff/python/pyspark/join.py
spark-3.2.0-SNAPSHOT-bin-20210623-7f937730ff/python/pyspark/files.pyi
spark-3.2.0-SNAPSHOT-bin-20210623-7f937730ff/python/pyspark/testing/
spark-3.2.0-SNAPSHOT-bin-20210623-7f937730ff/python/pyspark/testing/sqlutils.py
spark-3.2.0-SNAPSHOT-bin-20210623-7f937730ff/python/pyspark/testing/pandasutils.py
spark-3.2.0-SNAPSHOT-bin-20210623-7f937730ff/python/pyspark/testing/streamingutils.py
spark-3.2.0-SNAPSHOT-bin-20210623-7f937730ff/python/pyspark/testing/mlutils.py
spark-3.2.0-SNAPSHOT-bin-20210623-7f937730ff/python/pyspark/testing/mllibutils.py
spark-3.2.0-SNAPSHOT-bin-20210623-7f937730ff/python/pyspark/testing/utils.py
spark-3.2.0-SNAPSHOT-bin-20210623-7f937730ff/python/pyspark/testing/__init__.py
spark-3.2.0-SNAPSHOT-bin-20210623-7f937730ff/python/pyspark/mllib/
spark-3.2.0-SNAPSHOT-bin-20210623-7f937730ff/python/pyspark/mllib/classification.py
spark-3.2.0-SNAPSHOT-bin-20210623-7f937730ff/python/pyspark/mllib/_typing.pyi
spark-3.2.0-SNAPSHOT-bin-20210623-7f937730ff/python/pyspark/mllib/clustering.py
spark-3.2.0-SNAPSHOT-bin-20210623-7f937730ff/python/pyspark/mllib/tests/
spark-3.2.0-SNAPSHOT-bin-20210623-7f937730ff/python/pyspark/mllib/tests/test_linalg.py
spark-3.2.0-SNAPSHOT-bin-20210623-7f937730ff/python/pyspark/mllib/tests/test_streaming_algorithms.py
spark-3.2.0-SNAPSHOT-bin-20210623-7f937730ff/python/pyspark/mllib/tests/test_algorithms.py
spark-3.2.0-SNAPSHOT-bin-20210623-7f937730ff/python/pyspark/mllib/tests/test_stat.py
spark-3.2.0-SNAPSHOT-bin-20210623-7f937730ff/python/pyspark/mllib/tests/test_util.py
spark-3.2.0-SNAPSHOT-bin-20210623-7f937730ff/python/pyspark/mllib/tests/test_feature.py
spark-3.2.0-SNAPSHOT-bin-20210623-7f937730ff/python/pyspark/mllib/tests/__init__.py
spark-3.2.0-SNAPSHOT-bin-20210623-7f937730ff/python/pyspark/mllib/classification.pyi
spark-3.2.0-SNAPSHOT-bin-20210623-7f937730ff/python/pyspark/mllib/feature.pyi
spark-3.2.0-SNAPSHOT-bin-20210623-7f937730ff/python/pyspark/mllib/recommendation.pyi
spark-3.2.0-SNAPSHOT-bin-20210623-7f937730ff/python/pyspark/mllib/evaluation.pyi
spark-3.2.0-SNAPSHOT-bin-20210623-7f937730ff/python/pyspark/mllib/util.py
spark-3.2.0-SNAPSHOT-bin-20210623-7f937730ff/python/pyspark/mllib/common.py
spark-3.2.0-SNAPSHOT-bin-20210623-7f937730ff/python/pyspark/mllib/common.pyi
spark-3.2.0-SNAPSHOT-bin-20210623-7f937730ff/python/pyspark/mllib/feature.py
spark-3.2.0-SNAPSHOT-bin-20210623-7f937730ff/python/pyspark/mllib/__init__.py
spark-3.2.0-SNAPSHOT-bin-20210623-7f937730ff/python/pyspark/mllib/regression.py
spark-3.2.0-SNAPSHOT-bin-20210623-7f937730ff/python/pyspark/mllib/fpm.pyi
spark-3.2.0-SNAPSHOT-bin-20210623-7f937730ff/python/pyspark/mllib/fpm.py
spark-3.2.0-SNAPSHOT-bin-20210623-7f937730ff/python/pyspark/mllib/recommendation.py
spark-3.2.0-SNAPSHOT-bin-20210623-7f937730ff/python/pyspark/mllib/linalg/
spark-3.2.0-SNAPSHOT-bin-20210623-7f937730ff/python/pyspark/mllib/linalg/__init__.pyi
spark-3.2.0-SNAPSHOT-bin-20210623-7f937730ff/python/pyspark/mllib/linalg/distributed.pyi
spark-3.2.0-SNAPSHOT-bin-20210623-7f937730ff/python/pyspark/mllib/linalg/__init__.py
spark-3.2.0-SNAPSHOT-bin-20210623-7f937730ff/python/pyspark/mllib/linalg/distributed.py
spark-3.2.0-SNAPSHOT-bin-20210623-7f937730ff/python/pyspark/mllib/regression.pyi
spark-3.2.0-SNAPSHOT-bin-20210623-7f937730ff/python/pyspark/mllib/clustering.pyi
spark-3.2.0-SNAPSHOT-bin-20210623-7f937730ff/python/pyspark/mllib/tree.py
spark-3.2.0-SNAPSHOT-bin-20210623-7f937730ff/python/pyspark/mllib/tree.pyi
spark-3.2.0-SNAPSHOT-bin-20210623-7f937730ff/python/pyspark/mllib/stat/
spark-3.2.0-SNAPSHOT-bin-20210623-7f937730ff/python/pyspark/mllib/stat/test.pyi
spark-3.2.0-SNAPSHOT-bin-20210623-7f937730ff/python/pyspark/mllib/stat/KernelDensity.pyi
spark-3.2.0-SNAPSHOT-bin-20210623-7f937730ff/python/pyspark/mllib/stat/__init__.py
spark-3.2.0-SNAPSHOT-bin-20210623-7f937730ff/python/pyspark/mllib/stat/_statistics.py
spark-3.2.0-SNAPSHOT-bin-20210623-7f937730ff/python/pyspark/mllib/stat/__init__.pyi
spark-3.2.0-SNAPSHOT-bin-20210623-7f937730ff/python/pyspark/mllib/stat/KernelDensity.py
spark-3.2.0-SNAPSHOT-bin-20210623-7f937730ff/python/pyspark/mllib/stat/_statistics.pyi
spark-3.2.0-SNAPSHOT-bin-20210623-7f937730ff/python/pyspark/mllib/stat/test.py
spark-3.2.0-SNAPSHOT-bin-20210623-7f937730ff/python/pyspark/mllib/stat/distribution.py
spark-3.2.0-SNAPSHOT-bin-20210623-7f937730ff/python/pyspark/mllib/stat/distribution.pyi
spark-3.2.0-SNAPSHOT-bin-20210623-7f937730ff/python/pyspark/mllib/random.py
spark-3.2.0-SNAPSHOT-bin-20210623-7f937730ff/python/pyspark/mllib/util.pyi
spark-3.2.0-SNAPSHOT-bin-20210623-7f937730ff/python/pyspark/mllib/random.pyi
spark-3.2.0-SNAPSHOT-bin-20210623-7f937730ff/python/pyspark/mllib/evaluation.py
spark-3.2.0-SNAPSHOT-bin-20210623-7f937730ff/python/pyspark/resultiterable.py
spark-3.2.0-SNAPSHOT-bin-20210623-7f937730ff/python/pyspark/taskcontext.py
spark-3.2.0-SNAPSHOT-bin-20210623-7f937730ff/python/pyspark/daemon.py
spark-3.2.0-SNAPSHOT-bin-20210623-7f937730ff/python/pyspark/java_gateway.py
spark-3.2.0-SNAPSHOT-bin-20210623-7f937730ff/python/pyspark/broadcast.pyi
spark-3.2.0-SNAPSHOT-bin-20210623-7f937730ff/python/pyspark/accumulators.py
spark-3.2.0-SNAPSHOT-bin-20210623-7f937730ff/python/pyspark/rdd.py
spark-3.2.0-SNAPSHOT-bin-20210623-7f937730ff/python/pyspark/tests/
spark-3.2.0-SNAPSHOT-bin-20210623-7f937730ff/python/pyspark/tests/test_join.py
spark-3.2.0-SNAPSHOT-bin-20210623-7f937730ff/python/pyspark/tests/test_daemon.py
spark-3.2.0-SNAPSHOT-bin-20210623-7f937730ff/python/pyspark/tests/test_pin_thread.py
spark-3.2.0-SNAPSHOT-bin-20210623-7f937730ff/python/pyspark/tests/test_util.py
spark-3.2.0-SNAPSHOT-bin-20210623-7f937730ff/python/pyspark/tests/test_profiler.py
spark-3.2.0-SNAPSHOT-bin-20210623-7f937730ff/python/pyspark/tests/test_shuffle.py
spark-3.2.0-SNAPSHOT-bin-20210623-7f937730ff/python/pyspark/tests/test_conf.py
spark-3.2.0-SNAPSHOT-bin-20210623-7f937730ff/python/pyspark/tests/test_appsubmit.py
spark-3.2.0-SNAPSHOT-bin-20210623-7f937730ff/python/pyspark/tests/test_broadcast.py
spark-3.2.0-SNAPSHOT-bin-20210623-7f937730ff/python/pyspark/tests/test_rddbarrier.py
spark-3.2.0-SNAPSHOT-bin-20210623-7f937730ff/python/pyspark/tests/test_taskcontext.py
spark-3.2.0-SNAPSHOT-bin-20210623-7f937730ff/python/pyspark/tests/test_context.py
spark-3.2.0-SNAPSHOT-bin-20210623-7f937730ff/python/pyspark/tests/test_rdd.py
spark-3.2.0-SNAPSHOT-bin-20210623-7f937730ff/python/pyspark/tests/test_install_spark.py
spark-3.2.0-SNAPSHOT-bin-20210623-7f937730ff/python/pyspark/tests/test_readwrite.py
spark-3.2.0-SNAPSHOT-bin-20210623-7f937730ff/python/pyspark/tests/test_serializers.py
spark-3.2.0-SNAPSHOT-bin-20210623-7f937730ff/python/pyspark/tests/__init__.py
spark-3.2.0-SNAPSHOT-bin-20210623-7f937730ff/python/pyspark/tests/test_worker.py
spark-3.2.0-SNAPSHOT-bin-20210623-7f937730ff/python/pyspark/conf.py
spark-3.2.0-SNAPSHOT-bin-20210623-7f937730ff/python/pyspark/conf.pyi
spark-3.2.0-SNAPSHOT-bin-20210623-7f937730ff/python/pyspark/context.py
spark-3.2.0-SNAPSHOT-bin-20210623-7f937730ff/python/pyspark/resource/
spark-3.2.0-SNAPSHOT-bin-20210623-7f937730ff/python/pyspark/resource/profile.pyi
spark-3.2.0-SNAPSHOT-bin-20210623-7f937730ff/python/pyspark/resource/information.py
spark-3.2.0-SNAPSHOT-bin-20210623-7f937730ff/python/pyspark/resource/__init__.py
spark-3.2.0-SNAPSHOT-bin-20210623-7f937730ff/python/pyspark/resource/tests/
spark-3.2.0-SNAPSHOT-bin-20210623-7f937730ff/python/pyspark/resource/tests/__init__.py
spark-3.2.0-SNAPSHOT-bin-20210623-7f937730ff/python/pyspark/resource/tests/test_resources.py
spark-3.2.0-SNAPSHOT-bin-20210623-7f937730ff/python/pyspark/resource/requests.pyi
spark-3.2.0-SNAPSHOT-bin-20210623-7f937730ff/python/pyspark/resource/information.pyi
spark-3.2.0-SNAPSHOT-bin-20210623-7f937730ff/python/pyspark/resource/profile.py
spark-3.2.0-SNAPSHOT-bin-20210623-7f937730ff/python/pyspark/resource/requests.py
spark-3.2.0-SNAPSHOT-bin-20210623-7f937730ff/python/pyspark/traceback_utils.py
spark-3.2.0-SNAPSHOT-bin-20210623-7f937730ff/python/pyspark/statcounter.pyi
spark-3.2.0-SNAPSHOT-bin-20210623-7f937730ff/python/pyspark/__init__.py
spark-3.2.0-SNAPSHOT-bin-20210623-7f937730ff/python/pyspark/util.pyi
spark-3.2.0-SNAPSHOT-bin-20210623-7f937730ff/python/pyspark/rdd.pyi
spark-3.2.0-SNAPSHOT-bin-20210623-7f937730ff/python/pyspark/storagelevel.py
spark-3.2.0-SNAPSHOT-bin-20210623-7f937730ff/python/pyspark/serializers.py
spark-3.2.0-SNAPSHOT-bin-20210623-7f937730ff/python/pyspark/worker.py
spark-3.2.0-SNAPSHOT-bin-20210623-7f937730ff/python/pyspark/profiler.pyi
spark-3.2.0-SNAPSHOT-bin-20210623-7f937730ff/python/pyspark/_globals.py
spark-3.2.0-SNAPSHOT-bin-20210623-7f937730ff/python/pyspark/storagelevel.pyi
spark-3.2.0-SNAPSHOT-bin-20210623-7f937730ff/python/pyspark/sql/
spark-3.2.0-SNAPSHOT-bin-20210623-7f937730ff/python/pyspark/sql/avro/
spark-3.2.0-SNAPSHOT-bin-20210623-7f937730ff/python/pyspark/sql/avro/__init__.py
spark-3.2.0-SNAPSHOT-bin-20210623-7f937730ff/python/pyspark/sql/avro/functions.pyi
spark-3.2.0-SNAPSHOT-bin-20210623-7f937730ff/python/pyspark/sql/avro/functions.py
spark-3.2.0-SNAPSHOT-bin-20210623-7f937730ff/python/pyspark/sql/streaming.pyi
spark-3.2.0-SNAPSHOT-bin-20210623-7f937730ff/python/pyspark/sql/catalog.py
spark-3.2.0-SNAPSHOT-bin-20210623-7f937730ff/python/pyspark/sql/group.pyi
spark-3.2.0-SNAPSHOT-bin-20210623-7f937730ff/python/pyspark/sql/context.pyi
spark-3.2.0-SNAPSHOT-bin-20210623-7f937730ff/python/pyspark/sql/conf.py
spark-3.2.0-SNAPSHOT-bin-20210623-7f937730ff/python/pyspark/sql/conf.pyi
spark-3.2.0-SNAPSHOT-bin-20210623-7f937730ff/python/pyspark/sql/readwriter.py
spark-3.2.0-SNAPSHOT-bin-20210623-7f937730ff/python/pyspark/sql/streaming.py
spark-3.2.0-SNAPSHOT-bin-20210623-7f937730ff/python/pyspark/sql/window.pyi
spark-3.2.0-SNAPSHOT-bin-20210623-7f937730ff/python/pyspark/sql/types.py
spark-3.2.0-SNAPSHOT-bin-20210623-7f937730ff/python/pyspark/sql/session.pyi
spark-3.2.0-SNAPSHOT-bin-20210623-7f937730ff/python/pyspark/sql/__init__.pyi
spark-3.2.0-SNAPSHOT-bin-20210623-7f937730ff/python/pyspark/sql/window.py
spark-3.2.0-SNAPSHOT-bin-20210623-7f937730ff/python/pyspark/sql/column.py
spark-3.2.0-SNAPSHOT-bin-20210623-7f937730ff/python/pyspark/sql/__init__.py
spark-3.2.0-SNAPSHOT-bin-20210623-7f937730ff/python/pyspark/sql/context.py
spark-3.2.0-SNAPSHOT-bin-20210623-7f937730ff/python/pyspark/sql/tests/
spark-3.2.0-SNAPSHOT-bin-20210623-7f937730ff/python/pyspark/sql/tests/test_pandas_udf_window.py
spark-3.2.0-SNAPSHOT-bin-20210623-7f937730ff/python/pyspark/sql/tests/test_session.py
spark-3.2.0-SNAPSHOT-bin-20210623-7f937730ff/python/pyspark/sql/tests/test_types.py
spark-3.2.0-SNAPSHOT-bin-20210623-7f937730ff/python/pyspark/sql/tests/test_functions.py
spark-3.2.0-SNAPSHOT-bin-20210623-7f937730ff/python/pyspark/sql/tests/test_pandas_udf.py
spark-3.2.0-SNAPSHOT-bin-20210623-7f937730ff/python/pyspark/sql/tests/test_dataframe.py
spark-3.2.0-SNAPSHOT-bin-20210623-7f937730ff/python/pyspark/sql/tests/test_readwriter.py
spark-3.2.0-SNAPSHOT-bin-20210623-7f937730ff/python/pyspark/sql/tests/test_pandas_map.py
spark-3.2.0-SNAPSHOT-bin-20210623-7f937730ff/python/pyspark/sql/tests/test_pandas_grouped_map.py
spark-3.2.0-SNAPSHOT-bin-20210623-7f937730ff/python/pyspark/sql/tests/test_serde.py
spark-3.2.0-SNAPSHOT-bin-20210623-7f937730ff/python/pyspark/sql/tests/test_pandas_udf_scalar.py
spark-3.2.0-SNAPSHOT-bin-20210623-7f937730ff/python/pyspark/sql/tests/test_pandas_udf_grouped_agg.py
spark-3.2.0-SNAPSHOT-bin-20210623-7f937730ff/python/pyspark/sql/tests/test_catalog.py
spark-3.2.0-SNAPSHOT-bin-20210623-7f937730ff/python/pyspark/sql/tests/test_datasources.py
spark-3.2.0-SNAPSHOT-bin-20210623-7f937730ff/python/pyspark/sql/tests/test_arrow.py
spark-3.2.0-SNAPSHOT-bin-20210623-7f937730ff/python/pyspark/sql/tests/test_group.py
spark-3.2.0-SNAPSHOT-bin-20210623-7f937730ff/python/pyspark/sql/tests/test_pandas_udf_typehints.py
spark-3.2.0-SNAPSHOT-bin-20210623-7f937730ff/python/pyspark/sql/tests/__init__.py
spark-3.2.0-SNAPSHOT-bin-20210623-7f937730ff/python/pyspark/sql/tests/test_utils.py
spark-3.2.0-SNAPSHOT-bin-20210623-7f937730ff/python/pyspark/sql/tests/test_streaming.py
spark-3.2.0-SNAPSHOT-bin-20210623-7f937730ff/python/pyspark/sql/tests/test_udf.py
spark-3.2.0-SNAPSHOT-bin-20210623-7f937730ff/python/pyspark/sql/tests/test_conf.py
spark-3.2.0-SNAPSHOT-bin-20210623-7f937730ff/python/pyspark/sql/tests/test_context.py
spark-3.2.0-SNAPSHOT-bin-20210623-7f937730ff/python/pyspark/sql/tests/test_pandas_cogrouped_map.py
spark-3.2.0-SNAPSHOT-bin-20210623-7f937730ff/python/pyspark/sql/tests/test_column.py
spark-3.2.0-SNAPSHOT-bin-20210623-7f937730ff/python/pyspark/sql/pandas/
spark-3.2.0-SNAPSHOT-bin-20210623-7f937730ff/python/pyspark/sql/pandas/types.py
spark-3.2.0-SNAPSHOT-bin-20210623-7f937730ff/python/pyspark/sql/pandas/serializers.py
spark-3.2.0-SNAPSHOT-bin-20210623-7f937730ff/python/pyspark/sql/pandas/typehints.py
spark-3.2.0-SNAPSHOT-bin-20210623-7f937730ff/python/pyspark/sql/pandas/map_ops.py
spark-3.2.0-SNAPSHOT-bin-20210623-7f937730ff/python/pyspark/sql/pandas/group_ops.py
spark-3.2.0-SNAPSHOT-bin-20210623-7f937730ff/python/pyspark/sql/pandas/map_ops.pyi
spark-3.2.0-SNAPSHOT-bin-20210623-7f937730ff/python/pyspark/sql/pandas/conversion.pyi
spark-3.2.0-SNAPSHOT-bin-20210623-7f937730ff/python/pyspark/sql/pandas/functions.py
spark-3.2.0-SNAPSHOT-bin-20210623-7f937730ff/python/pyspark/sql/pandas/group_ops.pyi
spark-3.2.0-SNAPSHOT-bin-20210623-7f937730ff/python/pyspark/sql/pandas/__init__.py
spark-3.2.0-SNAPSHOT-bin-20210623-7f937730ff/python/pyspark/sql/pandas/conversion.py
spark-3.2.0-SNAPSHOT-bin-20210623-7f937730ff/python/pyspark/sql/pandas/functions.pyi
spark-3.2.0-SNAPSHOT-bin-20210623-7f937730ff/python/pyspark/sql/pandas/_typing/
spark-3.2.0-SNAPSHOT-bin-20210623-7f937730ff/python/pyspark/sql/pandas/_typing/protocols/
spark-3.2.0-SNAPSHOT-bin-20210623-7f937730ff/python/pyspark/sql/pandas/_typing/protocols/__init__.pyi
spark-3.2.0-SNAPSHOT-bin-20210623-7f937730ff/python/pyspark/sql/pandas/_typing/protocols/frame.pyi
spark-3.2.0-SNAPSHOT-bin-20210623-7f937730ff/python/pyspark/sql/pandas/_typing/protocols/series.pyi
spark-3.2.0-SNAPSHOT-bin-20210623-7f937730ff/python/pyspark/sql/pandas/_typing/__init__.pyi
spark-3.2.0-SNAPSHOT-bin-20210623-7f937730ff/python/pyspark/sql/pandas/utils.py
spark-3.2.0-SNAPSHOT-bin-20210623-7f937730ff/python/pyspark/sql/catalog.pyi
spark-3.2.0-SNAPSHOT-bin-20210623-7f937730ff/python/pyspark/sql/functions.pyi
spark-3.2.0-SNAPSHOT-bin-20210623-7f937730ff/python/pyspark/sql/types.pyi
spark-3.2.0-SNAPSHOT-bin-20210623-7f937730ff/python/pyspark/sql/session.py
spark-3.2.0-SNAPSHOT-bin-20210623-7f937730ff/python/pyspark/sql/group.py
spark-3.2.0-SNAPSHOT-bin-20210623-7f937730ff/python/pyspark/sql/udf.py
spark-3.2.0-SNAPSHOT-bin-20210623-7f937730ff/python/pyspark/sql/dataframe.pyi
spark-3.2.0-SNAPSHOT-bin-20210623-7f937730ff/python/pyspark/sql/readwriter.pyi
spark-3.2.0-SNAPSHOT-bin-20210623-7f937730ff/python/pyspark/sql/utils.py
spark-3.2.0-SNAPSHOT-bin-20210623-7f937730ff/python/pyspark/sql/_typing.pyi
spark-3.2.0-SNAPSHOT-bin-20210623-7f937730ff/python/pyspark/sql/column.pyi
spark-3.2.0-SNAPSHOT-bin-20210623-7f937730ff/python/pyspark/sql/udf.pyi
spark-3.2.0-SNAPSHOT-bin-20210623-7f937730ff/python/pyspark/sql/functions.py
spark-3.2.0-SNAPSHOT-bin-20210623-7f937730ff/python/pyspark/sql/dataframe.py
spark-3.2.0-SNAPSHOT-bin-20210623-7f937730ff/python/pyspark/shell.py
spark-3.2.0-SNAPSHOT-bin-20210623-7f937730ff/python/pyspark/install.py
spark-3.2.0-SNAPSHOT-bin-20210623-7f937730ff/python/pyspark/context.pyi
spark-3.2.0-SNAPSHOT-bin-20210623-7f937730ff/python/pyspark/statcounter.py
spark-3.2.0-SNAPSHOT-bin-20210623-7f937730ff/python/pyspark/taskcontext.pyi
spark-3.2.0-SNAPSHOT-bin-20210623-7f937730ff/python/pyspark/py.typed
spark-3.2.0-SNAPSHOT-bin-20210623-7f937730ff/python/pyspark/pandas/
spark-3.2.0-SNAPSHOT-bin-20210623-7f937730ff/python/pyspark/pandas/generic.py
spark-3.2.0-SNAPSHOT-bin-20210623-7f937730ff/python/pyspark/pandas/tests/
spark-3.2.0-SNAPSHOT-bin-20210623-7f937730ff/python/pyspark/pandas/tests/test_reshape.py
spark-3.2.0-SNAPSHOT-bin-20210623-7f937730ff/python/pyspark/pandas/tests/test_ops_on_diff_frames_groupby_rolling.py
spark-3.2.0-SNAPSHOT-bin-20210623-7f937730ff/python/pyspark/pandas/tests/test_namespace.py
spark-3.2.0-SNAPSHOT-bin-20210623-7f937730ff/python/pyspark/pandas/tests/test_categorical.py
spark-3.2.0-SNAPSHOT-bin-20210623-7f937730ff/python/pyspark/pandas/tests/plot/
spark-3.2.0-SNAPSHOT-bin-20210623-7f937730ff/python/pyspark/pandas/tests/plot/test_frame_plot_plotly.py
spark-3.2.0-SNAPSHOT-bin-20210623-7f937730ff/python/pyspark/pandas/tests/plot/test_series_plot_matplotlib.py
spark-3.2.0-SNAPSHOT-bin-20210623-7f937730ff/python/pyspark/pandas/tests/plot/test_frame_plot.py
spark-3.2.0-SNAPSHOT-bin-20210623-7f937730ff/python/pyspark/pandas/tests/plot/test_frame_plot_matplotlib.py
spark-3.2.0-SNAPSHOT-bin-20210623-7f937730ff/python/pyspark/pandas/tests/plot/__init__.py
spark-3.2.0-SNAPSHOT-bin-20210623-7f937730ff/python/pyspark/pandas/tests/plot/test_series_plot_plotly.py
spark-3.2.0-SNAPSHOT-bin-20210623-7f937730ff/python/pyspark/pandas/tests/plot/test_series_plot.py
spark-3.2.0-SNAPSHOT-bin-20210623-7f937730ff/python/pyspark/pandas/tests/test_indexing.py
spark-3.2.0-SNAPSHOT-bin-20210623-7f937730ff/python/pyspark/pandas/tests/test_indexops_spark.py
spark-3.2.0-SNAPSHOT-bin-20210623-7f937730ff/python/pyspark/pandas/tests/test_csv.py
spark-3.2.0-SNAPSHOT-bin-20210623-7f937730ff/python/pyspark/pandas/tests/test_default_index.py
spark-3.2.0-SNAPSHOT-bin-20210623-7f937730ff/python/pyspark/pandas/tests/test_frame_spark.py
spark-3.2.0-SNAPSHOT-bin-20210623-7f937730ff/python/pyspark/pandas/tests/test_groupby.py
spark-3.2.0-SNAPSHOT-bin-20210623-7f937730ff/python/pyspark/pandas/tests/test_sql.py
spark-3.2.0-SNAPSHOT-bin-20210623-7f937730ff/python/pyspark/pandas/tests/test_dataframe_spark_io.py
spark-3.2.0-SNAPSHOT-bin-20210623-7f937730ff/python/pyspark/pandas/tests/test_series.py
spark-3.2.0-SNAPSHOT-bin-20210623-7f937730ff/python/pyspark/pandas/tests/test_stats.py
spark-3.2.0-SNAPSHOT-bin-20210623-7f937730ff/python/pyspark/pandas/tests/__init__.py
spark-3.2.0-SNAPSHOT-bin-20210623-7f937730ff/python/pyspark/pandas/tests/test_numpy_compat.py
spark-3.2.0-SNAPSHOT-bin-20210623-7f937730ff/python/pyspark/pandas/tests/test_ops_on_diff_frames_groupby_expanding.py
spark-3.2.0-SNAPSHOT-bin-20210623-7f937730ff/python/pyspark/pandas/tests/test_series_conversion.py
spark-3.2.0-SNAPSHOT-bin-20210623-7f937730ff/python/pyspark/pandas/tests/test_config.py
spark-3.2.0-SNAPSHOT-bin-20210623-7f937730ff/python/pyspark/pandas/tests/test_expanding.py
spark-3.2.0-SNAPSHOT-bin-20210623-7f937730ff/python/pyspark/pandas/tests/test_extension.py
spark-3.2.0-SNAPSHOT-bin-20210623-7f937730ff/python/pyspark/pandas/tests/test_rolling.py
spark-3.2.0-SNAPSHOT-bin-20210623-7f937730ff/python/pyspark/pandas/tests/test_series_string.py
spark-3.2.0-SNAPSHOT-bin-20210623-7f937730ff/python/pyspark/pandas/tests/indexes/
spark-3.2.0-SNAPSHOT-bin-20210623-7f937730ff/python/pyspark/pandas/tests/indexes/test_category.py
spark-3.2.0-SNAPSHOT-bin-20210623-7f937730ff/python/pyspark/pandas/tests/indexes/test_datetime.py
spark-3.2.0-SNAPSHOT-bin-20210623-7f937730ff/python/pyspark/pandas/tests/indexes/test_base.py
spark-3.2.0-SNAPSHOT-bin-20210623-7f937730ff/python/pyspark/pandas/tests/indexes/__init__.py
spark-3.2.0-SNAPSHOT-bin-20210623-7f937730ff/python/pyspark/pandas/tests/test_repr.py
spark-3.2.0-SNAPSHOT-bin-20210623-7f937730ff/python/pyspark/pandas/tests/test_dataframe.py
spark-3.2.0-SNAPSHOT-bin-20210623-7f937730ff/python/pyspark/pandas/tests/test_ops_on_diff_frames_groupby.py
spark-3.2.0-SNAPSHOT-bin-20210623-7f937730ff/python/pyspark/pandas/tests/test_series_datetime.py
spark-3.2.0-SNAPSHOT-bin-20210623-7f937730ff/python/pyspark/pandas/tests/test_internal.py
spark-3.2.0-SNAPSHOT-bin-20210623-7f937730ff/python/pyspark/pandas/tests/test_dataframe_conversion.py
spark-3.2.0-SNAPSHOT-bin-20210623-7f937730ff/python/pyspark/pandas/tests/test_ops_on_diff_frames.py
spark-3.2.0-SNAPSHOT-bin-20210623-7f937730ff/python/pyspark/pandas/tests/test_window.py
spark-3.2.0-SNAPSHOT-bin-20210623-7f937730ff/python/pyspark/pandas/tests/test_typedef.py
spark-3.2.0-SNAPSHOT-bin-20210623-7f937730ff/python/pyspark/pandas/tests/data_type_ops/
spark-3.2.0-SNAPSHOT-bin-20210623-7f937730ff/python/pyspark/pandas/tests/data_type_ops/test_null_ops.py
spark-3.2.0-SNAPSHOT-bin-20210623-7f937730ff/python/pyspark/pandas/tests/data_type_ops/test_binary_ops.py
spark-3.2.0-SNAPSHOT-bin-20210623-7f937730ff/python/pyspark/pandas/tests/data_type_ops/testing_utils.py
spark-3.2.0-SNAPSHOT-bin-20210623-7f937730ff/python/pyspark/pandas/tests/data_type_ops/__init__.py
spark-3.2.0-SNAPSHOT-bin-20210623-7f937730ff/python/pyspark/pandas/tests/data_type_ops/test_categorical_ops.py
spark-3.2.0-SNAPSHOT-bin-20210623-7f937730ff/python/pyspark/pandas/tests/data_type_ops/test_complex_ops.py
spark-3.2.0-SNAPSHOT-bin-20210623-7f937730ff/python/pyspark/pandas/tests/data_type_ops/test_datetime_ops.py
spark-3.2.0-SNAPSHOT-bin-20210623-7f937730ff/python/pyspark/pandas/tests/data_type_ops/test_boolean_ops.py
spark-3.2.0-SNAPSHOT-bin-20210623-7f937730ff/python/pyspark/pandas/tests/data_type_ops/test_date_ops.py
spark-3.2.0-SNAPSHOT-bin-20210623-7f937730ff/python/pyspark/pandas/tests/data_type_ops/test_udt_ops.py
spark-3.2.0-SNAPSHOT-bin-20210623-7f937730ff/python/pyspark/pandas/tests/data_type_ops/test_num_ops.py
spark-3.2.0-SNAPSHOT-bin-20210623-7f937730ff/python/pyspark/pandas/tests/data_type_ops/test_decimal_ops.py
spark-3.2.0-SNAPSHOT-bin-20210623-7f937730ff/python/pyspark/pandas/tests/data_type_ops/test_base.py
spark-3.2.0-SNAPSHOT-bin-20210623-7f937730ff/python/pyspark/pandas/tests/data_type_ops/test_string_ops.py
spark-3.2.0-SNAPSHOT-bin-20210623-7f937730ff/python/pyspark/pandas/tests/test_utils.py
spark-3.2.0-SNAPSHOT-bin-20210623-7f937730ff/python/pyspark/pandas/groupby.py
spark-3.2.0-SNAPSHOT-bin-20210623-7f937730ff/python/pyspark/pandas/accessors.py
spark-3.2.0-SNAPSHOT-bin-20210623-7f937730ff/python/pyspark/pandas/indexes/
spark-3.2.0-SNAPSHOT-bin-20210623-7f937730ff/python/pyspark/pandas/indexes/category.py
spark-3.2.0-SNAPSHOT-bin-20210623-7f937730ff/python/pyspark/pandas/indexes/datetimes.py
spark-3.2.0-SNAPSHOT-bin-20210623-7f937730ff/python/pyspark/pandas/indexes/base.py
spark-3.2.0-SNAPSHOT-bin-20210623-7f937730ff/python/pyspark/pandas/indexes/multi.py
spark-3.2.0-SNAPSHOT-bin-20210623-7f937730ff/python/pyspark/pandas/indexes/__init__.py
spark-3.2.0-SNAPSHOT-bin-20210623-7f937730ff/python/pyspark/pandas/indexes/numeric.py
spark-3.2.0-SNAPSHOT-bin-20210623-7f937730ff/python/pyspark/pandas/window.py
spark-3.2.0-SNAPSHOT-bin-20210623-7f937730ff/python/pyspark/pandas/plot/
spark-3.2.0-SNAPSHOT-bin-20210623-7f937730ff/python/pyspark/pandas/plot/__init__.py
spark-3.2.0-SNAPSHOT-bin-20210623-7f937730ff/python/pyspark/pandas/plot/matplotlib.py
spark-3.2.0-SNAPSHOT-bin-20210623-7f937730ff/python/pyspark/pandas/plot/core.py
spark-3.2.0-SNAPSHOT-bin-20210623-7f937730ff/python/pyspark/pandas/plot/plotly.py
spark-3.2.0-SNAPSHOT-bin-20210623-7f937730ff/python/pyspark/pandas/indexing.py
spark-3.2.0-SNAPSHOT-bin-20210623-7f937730ff/python/pyspark/pandas/version.py
spark-3.2.0-SNAPSHOT-bin-20210623-7f937730ff/python/pyspark/pandas/numpy_compat.py
spark-3.2.0-SNAPSHOT-bin-20210623-7f937730ff/python/pyspark/pandas/__init__.py
spark-3.2.0-SNAPSHOT-bin-20210623-7f937730ff/python/pyspark/pandas/base.py
spark-3.2.0-SNAPSHOT-bin-20210623-7f937730ff/python/pyspark/pandas/utils.py
spark-3.2.0-SNAPSHOT-bin-20210623-7f937730ff/python/pyspark/pandas/spark/
spark-3.2.0-SNAPSHOT-bin-20210623-7f937730ff/python/pyspark/pandas/spark/utils.py
spark-3.2.0-SNAPSHOT-bin-20210623-7f937730ff/python/pyspark/pandas/spark/accessors.py
spark-3.2.0-SNAPSHOT-bin-20210623-7f937730ff/python/pyspark/pandas/spark/functions.py
spark-3.2.0-SNAPSHOT-bin-20210623-7f937730ff/python/pyspark/pandas/spark/__init__.py
spark-3.2.0-SNAPSHOT-bin-20210623-7f937730ff/python/pyspark/pandas/data_type_ops/
spark-3.2.0-SNAPSHOT-bin-20210623-7f937730ff/python/pyspark/pandas/data_type_ops/date_ops.py
spark-3.2.0-SNAPSHOT-bin-20210623-7f937730ff/python/pyspark/pandas/data_type_ops/categorical_ops.py
spark-3.2.0-SNAPSHOT-bin-20210623-7f937730ff/python/pyspark/pandas/data_type_ops/datetime_ops.py
spark-3.2.0-SNAPSHOT-bin-20210623-7f937730ff/python/pyspark/pandas/data_type_ops/__init__.py
spark-3.2.0-SNAPSHOT-bin-20210623-7f937730ff/python/pyspark/pandas/data_type_ops/string_ops.py
spark-3.2.0-SNAPSHOT-bin-20210623-7f937730ff/python/pyspark/pandas/data_type_ops/boolean_ops.py
spark-3.2.0-SNAPSHOT-bin-20210623-7f937730ff/python/pyspark/pandas/data_type_ops/complex_ops.py
spark-3.2.0-SNAPSHOT-bin-20210623-7f937730ff/python/pyspark/pandas/data_type_ops/null_ops.py
spark-3.2.0-SNAPSHOT-bin-20210623-7f937730ff/python/pyspark/pandas/data_type_ops/base.py
spark-3.2.0-SNAPSHOT-bin-20210623-7f937730ff/python/pyspark/pandas/data_type_ops/binary_ops.py
spark-3.2.0-SNAPSHOT-bin-20210623-7f937730ff/python/pyspark/pandas/data_type_ops/udt_ops.py
spark-3.2.0-SNAPSHOT-bin-20210623-7f937730ff/python/pyspark/pandas/data_type_ops/num_ops.py
spark-3.2.0-SNAPSHOT-bin-20210623-7f937730ff/python/pyspark/pandas/exceptions.py
spark-3.2.0-SNAPSHOT-bin-20210623-7f937730ff/python/pyspark/pandas/sql_processor.py
spark-3.2.0-SNAPSHOT-bin-20210623-7f937730ff/python/pyspark/pandas/missing/
spark-3.2.0-SNAPSHOT-bin-20210623-7f937730ff/python/pyspark/pandas/missing/frame.py
spark-3.2.0-SNAPSHOT-bin-20210623-7f937730ff/python/pyspark/pandas/missing/series.py
spark-3.2.0-SNAPSHOT-bin-20210623-7f937730ff/python/pyspark/pandas/missing/common.py
spark-3.2.0-SNAPSHOT-bin-20210623-7f937730ff/python/pyspark/pandas/missing/indexes.py
spark-3.2.0-SNAPSHOT-bin-20210623-7f937730ff/python/pyspark/pandas/missing/window.py
spark-3.2.0-SNAPSHOT-bin-20210623-7f937730ff/python/pyspark/pandas/missing/__init__.py
spark-3.2.0-SNAPSHOT-bin-20210623-7f937730ff/python/pyspark/pandas/missing/groupby.py
spark-3.2.0-SNAPSHOT-bin-20210623-7f937730ff/python/pyspark/pandas/datetimes.py
spark-3.2.0-SNAPSHOT-bin-20210623-7f937730ff/python/pyspark/pandas/ml.py
spark-3.2.0-SNAPSHOT-bin-20210623-7f937730ff/python/pyspark/pandas/series.py
spark-3.2.0-SNAPSHOT-bin-20210623-7f937730ff/python/pyspark/pandas/config.py
spark-3.2.0-SNAPSHOT-bin-20210623-7f937730ff/python/pyspark/pandas/categorical.py
spark-3.2.0-SNAPSHOT-bin-20210623-7f937730ff/python/pyspark/pandas/namespace.py
spark-3.2.0-SNAPSHOT-bin-20210623-7f937730ff/python/pyspark/pandas/frame.py
spark-3.2.0-SNAPSHOT-bin-20210623-7f937730ff/python/pyspark/pandas/extensions.py
spark-3.2.0-SNAPSHOT-bin-20210623-7f937730ff/python/pyspark/pandas/strings.py
spark-3.2.0-SNAPSHOT-bin-20210623-7f937730ff/python/pyspark/pandas/internal.py
spark-3.2.0-SNAPSHOT-bin-20210623-7f937730ff/python/pyspark/pandas/usage_logging/
spark-3.2.0-SNAPSHOT-bin-20210623-7f937730ff/python/pyspark/pandas/usage_logging/__init__.py
spark-3.2.0-SNAPSHOT-bin-20210623-7f937730ff/python/pyspark/pandas/usage_logging/usage_logger.py
spark-3.2.0-SNAPSHOT-bin-20210623-7f937730ff/python/pyspark/pandas/mlflow.py
spark-3.2.0-SNAPSHOT-bin-20210623-7f937730ff/python/pyspark/pandas/typedef/
spark-3.2.0-SNAPSHOT-bin-20210623-7f937730ff/python/pyspark/pandas/typedef/typehints.py
spark-3.2.0-SNAPSHOT-bin-20210623-7f937730ff/python/pyspark/pandas/typedef/string_typehints.py
spark-3.2.0-SNAPSHOT-bin-20210623-7f937730ff/python/pyspark/pandas/typedef/__init__.py
spark-3.2.0-SNAPSHOT-bin-20210623-7f937730ff/python/pyspark/status.py
spark-3.2.0-SNAPSHOT-bin-20210623-7f937730ff/python/pyspark/__init__.pyi
spark-3.2.0-SNAPSHOT-bin-20210623-7f937730ff/python/pyspark/profiler.py
spark-3.2.0-SNAPSHOT-bin-20210623-7f937730ff/python/pyspark/find_spark_home.py
spark-3.2.0-SNAPSHOT-bin-20210623-7f937730ff/python/pyspark/version.pyi
spark-3.2.0-SNAPSHOT-bin-20210623-7f937730ff/python/pyspark/version.py
spark-3.2.0-SNAPSHOT-bin-20210623-7f937730ff/python/pyspark/broadcast.py
spark-3.2.0-SNAPSHOT-bin-20210623-7f937730ff/python/run-tests.py
spark-3.2.0-SNAPSHOT-bin-20210623-7f937730ff/python/setup.cfg
spark-3.2.0-SNAPSHOT-bin-20210623-7f937730ff/python/run-tests-with-coverage
spark-3.2.0-SNAPSHOT-bin-20210623-7f937730ff/python/.coveragerc
spark-3.2.0-SNAPSHOT-bin-20210623-7f937730ff/python/mypy.ini
spark-3.2.0-SNAPSHOT-bin-20210623-7f937730ff/python/pylintrc
spark-3.2.0-SNAPSHOT-bin-20210623-7f937730ff/python/MANIFEST.in
+ SPARK_INPUT_DIR=/home/jenkins/workspace/spark-master-test-k8s/resource-managers/kubernetes/integration-tests/target/spark-dist-unpacked
+ DOCKER_FILE_BASE_PATH=/home/jenkins/workspace/spark-master-test-k8s/resource-managers/kubernetes/integration-tests/target/spark-dist-unpacked/kubernetes/dockerfiles/spark
+ [[ N/A == \N\/\A ]]
++ /home/jenkins/workspace/spark-master-test-k8s/build/mvn help:evaluate -Dexpression=project.version
++ grep -v INFO
++ grep -v WARNING
++ tail -n 1
Using `mvn` from path: /home/jenkins/tools/hudson.tasks.Maven_MavenInstallation/Maven_3.6.3/bin/mvn
+ VERSION=3.2.0-SNAPSHOT
++ uuidgen
+ IMAGE_TAG=3.2.0-SNAPSHOT_2c7da6c3-e539-4821-bd41-78b43f980570
+ cd /home/jenkins/workspace/spark-master-test-k8s/resource-managers/kubernetes/integration-tests/target/spark-dist-unpacked
+ JAVA_IMAGE_TAG_BUILD_ARG='-b java_image_tag=8-jre-slim'
+ LANGUAGE_BINDING_BUILD_ARGS='-p /home/jenkins/workspace/spark-master-test-k8s/resource-managers/kubernetes/integration-tests/target/spark-dist-unpacked/kubernetes/dockerfiles/spark/bindings/python/Dockerfile'
+ tags=(${EXCLUDE_TAGS//,/ })
+ [[ ! "" =~ r ]]
+ LANGUAGE_BINDING_BUILD_ARGS='-p /home/jenkins/workspace/spark-master-test-k8s/resource-managers/kubernetes/integration-tests/target/spark-dist-unpacked/kubernetes/dockerfiles/spark/bindings/python/Dockerfile -R /home/jenkins/workspace/spark-master-test-k8s/resource-managers/kubernetes/integration-tests/target/spark-dist-unpacked/kubernetes/dockerfiles/spark/bindings/R/Dockerfile'
+ unset SPARK_HOME
+ case $DEPLOY_MODE in
+ /home/jenkins/workspace/spark-master-test-k8s/resource-managers/kubernetes/integration-tests/target/spark-dist-unpacked/bin/docker-image-tool.sh -m -r docker.io/kubespark -t 3.2.0-SNAPSHOT_2c7da6c3-e539-4821-bd41-78b43f980570 -b java_image_tag=8-jre-slim -p /home/jenkins/workspace/spark-master-test-k8s/resource-managers/kubernetes/integration-tests/target/spark-dist-unpacked/kubernetes/dockerfiles/spark/bindings/python/Dockerfile -R /home/jenkins/workspace/spark-master-test-k8s/resource-managers/kubernetes/integration-tests/target/spark-dist-unpacked/kubernetes/dockerfiles/spark/bindings/R/Dockerfile build
Sending build context to Docker daemon  275.1MB

Step 1/18 : ARG java_image_tag=11-jre-slim
Step 2/18 : FROM openjdk:${java_image_tag}
 ---> 40711810b5e5
Step 3/18 : ARG spark_uid=185
 ---> Using cache
 ---> 1e45ec55e9e8
Step 4/18 : RUN set -ex &&     sed -i 's/http:\/\/deb.\(.*\)/https:\/\/deb.\1/g' /etc/apt/sources.list &&     apt-get update &&     ln -s /lib /lib64 &&     apt install -y bash tini libc6 libpam-modules krb5-user libnss3 procps &&     mkdir -p /opt/spark &&     mkdir -p /opt/spark/examples &&     mkdir -p /opt/spark/work-dir &&     touch /opt/spark/RELEASE &&     rm /bin/sh &&     ln -sv /bin/bash /bin/sh &&     echo "auth required pam_wheel.so use_uid" >> /etc/pam.d/su &&     chgrp root /etc/passwd && chmod ug+rw /etc/passwd &&     rm -rf /var/cache/apt/*
 ---> Using cache
 ---> 15ddd59e3cbc
Step 5/18 : COPY jars /opt/spark/jars
 ---> f1df06b64e12
Step 6/18 : COPY bin /opt/spark/bin
 ---> 6b55031fcfbc
Step 7/18 : COPY sbin /opt/spark/sbin
 ---> adfa8a1aea18
Step 8/18 : COPY kubernetes/dockerfiles/spark/entrypoint.sh /opt/
 ---> e9fecbc3f161
Step 9/18 : COPY kubernetes/dockerfiles/spark/decom.sh /opt/
 ---> 8aabfff2e8ba
Step 10/18 : COPY examples /opt/spark/examples
 ---> 16d17c84bed8
Step 11/18 : COPY kubernetes/tests /opt/spark/tests
 ---> aa0cac660c31
Step 12/18 : COPY data /opt/spark/data
 ---> dc86eaf7c99d
Step 13/18 : ENV SPARK_HOME /opt/spark
 ---> Running in 0c9de8348b8e
Removing intermediate container 0c9de8348b8e
 ---> 1dab32c64a45
Step 14/18 : WORKDIR /opt/spark/work-dir
 ---> Running in a5445551e694
Removing intermediate container a5445551e694
 ---> 32b328c3af14
Step 15/18 : RUN chmod g+w /opt/spark/work-dir
 ---> Running in 0e0273521129
Removing intermediate container 0e0273521129
 ---> 15625669400e
Step 16/18 : RUN chmod a+x /opt/decom.sh
 ---> Running in 39a36a72d084
Removing intermediate container 39a36a72d084
 ---> c566b956221b
Step 17/18 : ENTRYPOINT [ "/opt/entrypoint.sh" ]
 ---> Running in 9029b17075c3
Removing intermediate container 9029b17075c3
 ---> bc11b4ede775
Step 18/18 : USER ${spark_uid}
 ---> Running in b3e5580982f5
Removing intermediate container b3e5580982f5
 ---> 18147dc6aea6
Successfully built 18147dc6aea6
Successfully tagged kubespark/spark:3.2.0-SNAPSHOT_2c7da6c3-e539-4821-bd41-78b43f980570
Sending build context to Docker daemon  275.1MB

Step 1/12 : ARG base_img
Step 2/12 : FROM $base_img
 ---> 18147dc6aea6
Step 3/12 : WORKDIR /
 ---> Running in 3aed2c9cb58e
Removing intermediate container 3aed2c9cb58e
 ---> 7cf64222a0c1
Step 4/12 : USER 0
 ---> Running in 17f356e0cc3b
Removing intermediate container 17f356e0cc3b
 ---> 7b871691b25f
Step 5/12 : RUN mkdir ${SPARK_HOME}/python
 ---> Running in 7a58175d3d8f
Removing intermediate container 7a58175d3d8f
 ---> 84a31406e852
Step 6/12 : RUN apt-get update &&     apt install -y python3 python3-pip &&     pip3 install --upgrade pip setuptools &&     rm -r /root/.cache && rm -rf /var/cache/apt/*
 ---> Running in a0992e72b733
Get:1 http://security.debian.org/debian-security buster/updates InRelease [65.4 kB]
Get:2 https://deb.debian.org/debian buster InRelease [122 kB]
Get:3 https://deb.debian.org/debian buster-updates InRelease [51.9 kB]
Get:4 http://security.debian.org/debian-security buster/updates/main amd64 Packages [293 kB]
Get:5 https://deb.debian.org/debian buster/main amd64 Packages [7907 kB]
Get:6 https://deb.debian.org/debian buster-updates/main amd64 Packages.diff/Index [7624 B]
Get:7 https://deb.debian.org/debian buster-updates/main amd64 Packages 2021-06-21-1401.46.pdiff [656 B]
Get:8 https://deb.debian.org/debian buster-updates/main amd64 Packages 2021-06-23-1401.37.pdiff [4999 B]
Get:8 https://deb.debian.org/debian buster-updates/main amd64 Packages 2021-06-23-1401.37.pdiff [4999 B]
Fetched 8451 kB in 2s (4100 kB/s)
Reading package lists...

WARNING: apt does not have a stable CLI interface. Use with caution in scripts.

Reading package lists...
Building dependency tree...
Reading state information...
The following additional packages will be installed:
  binutils binutils-common binutils-x86-64-linux-gnu build-essential bzip2 cpp
  cpp-8 dbus dh-python dirmngr dpkg-dev fakeroot file g++ g++-8 gcc gcc-8
  gir1.2-glib-2.0 gnupg gnupg-l10n gnupg-utils gpg gpg-agent gpg-wks-client
  gpg-wks-server gpgconf gpgsm libalgorithm-diff-perl
  libalgorithm-diff-xs-perl libalgorithm-merge-perl libapparmor1 libasan5
  libassuan0 libatomic1 libbinutils libc-dev-bin libc6-dev libcc1-0
  libdbus-1-3 libdpkg-perl libexpat1 libexpat1-dev libfakeroot
  libfile-fcntllock-perl libgcc-8-dev libgdbm-compat4 libgdbm6
  libgirepository-1.0-1 libglib2.0-0 libglib2.0-data libgomp1 libisl19 libitm1
  libksba8 libldap-2.4-2 libldap-common liblocale-gettext-perl liblsan0
  libmagic-mgc libmagic1 libmpc3 libmpdec2 libmpfr6 libmpx2 libnpth0
  libperl5.28 libpython3-dev libpython3-stdlib libpython3.7 libpython3.7-dev
  libpython3.7-minimal libpython3.7-stdlib libquadmath0 libreadline7
  libsasl2-2 libsasl2-modules libsasl2-modules-db libstdc++-8-dev libtsan0
  libubsan1 linux-libc-dev make manpages manpages-dev mime-support netbase
  patch perl perl-modules-5.28 pinentry-curses python-pip-whl
  python3-asn1crypto python3-cffi-backend python3-crypto python3-cryptography
  python3-dbus python3-dev python3-distutils python3-entrypoints python3-gi
  python3-keyring python3-keyrings.alt python3-lib2to3 python3-minimal
  python3-pkg-resources python3-secretstorage python3-setuptools python3-six
  python3-wheel python3-xdg python3.7 python3.7-dev python3.7-minimal
  readline-common shared-mime-info xdg-user-dirs xz-utils
Suggested packages:
  binutils-doc bzip2-doc cpp-doc gcc-8-locales default-dbus-session-bus
  | dbus-session-bus dbus-user-session libpam-systemd pinentry-gnome3 tor
  debian-keyring g++-multilib g++-8-multilib gcc-8-doc libstdc++6-8-dbg
  gcc-multilib autoconf automake libtool flex bison gdb gcc-doc gcc-8-multilib
  libgcc1-dbg libgomp1-dbg libitm1-dbg libatomic1-dbg libasan5-dbg
  liblsan0-dbg libtsan0-dbg libubsan1-dbg libmpx2-dbg libquadmath0-dbg
  parcimonie xloadimage scdaemon glibc-doc sensible-utils git bzr gdbm-l10n
  libsasl2-modules-gssapi-mit | libsasl2-modules-gssapi-heimdal
  libsasl2-modules-ldap libsasl2-modules-otp libsasl2-modules-sql
  libstdc++-8-doc make-doc man-browser ed diffutils-doc perl-doc
  libterm-readline-gnu-perl | libterm-readline-perl-perl libb-debug-perl
  liblocale-codes-perl pinentry-doc python3-doc python3-tk python3-venv
  python-crypto-doc python-cryptography-doc python3-cryptography-vectors
  python-dbus-doc python3-dbus-dbg gnome-keyring libkf5wallet-bin
  gir1.2-gnomekeyring-1.0 python-secretstorage-doc python-setuptools-doc
  python3.7-venv python3.7-doc binfmt-support readline-doc
The following NEW packages will be installed:
  binutils binutils-common binutils-x86-64-linux-gnu build-essential bzip2 cpp
  cpp-8 dbus dh-python dirmngr dpkg-dev fakeroot file g++ g++-8 gcc gcc-8
  gir1.2-glib-2.0 gnupg gnupg-l10n gnupg-utils gpg gpg-agent gpg-wks-client
  gpg-wks-server gpgconf gpgsm libalgorithm-diff-perl
  libalgorithm-diff-xs-perl libalgorithm-merge-perl libapparmor1 libasan5
  libassuan0 libatomic1 libbinutils libc-dev-bin libc6-dev libcc1-0
  libdbus-1-3 libdpkg-perl libexpat1 libexpat1-dev libfakeroot
  libfile-fcntllock-perl libgcc-8-dev libgdbm-compat4 libgdbm6
  libgirepository-1.0-1 libglib2.0-0 libglib2.0-data libgomp1 libisl19 libitm1
  libksba8 libldap-2.4-2 libldap-common liblocale-gettext-perl liblsan0
  libmagic-mgc libmagic1 libmpc3 libmpdec2 libmpfr6 libmpx2 libnpth0
  libperl5.28 libpython3-dev libpython3-stdlib libpython3.7 libpython3.7-dev
  libpython3.7-minimal libpython3.7-stdlib libquadmath0 libreadline7
  libsasl2-2 libsasl2-modules libsasl2-modules-db libstdc++-8-dev libtsan0
  libubsan1 linux-libc-dev make manpages manpages-dev mime-support netbase
  patch perl perl-modules-5.28 pinentry-curses python-pip-whl python3
  python3-asn1crypto python3-cffi-backend python3-crypto python3-cryptography
  python3-dbus python3-dev python3-distutils python3-entrypoints python3-gi
  python3-keyring python3-keyrings.alt python3-lib2to3 python3-minimal
  python3-pip python3-pkg-resources python3-secretstorage python3-setuptools
  python3-six python3-wheel python3-xdg python3.7 python3.7-dev
  python3.7-minimal readline-common shared-mime-info xdg-user-dirs xz-utils
0 upgraded, 119 newly installed, 0 to remove and 7 not upgraded.
Need to get 129 MB of archives.
After this operation, 404 MB of additional disk space will be used.
Get:1 https://deb.debian.org/debian buster/main amd64 perl-modules-5.28 all 5.28.1-6+deb10u1 [2873 kB]
Get:2 https://deb.debian.org/debian buster/main amd64 libgdbm6 amd64 1.18.1-4 [64.7 kB]
Get:3 https://deb.debian.org/debian buster/main amd64 libgdbm-compat4 amd64 1.18.1-4 [44.1 kB]
Get:4 https://deb.debian.org/debian buster/main amd64 libperl5.28 amd64 5.28.1-6+deb10u1 [3894 kB]
Get:5 https://deb.debian.org/debian buster/main amd64 perl amd64 5.28.1-6+deb10u1 [204 kB]
Get:6 https://deb.debian.org/debian buster/main amd64 liblocale-gettext-perl amd64 1.07-3+b4 [18.9 kB]
Get:7 https://deb.debian.org/debian buster/main amd64 libpython3.7-minimal amd64 3.7.3-2+deb10u3 [589 kB]
Get:8 https://deb.debian.org/debian buster/main amd64 libexpat1 amd64 2.2.6-2+deb10u1 [106 kB]
Get:9 https://deb.debian.org/debian buster/main amd64 python3.7-minimal amd64 3.7.3-2+deb10u3 [1737 kB]
Get:10 https://deb.debian.org/debian buster/main amd64 python3-minimal amd64 3.7.3-1 [36.6 kB]
Get:11 https://deb.debian.org/debian buster/main amd64 mime-support all 3.62 [37.2 kB]
Get:12 https://deb.debian.org/debian buster/main amd64 libmpdec2 amd64 2.4.2-2 [87.2 kB]
Get:13 https://deb.debian.org/debian buster/main amd64 readline-common all 7.0-5 [70.6 kB]
Get:14 https://deb.debian.org/debian buster/main amd64 libreadline7 amd64 7.0-5 [151 kB]
Get:15 https://deb.debian.org/debian buster/main amd64 libpython3.7-stdlib amd64 3.7.3-2+deb10u3 [1734 kB]
Get:16 https://deb.debian.org/debian buster/main amd64 python3.7 amd64 3.7.3-2+deb10u3 [330 kB]
Get:17 https://deb.debian.org/debian buster/main amd64 libpython3-stdlib amd64 3.7.3-1 [20.0 kB]
Get:18 https://deb.debian.org/debian buster/main amd64 python3 amd64 3.7.3-1 [61.5 kB]
Get:19 https://deb.debian.org/debian buster/main amd64 netbase all 5.6 [19.4 kB]
Get:20 https://deb.debian.org/debian buster/main amd64 bzip2 amd64 1.0.6-9.2~deb10u1 [48.4 kB]
Get:21 https://deb.debian.org/debian buster/main amd64 libapparmor1 amd64 2.13.2-10 [94.7 kB]
Get:22 https://deb.debian.org/debian buster/main amd64 libdbus-1-3 amd64 1.12.20-0+deb10u1 [215 kB]
Get:23 https://deb.debian.org/debian buster/main amd64 dbus amd64 1.12.20-0+deb10u1 [236 kB]
Get:24 https://deb.debian.org/debian buster/main amd64 libmagic-mgc amd64 1:5.35-4+deb10u2 [242 kB]
Get:25 https://deb.debian.org/debian buster/main amd64 libmagic1 amd64 1:5.35-4+deb10u2 [118 kB]
Get:26 https://deb.debian.org/debian buster/main amd64 file amd64 1:5.35-4+deb10u2 [66.4 kB]
Get:27 https://deb.debian.org/debian buster/main amd64 manpages all 4.16-2 [1295 kB]
Get:28 https://deb.debian.org/debian buster/main amd64 xz-utils amd64 5.2.4-1 [183 kB]
Get:29 https://deb.debian.org/debian buster/main amd64 binutils-common amd64 2.31.1-16 [2073 kB]
Get:30 https://deb.debian.org/debian buster/main amd64 libbinutils amd64 2.31.1-16 [478 kB]
Get:31 https://deb.debian.org/debian buster/main amd64 binutils-x86-64-linux-gnu amd64 2.31.1-16 [1823 kB]
Get:32 https://deb.debian.org/debian buster/main amd64 binutils amd64 2.31.1-16 [56.8 kB]
Get:33 https://deb.debian.org/debian buster/main amd64 libc-dev-bin amd64 2.28-10 [275 kB]
Get:34 https://deb.debian.org/debian buster-updates/main amd64 linux-libc-dev amd64 4.19.194-2 [1459 kB]
Get:35 https://deb.debian.org/debian buster/main amd64 libc6-dev amd64 2.28-10 [2691 kB]
Get:36 https://deb.debian.org/debian buster/main amd64 libisl19 amd64 0.20-2 [587 kB]
Get:37 https://deb.debian.org/debian buster/main amd64 libmpfr6 amd64 4.0.2-1 [775 kB]
Get:38 https://deb.debian.org/debian buster/main amd64 libmpc3 amd64 1.1.0-1 [41.3 kB]
Get:39 https://deb.debian.org/debian buster/main amd64 cpp-8 amd64 8.3.0-6 [8914 kB]
Get:40 https://deb.debian.org/debian buster/main amd64 cpp amd64 4:8.3.0-1 [19.4 kB]
Get:41 https://deb.debian.org/debian buster/main amd64 libcc1-0 amd64 8.3.0-6 [46.6 kB]
Get:42 https://deb.debian.org/debian buster/main amd64 libgomp1 amd64 8.3.0-6 [75.8 kB]
Get:43 https://deb.debian.org/debian buster/main amd64 libitm1 amd64 8.3.0-6 [27.7 kB]
Get:44 https://deb.debian.org/debian buster/main amd64 libatomic1 amd64 8.3.0-6 [9032 B]
Get:45 https://deb.debian.org/debian buster/main amd64 libasan5 amd64 8.3.0-6 [362 kB]
Get:46 https://deb.debian.org/debian buster/main amd64 liblsan0 amd64 8.3.0-6 [131 kB]
Get:47 https://deb.debian.org/debian buster/main amd64 libtsan0 amd64 8.3.0-6 [283 kB]
Get:48 https://deb.debian.org/debian buster/main amd64 libubsan1 amd64 8.3.0-6 [120 kB]
Get:49 https://deb.debian.org/debian buster/main amd64 libmpx2 amd64 8.3.0-6 [11.4 kB]
Get:50 https://deb.debian.org/debian buster/main amd64 libquadmath0 amd64 8.3.0-6 [133 kB]
Get:51 https://deb.debian.org/debian buster/main amd64 libgcc-8-dev amd64 8.3.0-6 [2298 kB]
Get:52 https://deb.debian.org/debian buster/main amd64 gcc-8 amd64 8.3.0-6 [9452 kB]
Get:53 https://deb.debian.org/debian buster/main amd64 gcc amd64 4:8.3.0-1 [5196 B]
Get:54 https://deb.debian.org/debian buster/main amd64 libstdc++-8-dev amd64 8.3.0-6 [1532 kB]
Get:55 https://deb.debian.org/debian buster/main amd64 g++-8 amd64 8.3.0-6 [9752 kB]
Get:56 https://deb.debian.org/debian buster/main amd64 g++ amd64 4:8.3.0-1 [1644 B]
Get:57 https://deb.debian.org/debian buster/main amd64 make amd64 4.2.1-1.2 [341 kB]
Get:58 https://deb.debian.org/debian buster/main amd64 libdpkg-perl all 1.19.7 [1414 kB]
Get:59 https://deb.debian.org/debian buster/main amd64 patch amd64 2.7.6-3+deb10u1 [126 kB]
Get:60 https://deb.debian.org/debian buster/main amd64 dpkg-dev all 1.19.7 [1773 kB]
Get:61 https://deb.debian.org/debian buster/main amd64 build-essential amd64 12.6 [7576 B]
Get:62 https://deb.debian.org/debian buster/main amd64 python3-lib2to3 all 3.7.3-1 [76.7 kB]
Get:63 https://deb.debian.org/debian buster/main amd64 python3-distutils all 3.7.3-1 [142 kB]
Get:64 https://deb.debian.org/debian buster/main amd64 dh-python all 3.20190308 [99.3 kB]
Get:65 https://deb.debian.org/debian buster/main amd64 libassuan0 amd64 2.5.2-1 [49.4 kB]
Get:66 https://deb.debian.org/debian buster/main amd64 gpgconf amd64 2.2.12-1+deb10u1 [510 kB]
Get:67 https://deb.debian.org/debian buster/main amd64 libksba8 amd64 1.3.5-2 [99.7 kB]
Get:68 https://deb.debian.org/debian buster/main amd64 libsasl2-modules-db amd64 2.1.27+dfsg-1+deb10u1 [69.1 kB]
Get:69 https://deb.debian.org/debian buster/main amd64 libsasl2-2 amd64 2.1.27+dfsg-1+deb10u1 [106 kB]
Get:70 https://deb.debian.org/debian buster/main amd64 libldap-common all 2.4.47+dfsg-3+deb10u6 [90.0 kB]
Get:71 https://deb.debian.org/debian buster/main amd64 libldap-2.4-2 amd64 2.4.47+dfsg-3+deb10u6 [224 kB]
Get:72 https://deb.debian.org/debian buster/main amd64 libnpth0 amd64 1.6-1 [18.4 kB]
Get:73 https://deb.debian.org/debian buster/main amd64 dirmngr amd64 2.2.12-1+deb10u1 [712 kB]
Get:74 https://deb.debian.org/debian buster/main amd64 libfakeroot amd64 1.23-1 [45.9 kB]
Get:75 https://deb.debian.org/debian buster/main amd64 fakeroot amd64 1.23-1 [85.8 kB]
Get:76 https://deb.debian.org/debian buster/main amd64 libglib2.0-0 amd64 2.58.3-2+deb10u3 [1259 kB]
Get:77 https://deb.debian.org/debian buster/main amd64 libgirepository-1.0-1 amd64 1.58.3-2 [92.8 kB]
Get:78 https://deb.debian.org/debian buster/main amd64 gir1.2-glib-2.0 amd64 1.58.3-2 [143 kB]
Get:79 https://deb.debian.org/debian buster/main amd64 gnupg-l10n all 2.2.12-1+deb10u1 [1010 kB]
Get:80 https://deb.debian.org/debian buster/main amd64 gnupg-utils amd64 2.2.12-1+deb10u1 [861 kB]
Get:81 https://deb.debian.org/debian buster/main amd64 gpg amd64 2.2.12-1+deb10u1 [865 kB]
Get:82 https://deb.debian.org/debian buster/main amd64 pinentry-curses amd64 1.1.0-2 [64.5 kB]
Get:83 https://deb.debian.org/debian buster/main amd64 gpg-agent amd64 2.2.12-1+deb10u1 [617 kB]
Get:84 https://deb.debian.org/debian buster/main amd64 gpg-wks-client amd64 2.2.12-1+deb10u1 [485 kB]
Get:85 https://deb.debian.org/debian buster/main amd64 gpg-wks-server amd64 2.2.12-1+deb10u1 [478 kB]
Get:86 https://deb.debian.org/debian buster/main amd64 gpgsm amd64 2.2.12-1+deb10u1 [604 kB]
Get:87 https://deb.debian.org/debian buster/main amd64 gnupg all 2.2.12-1+deb10u1 [715 kB]
Get:88 https://deb.debian.org/debian buster/main amd64 libalgorithm-diff-perl all 1.19.03-2 [47.9 kB]
Get:89 https://deb.debian.org/debian buster/main amd64 libalgorithm-diff-xs-perl amd64 0.04-5+b1 [11.8 kB]
Get:90 https://deb.debian.org/debian buster/main amd64 libalgorithm-merge-perl all 0.08-3 [12.7 kB]
Get:91 https://deb.debian.org/debian buster/main amd64 libexpat1-dev amd64 2.2.6-2+deb10u1 [153 kB]
Get:92 https://deb.debian.org/debian buster/main amd64 libfile-fcntllock-perl amd64 0.22-3+b5 [35.4 kB]
Get:93 https://deb.debian.org/debian buster/main amd64 libglib2.0-data all 2.58.3-2+deb10u3 [1111 kB]
Get:94 https://deb.debian.org/debian buster/main amd64 libpython3.7 amd64 3.7.3-2+deb10u3 [1498 kB]
Get:95 https://deb.debian.org/debian buster/main amd64 libpython3.7-dev amd64 3.7.3-2+deb10u3 [48.4 MB]
Get:96 https://deb.debian.org/debian buster/main amd64 libpython3-dev amd64 3.7.3-1 [20.1 kB]
Get:97 https://deb.debian.org/debian buster/main amd64 libsasl2-modules amd64 2.1.27+dfsg-1+deb10u1 [104 kB]
Get:98 https://deb.debian.org/debian buster/main amd64 manpages-dev all 4.16-2 [2232 kB]
Get:99 https://deb.debian.org/debian buster/main amd64 python-pip-whl all 18.1-5 [1591 kB]
Get:100 https://deb.debian.org/debian buster/main amd64 python3-asn1crypto all 0.24.0-1 [78.2 kB]
Get:101 https://deb.debian.org/debian buster/main amd64 python3-cffi-backend amd64 1.12.2-1 [79.7 kB]
Get:102 https://deb.debian.org/debian buster/main amd64 python3-crypto amd64 2.6.1-9+b1 [263 kB]
Get:103 https://deb.debian.org/debian buster/main amd64 python3-six all 1.12.0-1 [15.7 kB]
Get:104 https://deb.debian.org/debian buster/main amd64 python3-cryptography amd64 2.6.1-3+deb10u2 [219 kB]
Get:105 https://deb.debian.org/debian buster/main amd64 python3-dbus amd64 1.2.8-3 [103 kB]
Get:106 https://deb.debian.org/debian buster/main amd64 python3.7-dev amd64 3.7.3-2+deb10u3 [510 kB]
Get:107 https://deb.debian.org/debian buster/main amd64 python3-dev amd64 3.7.3-1 [1264 B]
Get:108 https://deb.debian.org/debian buster/main amd64 python3-entrypoints all 0.3-1 [5508 B]
Get:109 https://deb.debian.org/debian buster/main amd64 python3-gi amd64 3.30.4-1 [180 kB]
Get:110 https://deb.debian.org/debian buster/main amd64 python3-secretstorage all 2.3.1-2 [14.2 kB]
Get:111 https://deb.debian.org/debian buster/main amd64 python3-keyring all 17.1.1-1 [43.1 kB]
Get:112 https://deb.debian.org/debian buster/main amd64 python3-keyrings.alt all 3.1.1-1 [18.2 kB]
Get:113 https://deb.debian.org/debian buster/main amd64 python3-pip all 18.1-5 [171 kB]
Get:114 https://deb.debian.org/debian buster/main amd64 python3-pkg-resources all 40.8.0-1 [153 kB]
Get:115 https://deb.debian.org/debian buster/main amd64 python3-setuptools all 40.8.0-1 [306 kB]
Get:116 https://deb.debian.org/debian buster/main amd64 python3-wheel all 0.32.3-2 [19.4 kB]
Get:117 https://deb.debian.org/debian buster/main amd64 python3-xdg all 0.25-5 [35.9 kB]
Get:118 https://deb.debian.org/debian buster/main amd64 shared-mime-info amd64 1.10-1 [766 kB]
Get:119 https://deb.debian.org/debian buster/main amd64 xdg-user-dirs amd64 0.17-2 [53.8 kB]
debconf: delaying package configuration, since apt-utils is not installed
Fetched 129 MB in 2s (70.1 MB/s)
Selecting previously unselected package perl-modules-5.28.
(Reading database ... 
(Reading database ... 5%
(Reading database ... 10%
(Reading database ... 15%
(Reading database ... 20%
(Reading database ... 25%
(Reading database ... 30%
(Reading database ... 35%
(Reading database ... 40%
(Reading database ... 45%
(Reading database ... 50%
(Reading database ... 55%
(Reading database ... 60%
(Reading database ... 65%
(Reading database ... 70%
(Reading database ... 75%
(Reading database ... 80%
(Reading database ... 85%
(Reading database ... 90%
(Reading database ... 95%
(Reading database ... 100%
(Reading database ... 7299 files and directories currently installed.)
Preparing to unpack .../0-perl-modules-5.28_5.28.1-6+deb10u1_all.deb ...
Unpacking perl-modules-5.28 (5.28.1-6+deb10u1) ...
Selecting previously unselected package libgdbm6:amd64.
Preparing to unpack .../1-libgdbm6_1.18.1-4_amd64.deb ...
Unpacking libgdbm6:amd64 (1.18.1-4) ...
Selecting previously unselected package libgdbm-compat4:amd64.
Preparing to unpack .../2-libgdbm-compat4_1.18.1-4_amd64.deb ...
Unpacking libgdbm-compat4:amd64 (1.18.1-4) ...
Selecting previously unselected package libperl5.28:amd64.
Preparing to unpack .../3-libperl5.28_5.28.1-6+deb10u1_amd64.deb ...
Unpacking libperl5.28:amd64 (5.28.1-6+deb10u1) ...
Selecting previously unselected package perl.
Preparing to unpack .../4-perl_5.28.1-6+deb10u1_amd64.deb ...
Unpacking perl (5.28.1-6+deb10u1) ...
Selecting previously unselected package liblocale-gettext-perl.
Preparing to unpack .../5-liblocale-gettext-perl_1.07-3+b4_amd64.deb ...
Unpacking liblocale-gettext-perl (1.07-3+b4) ...
Selecting previously unselected package libpython3.7-minimal:amd64.
Preparing to unpack .../6-libpython3.7-minimal_3.7.3-2+deb10u3_amd64.deb ...
Unpacking libpython3.7-minimal:amd64 (3.7.3-2+deb10u3) ...
Selecting previously unselected package libexpat1:amd64.
Preparing to unpack .../7-libexpat1_2.2.6-2+deb10u1_amd64.deb ...
Unpacking libexpat1:amd64 (2.2.6-2+deb10u1) ...
Selecting previously unselected package python3.7-minimal.
Preparing to unpack .../8-python3.7-minimal_3.7.3-2+deb10u3_amd64.deb ...
Unpacking python3.7-minimal (3.7.3-2+deb10u3) ...
Setting up libpython3.7-minimal:amd64 (3.7.3-2+deb10u3) ...
Setting up libexpat1:amd64 (2.2.6-2+deb10u1) ...
Setting up python3.7-minimal (3.7.3-2+deb10u3) ...
Selecting previously unselected package python3-minimal.
(Reading database ... 
(Reading database ... 5%
(Reading database ... 10%
(Reading database ... 15%
(Reading database ... 20%
(Reading database ... 25%
(Reading database ... 30%
(Reading database ... 35%
(Reading database ... 40%
(Reading database ... 45%
(Reading database ... 50%
(Reading database ... 55%
(Reading database ... 60%
(Reading database ... 65%
(Reading database ... 70%
(Reading database ... 75%
(Reading database ... 80%
(Reading database ... 85%
(Reading database ... 90%
(Reading database ... 95%
(Reading database ... 100%
(Reading database ... 9510 files and directories currently installed.)
Preparing to unpack .../0-python3-minimal_3.7.3-1_amd64.deb ...
Unpacking python3-minimal (3.7.3-1) ...
Selecting previously unselected package mime-support.
Preparing to unpack .../1-mime-support_3.62_all.deb ...
Unpacking mime-support (3.62) ...
Selecting previously unselected package libmpdec2:amd64.
Preparing to unpack .../2-libmpdec2_2.4.2-2_amd64.deb ...
Unpacking libmpdec2:amd64 (2.4.2-2) ...
Selecting previously unselected package readline-common.
Preparing to unpack .../3-readline-common_7.0-5_all.deb ...
Unpacking readline-common (7.0-5) ...
Selecting previously unselected package libreadline7:amd64.
Preparing to unpack .../4-libreadline7_7.0-5_amd64.deb ...
Unpacking libreadline7:amd64 (7.0-5) ...
Selecting previously unselected package libpython3.7-stdlib:amd64.
Preparing to unpack .../5-libpython3.7-stdlib_3.7.3-2+deb10u3_amd64.deb ...
Unpacking libpython3.7-stdlib:amd64 (3.7.3-2+deb10u3) ...
Selecting previously unselected package python3.7.
Preparing to unpack .../6-python3.7_3.7.3-2+deb10u3_amd64.deb ...
Unpacking python3.7 (3.7.3-2+deb10u3) ...
Selecting previously unselected package libpython3-stdlib:amd64.
Preparing to unpack .../7-libpython3-stdlib_3.7.3-1_amd64.deb ...
Unpacking libpython3-stdlib:amd64 (3.7.3-1) ...
Setting up python3-minimal (3.7.3-1) ...
Selecting previously unselected package python3.
(Reading database ... 
(Reading database ... 5%
(Reading database ... 10%
(Reading database ... 15%
(Reading database ... 20%
(Reading database ... 25%
(Reading database ... 30%
(Reading database ... 35%
(Reading database ... 40%
(Reading database ... 45%
(Reading database ... 50%
(Reading database ... 55%
(Reading database ... 60%
(Reading database ... 65%
(Reading database ... 70%
(Reading database ... 75%
(Reading database ... 80%
(Reading database ... 85%
(Reading database ... 90%
(Reading database ... 95%
(Reading database ... 100%
(Reading database ... 9971 files and directories currently installed.)
Preparing to unpack .../000-python3_3.7.3-1_amd64.deb ...
Unpacking python3 (3.7.3-1) ...
Selecting previously unselected package netbase.
Preparing to unpack .../001-netbase_5.6_all.deb ...
Unpacking netbase (5.6) ...
Selecting previously unselected package bzip2.
Preparing to unpack .../002-bzip2_1.0.6-9.2~deb10u1_amd64.deb ...
Unpacking bzip2 (1.0.6-9.2~deb10u1) ...
Selecting previously unselected package libapparmor1:amd64.
Preparing to unpack .../003-libapparmor1_2.13.2-10_amd64.deb ...
Unpacking libapparmor1:amd64 (2.13.2-10) ...
Selecting previously unselected package libdbus-1-3:amd64.
Preparing to unpack .../004-libdbus-1-3_1.12.20-0+deb10u1_amd64.deb ...
Unpacking libdbus-1-3:amd64 (1.12.20-0+deb10u1) ...
Selecting previously unselected package dbus.
Preparing to unpack .../005-dbus_1.12.20-0+deb10u1_amd64.deb ...
Unpacking dbus (1.12.20-0+deb10u1) ...
Selecting previously unselected package libmagic-mgc.
Preparing to unpack .../006-libmagic-mgc_1%3a5.35-4+deb10u2_amd64.deb ...
Unpacking libmagic-mgc (1:5.35-4+deb10u2) ...
Selecting previously unselected package libmagic1:amd64.
Preparing to unpack .../007-libmagic1_1%3a5.35-4+deb10u2_amd64.deb ...
Unpacking libmagic1:amd64 (1:5.35-4+deb10u2) ...
Selecting previously unselected package file.
Preparing to unpack .../008-file_1%3a5.35-4+deb10u2_amd64.deb ...
Unpacking file (1:5.35-4+deb10u2) ...
Selecting previously unselected package manpages.
Preparing to unpack .../009-manpages_4.16-2_all.deb ...
Unpacking manpages (4.16-2) ...
Selecting previously unselected package xz-utils.
Preparing to unpack .../010-xz-utils_5.2.4-1_amd64.deb ...
Unpacking xz-utils (5.2.4-1) ...
Selecting previously unselected package binutils-common:amd64.
Preparing to unpack .../011-binutils-common_2.31.1-16_amd64.deb ...
Unpacking binutils-common:amd64 (2.31.1-16) ...
Selecting previously unselected package libbinutils:amd64.
Preparing to unpack .../012-libbinutils_2.31.1-16_amd64.deb ...
Unpacking libbinutils:amd64 (2.31.1-16) ...
Selecting previously unselected package binutils-x86-64-linux-gnu.
Preparing to unpack .../013-binutils-x86-64-linux-gnu_2.31.1-16_amd64.deb ...
Unpacking binutils-x86-64-linux-gnu (2.31.1-16) ...
Selecting previously unselected package binutils.
Preparing to unpack .../014-binutils_2.31.1-16_amd64.deb ...
Unpacking binutils (2.31.1-16) ...
Selecting previously unselected package libc-dev-bin.
Preparing to unpack .../015-libc-dev-bin_2.28-10_amd64.deb ...
Unpacking libc-dev-bin (2.28-10) ...
Selecting previously unselected package linux-libc-dev:amd64.
Preparing to unpack .../016-linux-libc-dev_4.19.194-2_amd64.deb ...
Unpacking linux-libc-dev:amd64 (4.19.194-2) ...
Selecting previously unselected package libc6-dev:amd64.
Preparing to unpack .../017-libc6-dev_2.28-10_amd64.deb ...
Unpacking libc6-dev:amd64 (2.28-10) ...
Selecting previously unselected package libisl19:amd64.
Preparing to unpack .../018-libisl19_0.20-2_amd64.deb ...
Unpacking libisl19:amd64 (0.20-2) ...
Selecting previously unselected package libmpfr6:amd64.
Preparing to unpack .../019-libmpfr6_4.0.2-1_amd64.deb ...
Unpacking libmpfr6:amd64 (4.0.2-1) ...
Selecting previously unselected package libmpc3:amd64.
Preparing to unpack .../020-libmpc3_1.1.0-1_amd64.deb ...
Unpacking libmpc3:amd64 (1.1.0-1) ...
Selecting previously unselected package cpp-8.
Preparing to unpack .../021-cpp-8_8.3.0-6_amd64.deb ...
Unpacking cpp-8 (8.3.0-6) ...
Selecting previously unselected package cpp.
Preparing to unpack .../022-cpp_4%3a8.3.0-1_amd64.deb ...
Unpacking cpp (4:8.3.0-1) ...
Selecting previously unselected package libcc1-0:amd64.
Preparing to unpack .../023-libcc1-0_8.3.0-6_amd64.deb ...
Unpacking libcc1-0:amd64 (8.3.0-6) ...
Selecting previously unselected package libgomp1:amd64.
Preparing to unpack .../024-libgomp1_8.3.0-6_amd64.deb ...
Unpacking libgomp1:amd64 (8.3.0-6) ...
Selecting previously unselected package libitm1:amd64.
Preparing to unpack .../025-libitm1_8.3.0-6_amd64.deb ...
Unpacking libitm1:amd64 (8.3.0-6) ...
Selecting previously unselected package libatomic1:amd64.
Preparing to unpack .../026-libatomic1_8.3.0-6_amd64.deb ...
Unpacking libatomic1:amd64 (8.3.0-6) ...
Selecting previously unselected package libasan5:amd64.
Preparing to unpack .../027-libasan5_8.3.0-6_amd64.deb ...
Unpacking libasan5:amd64 (8.3.0-6) ...
Selecting previously unselected package liblsan0:amd64.
Preparing to unpack .../028-liblsan0_8.3.0-6_amd64.deb ...
Unpacking liblsan0:amd64 (8.3.0-6) ...
Selecting previously unselected package libtsan0:amd64.
Preparing to unpack .../029-libtsan0_8.3.0-6_amd64.deb ...
Unpacking libtsan0:amd64 (8.3.0-6) ...
Selecting previously unselected package libubsan1:amd64.
Preparing to unpack .../030-libubsan1_8.3.0-6_amd64.deb ...
Unpacking libubsan1:amd64 (8.3.0-6) ...
Selecting previously unselected package libmpx2:amd64.
Preparing to unpack .../031-libmpx2_8.3.0-6_amd64.deb ...
Unpacking libmpx2:amd64 (8.3.0-6) ...
Selecting previously unselected package libquadmath0:amd64.
Preparing to unpack .../032-libquadmath0_8.3.0-6_amd64.deb ...
Unpacking libquadmath0:amd64 (8.3.0-6) ...
Selecting previously unselected package libgcc-8-dev:amd64.
Preparing to unpack .../033-libgcc-8-dev_8.3.0-6_amd64.deb ...
Unpacking libgcc-8-dev:amd64 (8.3.0-6) ...
Selecting previously unselected package gcc-8.
Preparing to unpack .../034-gcc-8_8.3.0-6_amd64.deb ...
Unpacking gcc-8 (8.3.0-6) ...
Selecting previously unselected package gcc.
Preparing to unpack .../035-gcc_4%3a8.3.0-1_amd64.deb ...
Unpacking gcc (4:8.3.0-1) ...
Selecting previously unselected package libstdc++-8-dev:amd64.
Preparing to unpack .../036-libstdc++-8-dev_8.3.0-6_amd64.deb ...
Unpacking libstdc++-8-dev:amd64 (8.3.0-6) ...
Selecting previously unselected package g++-8.
Preparing to unpack .../037-g++-8_8.3.0-6_amd64.deb ...
Unpacking g++-8 (8.3.0-6) ...
Selecting previously unselected package g++.
Preparing to unpack .../038-g++_4%3a8.3.0-1_amd64.deb ...
Unpacking g++ (4:8.3.0-1) ...
Selecting previously unselected package make.
Preparing to unpack .../039-make_4.2.1-1.2_amd64.deb ...
Unpacking make (4.2.1-1.2) ...
Selecting previously unselected package libdpkg-perl.
Preparing to unpack .../040-libdpkg-perl_1.19.7_all.deb ...
Unpacking libdpkg-perl (1.19.7) ...
Selecting previously unselected package patch.
Preparing to unpack .../041-patch_2.7.6-3+deb10u1_amd64.deb ...
Unpacking patch (2.7.6-3+deb10u1) ...
Selecting previously unselected package dpkg-dev.
Preparing to unpack .../042-dpkg-dev_1.19.7_all.deb ...
Unpacking dpkg-dev (1.19.7) ...
Selecting previously unselected package build-essential.
Preparing to unpack .../043-build-essential_12.6_amd64.deb ...
Unpacking build-essential (12.6) ...
Selecting previously unselected package python3-lib2to3.
Preparing to unpack .../044-python3-lib2to3_3.7.3-1_all.deb ...
Unpacking python3-lib2to3 (3.7.3-1) ...
Selecting previously unselected package python3-distutils.
Preparing to unpack .../045-python3-distutils_3.7.3-1_all.deb ...
Unpacking python3-distutils (3.7.3-1) ...
Selecting previously unselected package dh-python.
Preparing to unpack .../046-dh-python_3.20190308_all.deb ...
Unpacking dh-python (3.20190308) ...
Selecting previously unselected package libassuan0:amd64.
Preparing to unpack .../047-libassuan0_2.5.2-1_amd64.deb ...
Unpacking libassuan0:amd64 (2.5.2-1) ...
Selecting previously unselected package gpgconf.
Preparing to unpack .../048-gpgconf_2.2.12-1+deb10u1_amd64.deb ...
Unpacking gpgconf (2.2.12-1+deb10u1) ...
Selecting previously unselected package libksba8:amd64.
Preparing to unpack .../049-libksba8_1.3.5-2_amd64.deb ...
Unpacking libksba8:amd64 (1.3.5-2) ...
Selecting previously unselected package libsasl2-modules-db:amd64.
Preparing to unpack .../050-libsasl2-modules-db_2.1.27+dfsg-1+deb10u1_amd64.deb ...
Unpacking libsasl2-modules-db:amd64 (2.1.27+dfsg-1+deb10u1) ...
Selecting previously unselected package libsasl2-2:amd64.
Preparing to unpack .../051-libsasl2-2_2.1.27+dfsg-1+deb10u1_amd64.deb ...
Unpacking libsasl2-2:amd64 (2.1.27+dfsg-1+deb10u1) ...
Selecting previously unselected package libldap-common.
Preparing to unpack .../052-libldap-common_2.4.47+dfsg-3+deb10u6_all.deb ...
Unpacking libldap-common (2.4.47+dfsg-3+deb10u6) ...
Selecting previously unselected package libldap-2.4-2:amd64.
Preparing to unpack .../053-libldap-2.4-2_2.4.47+dfsg-3+deb10u6_amd64.deb ...
Unpacking libldap-2.4-2:amd64 (2.4.47+dfsg-3+deb10u6) ...
Selecting previously unselected package libnpth0:amd64.
Preparing to unpack .../054-libnpth0_1.6-1_amd64.deb ...
Unpacking libnpth0:amd64 (1.6-1) ...
Selecting previously unselected package dirmngr.
Preparing to unpack .../055-dirmngr_2.2.12-1+deb10u1_amd64.deb ...
Unpacking dirmngr (2.2.12-1+deb10u1) ...
Selecting previously unselected package libfakeroot:amd64.
Preparing to unpack .../056-libfakeroot_1.23-1_amd64.deb ...
Unpacking libfakeroot:amd64 (1.23-1) ...
Selecting previously unselected package fakeroot.
Preparing to unpack .../057-fakeroot_1.23-1_amd64.deb ...
Unpacking fakeroot (1.23-1) ...
Selecting previously unselected package libglib2.0-0:amd64.
Preparing to unpack .../058-libglib2.0-0_2.58.3-2+deb10u3_amd64.deb ...
Unpacking libglib2.0-0:amd64 (2.58.3-2+deb10u3) ...
Selecting previously unselected package libgirepository-1.0-1:amd64.
Preparing to unpack .../059-libgirepository-1.0-1_1.58.3-2_amd64.deb ...
Unpacking libgirepository-1.0-1:amd64 (1.58.3-2) ...
Selecting previously unselected package gir1.2-glib-2.0:amd64.
Preparing to unpack .../060-gir1.2-glib-2.0_1.58.3-2_amd64.deb ...
Unpacking gir1.2-glib-2.0:amd64 (1.58.3-2) ...
Selecting previously unselected package gnupg-l10n.
Preparing to unpack .../061-gnupg-l10n_2.2.12-1+deb10u1_all.deb ...
Unpacking gnupg-l10n (2.2.12-1+deb10u1) ...
Selecting previously unselected package gnupg-utils.
Preparing to unpack .../062-gnupg-utils_2.2.12-1+deb10u1_amd64.deb ...
Unpacking gnupg-utils (2.2.12-1+deb10u1) ...
Selecting previously unselected package gpg.
Preparing to unpack .../063-gpg_2.2.12-1+deb10u1_amd64.deb ...
Unpacking gpg (2.2.12-1+deb10u1) ...
Selecting previously unselected package pinentry-curses.
Preparing to unpack .../064-pinentry-curses_1.1.0-2_amd64.deb ...
Unpacking pinentry-curses (1.1.0-2) ...
Selecting previously unselected package gpg-agent.
Preparing to unpack .../065-gpg-agent_2.2.12-1+deb10u1_amd64.deb ...
Unpacking gpg-agent (2.2.12-1+deb10u1) ...
Selecting previously unselected package gpg-wks-client.
Preparing to unpack .../066-gpg-wks-client_2.2.12-1+deb10u1_amd64.deb ...
Unpacking gpg-wks-client (2.2.12-1+deb10u1) ...
Selecting previously unselected package gpg-wks-server.
Preparing to unpack .../067-gpg-wks-server_2.2.12-1+deb10u1_amd64.deb ...
Unpacking gpg-wks-server (2.2.12-1+deb10u1) ...
Selecting previously unselected package gpgsm.
Preparing to unpack .../068-gpgsm_2.2.12-1+deb10u1_amd64.deb ...
Unpacking gpgsm (2.2.12-1+deb10u1) ...
Selecting previously unselected package gnupg.
Preparing to unpack .../069-gnupg_2.2.12-1+deb10u1_all.deb ...
Unpacking gnupg (2.2.12-1+deb10u1) ...
Selecting previously unselected package libalgorithm-diff-perl.
Preparing to unpack .../070-libalgorithm-diff-perl_1.19.03-2_all.deb ...
Unpacking libalgorithm-diff-perl (1.19.03-2) ...
Selecting previously unselected package libalgorithm-diff-xs-perl.
Preparing to unpack .../071-libalgorithm-diff-xs-perl_0.04-5+b1_amd64.deb ...
Unpacking libalgorithm-diff-xs-perl (0.04-5+b1) ...
Selecting previously unselected package libalgorithm-merge-perl.
Preparing to unpack .../072-libalgorithm-merge-perl_0.08-3_all.deb ...
Unpacking libalgorithm-merge-perl (0.08-3) ...
Selecting previously unselected package libexpat1-dev:amd64.
Preparing to unpack .../073-libexpat1-dev_2.2.6-2+deb10u1_amd64.deb ...
Unpacking libexpat1-dev:amd64 (2.2.6-2+deb10u1) ...
Selecting previously unselected package libfile-fcntllock-perl.
Preparing to unpack .../074-libfile-fcntllock-perl_0.22-3+b5_amd64.deb ...
Unpacking libfile-fcntllock-perl (0.22-3+b5) ...
Selecting previously unselected package libglib2.0-data.
Preparing to unpack .../075-libglib2.0-data_2.58.3-2+deb10u3_all.deb ...
Unpacking libglib2.0-data (2.58.3-2+deb10u3) ...
Selecting previously unselected package libpython3.7:amd64.
Preparing to unpack .../076-libpython3.7_3.7.3-2+deb10u3_amd64.deb ...
Unpacking libpython3.7:amd64 (3.7.3-2+deb10u3) ...
Selecting previously unselected package libpython3.7-dev:amd64.
Preparing to unpack .../077-libpython3.7-dev_3.7.3-2+deb10u3_amd64.deb ...
Unpacking libpython3.7-dev:amd64 (3.7.3-2+deb10u3) ...
Selecting previously unselected package libpython3-dev:amd64.
Preparing to unpack .../078-libpython3-dev_3.7.3-1_amd64.deb ...
Unpacking libpython3-dev:amd64 (3.7.3-1) ...
Selecting previously unselected package libsasl2-modules:amd64.
Preparing to unpack .../079-libsasl2-modules_2.1.27+dfsg-1+deb10u1_amd64.deb ...
Unpacking libsasl2-modules:amd64 (2.1.27+dfsg-1+deb10u1) ...
Selecting previously unselected package manpages-dev.
Preparing to unpack .../080-manpages-dev_4.16-2_all.deb ...
Unpacking manpages-dev (4.16-2) ...
Selecting previously unselected package python-pip-whl.
Preparing to unpack .../081-python-pip-whl_18.1-5_all.deb ...
Unpacking python-pip-whl (18.1-5) ...
Selecting previously unselected package python3-asn1crypto.
Preparing to unpack .../082-python3-asn1crypto_0.24.0-1_all.deb ...
Unpacking python3-asn1crypto (0.24.0-1) ...
Selecting previously unselected package python3-cffi-backend.
Preparing to unpack .../083-python3-cffi-backend_1.12.2-1_amd64.deb ...
Unpacking python3-cffi-backend (1.12.2-1) ...
Selecting previously unselected package python3-crypto.
Preparing to unpack .../084-python3-crypto_2.6.1-9+b1_amd64.deb ...
Unpacking python3-crypto (2.6.1-9+b1) ...
Selecting previously unselected package python3-six.
Preparing to unpack .../085-python3-six_1.12.0-1_all.deb ...
Unpacking python3-six (1.12.0-1) ...
Selecting previously unselected package python3-cryptography.
Preparing to unpack .../086-python3-cryptography_2.6.1-3+deb10u2_amd64.deb ...
Unpacking python3-cryptography (2.6.1-3+deb10u2) ...
Selecting previously unselected package python3-dbus.
Preparing to unpack .../087-python3-dbus_1.2.8-3_amd64.deb ...
Unpacking python3-dbus (1.2.8-3) ...
Selecting previously unselected package python3.7-dev.
Preparing to unpack .../088-python3.7-dev_3.7.3-2+deb10u3_amd64.deb ...
Unpacking python3.7-dev (3.7.3-2+deb10u3) ...
Selecting previously unselected package python3-dev.
Preparing to unpack .../089-python3-dev_3.7.3-1_amd64.deb ...
Unpacking python3-dev (3.7.3-1) ...
Selecting previously unselected package python3-entrypoints.
Preparing to unpack .../090-python3-entrypoints_0.3-1_all.deb ...
Unpacking python3-entrypoints (0.3-1) ...
Selecting previously unselected package python3-gi.
Preparing to unpack .../091-python3-gi_3.30.4-1_amd64.deb ...
Unpacking python3-gi (3.30.4-1) ...
Selecting previously unselected package python3-secretstorage.
Preparing to unpack .../092-python3-secretstorage_2.3.1-2_all.deb ...
Unpacking python3-secretstorage (2.3.1-2) ...
Selecting previously unselected package python3-keyring.
Preparing to unpack .../093-python3-keyring_17.1.1-1_all.deb ...
Unpacking python3-keyring (17.1.1-1) ...
Selecting previously unselected package python3-keyrings.alt.
Preparing to unpack .../094-python3-keyrings.alt_3.1.1-1_all.deb ...
Unpacking python3-keyrings.alt (3.1.1-1) ...
Selecting previously unselected package python3-pip.
Preparing to unpack .../095-python3-pip_18.1-5_all.deb ...
Unpacking python3-pip (18.1-5) ...
Selecting previously unselected package python3-pkg-resources.
Preparing to unpack .../096-python3-pkg-resources_40.8.0-1_all.deb ...
Unpacking python3-pkg-resources (40.8.0-1) ...
Selecting previously unselected package python3-setuptools.
Preparing to unpack .../097-python3-setuptools_40.8.0-1_all.deb ...
Unpacking python3-setuptools (40.8.0-1) ...
Selecting previously unselected package python3-wheel.
Preparing to unpack .../098-python3-wheel_0.32.3-2_all.deb ...
Unpacking python3-wheel (0.32.3-2) ...
Selecting previously unselected package python3-xdg.
Preparing to unpack .../099-python3-xdg_0.25-5_all.deb ...
Unpacking python3-xdg (0.25-5) ...
Selecting previously unselected package shared-mime-info.
Preparing to unpack .../100-shared-mime-info_1.10-1_amd64.deb ...
Unpacking shared-mime-info (1.10-1) ...
Selecting previously unselected package xdg-user-dirs.
Preparing to unpack .../101-xdg-user-dirs_0.17-2_amd64.deb ...
Unpacking xdg-user-dirs (0.17-2) ...
Setting up perl-modules-5.28 (5.28.1-6+deb10u1) ...
Setting up libksba8:amd64 (1.3.5-2) ...
Setting up libapparmor1:amd64 (2.13.2-10) ...
Setting up mime-support (3.62) ...
Setting up xdg-user-dirs (0.17-2) ...
Setting up libmagic-mgc (1:5.35-4+deb10u2) ...
Setting up libglib2.0-0:amd64 (2.58.3-2+deb10u3) ...
No schema files found: doing nothing.
Setting up manpages (4.16-2) ...
Setting up libsasl2-modules:amd64 (2.1.27+dfsg-1+deb10u1) ...
Setting up binutils-common:amd64 (2.31.1-16) ...
Setting up libmagic1:amd64 (1:5.35-4+deb10u2) ...
Setting up linux-libc-dev:amd64 (4.19.194-2) ...
Setting up libnpth0:amd64 (1.6-1) ...
Setting up file (1:5.35-4+deb10u2) ...
Setting up libassuan0:amd64 (2.5.2-1) ...
Setting up libgomp1:amd64 (8.3.0-6) ...
Setting up bzip2 (1.0.6-9.2~deb10u1) ...
Setting up libldap-common (2.4.47+dfsg-3+deb10u6) ...
Setting up libfakeroot:amd64 (1.23-1) ...
Setting up libsasl2-modules-db:amd64 (2.1.27+dfsg-1+deb10u1) ...
Setting up fakeroot (1.23-1) ...
update-alternatives: using /usr/bin/fakeroot-sysv to provide /usr/bin/fakeroot (fakeroot) in auto mode
update-alternatives: warning: skip creation of /usr/share/man/man1/fakeroot.1.gz because associated file /usr/share/man/man1/fakeroot-sysv.1.gz (of link group fakeroot) doesn't exist
update-alternatives: warning: skip creation of /usr/share/man/man1/faked.1.gz because associated file /usr/share/man/man1/faked-sysv.1.gz (of link group fakeroot) doesn't exist
update-alternatives: warning: skip creation of /usr/share/man/es/man1/fakeroot.1.gz because associated file /usr/share/man/es/man1/fakeroot-sysv.1.gz (of link group fakeroot) doesn't exist
update-alternatives: warning: skip creation of /usr/share/man/es/man1/faked.1.gz because associated file /usr/share/man/es/man1/faked-sysv.1.gz (of link group fakeroot) doesn't exist
update-alternatives: warning: skip creation of /usr/share/man/fr/man1/fakeroot.1.gz because associated file /usr/share/man/fr/man1/fakeroot-sysv.1.gz (of link group fakeroot) doesn't exist
update-alternatives: warning: skip creation of /usr/share/man/fr/man1/faked.1.gz because associated file /usr/share/man/fr/man1/faked-sysv.1.gz (of link group fakeroot) doesn't exist
update-alternatives: warning: skip creation of /usr/share/man/sv/man1/fakeroot.1.gz because associated file /usr/share/man/sv/man1/fakeroot-sysv.1.gz (of link group fakeroot) doesn't exist
update-alternatives: warning: skip creation of /usr/share/man/sv/man1/faked.1.gz because associated file /usr/share/man/sv/man1/faked-sysv.1.gz (of link group fakeroot) doesn't exist
Setting up libasan5:amd64 (8.3.0-6) ...
Setting up libglib2.0-data (2.58.3-2+deb10u3) ...
Setting up make (4.2.1-1.2) ...
Setting up libmpfr6:amd64 (4.0.2-1) ...
Setting up gnupg-l10n (2.2.12-1+deb10u1) ...
Setting up libdbus-1-3:amd64 (1.12.20-0+deb10u1) ...
Setting up dbus (1.12.20-0+deb10u1) ...
invoke-rc.d: could not determine current runlevel
invoke-rc.d: policy-rc.d denied execution of start.
Setting up xz-utils (5.2.4-1) ...
update-alternatives: using /usr/bin/xz to provide /usr/bin/lzma (lzma) in auto mode
update-alternatives: warning: skip creation of /usr/share/man/man1/lzma.1.gz because associated file /usr/share/man/man1/xz.1.gz (of link group lzma) doesn't exist
update-alternatives: warning: skip creation of /usr/share/man/man1/unlzma.1.gz because associated file /usr/share/man/man1/unxz.1.gz (of link group lzma) doesn't exist
update-alternatives: warning: skip creation of /usr/share/man/man1/lzcat.1.gz because associated file /usr/share/man/man1/xzcat.1.gz (of link group lzma) doesn't exist
update-alternatives: warning: skip creation of /usr/share/man/man1/lzmore.1.gz because associated file /usr/share/man/man1/xzmore.1.gz (of link group lzma) doesn't exist
update-alternatives: warning: skip creation of /usr/share/man/man1/lzless.1.gz because associated file /usr/share/man/man1/xzless.1.gz (of link group lzma) doesn't exist
update-alternatives: warning: skip creation of /usr/share/man/man1/lzdiff.1.gz because associated file /usr/share/man/man1/xzdiff.1.gz (of link group lzma) doesn't exist
update-alternatives: warning: skip creation of /usr/share/man/man1/lzcmp.1.gz because associated file /usr/share/man/man1/xzcmp.1.gz (of link group lzma) doesn't exist
update-alternatives: warning: skip creation of /usr/share/man/man1/lzgrep.1.gz because associated file /usr/share/man/man1/xzgrep.1.gz (of link group lzma) doesn't exist
update-alternatives: warning: skip creation of /usr/share/man/man1/lzegrep.1.gz because associated file /usr/share/man/man1/xzegrep.1.gz (of link group lzma) doesn't exist
update-alternatives: warning: skip creation of /usr/share/man/man1/lzfgrep.1.gz because associated file /usr/share/man/man1/xzfgrep.1.gz (of link group lzma) doesn't exist
Setting up libquadmath0:amd64 (8.3.0-6) ...
Setting up shared-mime-info (1.10-1) ...
Setting up libmpc3:amd64 (1.1.0-1) ...
Setting up libatomic1:amd64 (8.3.0-6) ...
Setting up patch (2.7.6-3+deb10u1) ...
Setting up libsasl2-2:amd64 (2.1.27+dfsg-1+deb10u1) ...
Setting up libmpx2:amd64 (8.3.0-6) ...
Setting up libubsan1:amd64 (8.3.0-6) ...
Setting up libisl19:amd64 (0.20-2) ...
Setting up libgirepository-1.0-1:amd64 (1.58.3-2) ...
Setting up netbase (5.6) ...
Setting up python-pip-whl (18.1-5) ...
Setting up libmpdec2:amd64 (2.4.2-2) ...
Setting up libbinutils:amd64 (2.31.1-16) ...
Setting up cpp-8 (8.3.0-6) ...
Setting up libc-dev-bin (2.28-10) ...
Setting up readline-common (7.0-5) ...
Setting up libcc1-0:amd64 (8.3.0-6) ...
Setting up liblocale-gettext-perl (1.07-3+b4) ...
Setting up liblsan0:amd64 (8.3.0-6) ...
Setting up libitm1:amd64 (8.3.0-6) ...
Setting up libreadline7:amd64 (7.0-5) ...
Setting up libgdbm6:amd64 (1.18.1-4) ...
Setting up gnupg-utils (2.2.12-1+deb10u1) ...
Setting up binutils-x86-64-linux-gnu (2.31.1-16) ...
Setting up libtsan0:amd64 (8.3.0-6) ...
Setting up pinentry-curses (1.1.0-2) ...
Setting up manpages-dev (4.16-2) ...
Setting up libpython3.7-stdlib:amd64 (3.7.3-2+deb10u3) ...
Setting up libpython3.7:amd64 (3.7.3-2+deb10u3) ...
Setting up libldap-2.4-2:amd64 (2.4.47+dfsg-3+deb10u6) ...
Setting up binutils (2.31.1-16) ...
Setting up libgdbm-compat4:amd64 (1.18.1-4) ...
Setting up gir1.2-glib-2.0:amd64 (1.58.3-2) ...
Setting up libgcc-8-dev:amd64 (8.3.0-6) ...
Setting up libperl5.28:amd64 (5.28.1-6+deb10u1) ...
Setting up cpp (4:8.3.0-1) ...
Setting up gpgconf (2.2.12-1+deb10u1) ...
Setting up libc6-dev:amd64 (2.28-10) ...
Setting up gpg (2.2.12-1+deb10u1) ...
Setting up libpython3-stdlib:amd64 (3.7.3-1) ...
Setting up libstdc++-8-dev:amd64 (8.3.0-6) ...
Setting up python3.7 (3.7.3-2+deb10u3) ...
Setting up gcc-8 (8.3.0-6) ...
Setting up gpg-agent (2.2.12-1+deb10u1) ...
Setting up gpgsm (2.2.12-1+deb10u1) ...
Setting up python3 (3.7.3-1) ...
running python rtupdate hooks for python3.7...
running python post-rtupdate hooks for python3.7...
Setting up python3-xdg (0.25-5) ...
Setting up python3-wheel (0.32.3-2) ...
Setting up gcc (4:8.3.0-1) ...
Setting up python3-six (1.12.0-1) ...
Setting up dirmngr (2.2.12-1+deb10u1) ...
Setting up perl (5.28.1-6+deb10u1) ...
Setting up libexpat1-dev:amd64 (2.2.6-2+deb10u1) ...
Setting up python3-gi (3.30.4-1) ...
Setting up libdpkg-perl (1.19.7) ...
Setting up gpg-wks-server (2.2.12-1+deb10u1) ...
Setting up g++-8 (8.3.0-6) ...
Setting up python3-crypto (2.6.1-9+b1) ...
Setting up python3-lib2to3 (3.7.3-1) ...
Setting up python3-asn1crypto (0.24.0-1) ...
Setting up python3-cffi-backend (1.12.2-1) ...
Setting up python3-pkg-resources (40.8.0-1) ...
Setting up python3-entrypoints (0.3-1) ...
Setting up python3-distutils (3.7.3-1) ...
Setting up dh-python (3.20190308) ...
Setting up python3-dbus (1.2.8-3) ...
Setting up python3-setuptools (40.8.0-1) ...
Setting up gpg-wks-client (2.2.12-1+deb10u1) ...
Setting up libfile-fcntllock-perl (0.22-3+b5) ...
Setting up libalgorithm-diff-perl (1.19.03-2) ...
Setting up libpython3.7-dev:amd64 (3.7.3-2+deb10u3) ...
Setting up python3.7-dev (3.7.3-2+deb10u3) ...
Setting up dpkg-dev (1.19.7) ...
Setting up python3-cryptography (2.6.1-3+deb10u2) ...
Setting up python3-pip (18.1-5) ...
Setting up g++ (4:8.3.0-1) ...
update-alternatives: using /usr/bin/g++ to provide /usr/bin/c++ (c++) in auto mode
Setting up python3-keyrings.alt (3.1.1-1) ...
Setting up gnupg (2.2.12-1+deb10u1) ...
Setting up build-essential (12.6) ...
Setting up libalgorithm-diff-xs-perl (0.04-5+b1) ...
Setting up libalgorithm-merge-perl (0.08-3) ...
Setting up libpython3-dev:amd64 (3.7.3-1) ...
Setting up python3-secretstorage (2.3.1-2) ...
Setting up python3-dev (3.7.3-1) ...
Setting up python3-keyring (17.1.1-1) ...
Processing triggers for libc-bin (2.28-10) ...
Collecting pip
  Downloading https://files.pythonhosted.org/packages/cd/82/04e9aaf603fdbaecb4323b9e723f13c92c245f6ab2902195c53987848c78/pip-21.1.2-py3-none-any.whl (1.5MB)
Collecting setuptools
  Downloading https://files.pythonhosted.org/packages/4e/78/56aa1b5f4d8ac548755ae767d84f0be54fdd9d404197a3d9e4659d272348/setuptools-57.0.0-py3-none-any.whl (821kB)
Installing collected packages: pip, setuptools
  Found existing installation: pip 18.1
    Not uninstalling pip at /usr/lib/python3/dist-packages, outside environment /usr
    Can't uninstall 'pip'. No files were found to uninstall.
  Found existing installation: setuptools 40.8.0
    Not uninstalling setuptools at /usr/lib/python3/dist-packages, outside environment /usr
    Can't uninstall 'setuptools'. No files were found to uninstall.
Successfully installed pip-21.1.2 setuptools-57.0.0
Removing intermediate container a0992e72b733
 ---> bf4d5db49380
Step 7/12 : COPY python/pyspark ${SPARK_HOME}/python/pyspark
 ---> abc4df0af743
Step 8/12 : COPY python/lib ${SPARK_HOME}/python/lib
 ---> e4ccac76cecb
Step 9/12 : WORKDIR /opt/spark/work-dir
 ---> Running in 706277ea3397
Removing intermediate container 706277ea3397
 ---> 9d0f1e7a1383
Step 10/12 : ENTRYPOINT [ "/opt/entrypoint.sh" ]
 ---> Running in 1b75af7b3954
Removing intermediate container 1b75af7b3954
 ---> b3f61337ccad
Step 11/12 : ARG spark_uid=185
 ---> Running in 988e978a8310
Removing intermediate container 988e978a8310
 ---> 934d82b573d4
Step 12/12 : USER ${spark_uid}
 ---> Running in a5074a39c409
Removing intermediate container a5074a39c409
 ---> 267382c9ff93
[Warning] One or more build-args [java_image_tag] were not consumed
Successfully built 267382c9ff93
Successfully tagged kubespark/spark-py:3.2.0-SNAPSHOT_2c7da6c3-e539-4821-bd41-78b43f980570
Sending build context to Docker daemon  275.1MB

Step 1/12 : ARG base_img
Step 2/12 : FROM $base_img
 ---> 18147dc6aea6
Step 3/12 : WORKDIR /
 ---> Using cache
 ---> 7cf64222a0c1
Step 4/12 : USER 0
 ---> Using cache
 ---> 7b871691b25f
Step 5/12 : RUN mkdir ${SPARK_HOME}/R
 ---> Running in 6123a71cc017
Removing intermediate container 6123a71cc017
 ---> 3959ec3b0fcb
Step 6/12 : RUN   apt-get update &&   apt install -y gnupg &&   echo "deb http://cloud.r-project.org/bin/linux/debian buster-cran35/" >> /etc/apt/sources.list &&   (apt-key adv --keyserver keys.gnupg.net --recv-key 'E19F5F87128899B192B1A2C2AD5F960A256A04AF' || apt-key adv --keyserver keys.openpgp.org --recv-key 'E19F5F87128899B192B1A2C2AD5F960A256A04AF') &&   apt-get update &&   apt install -y -t buster-cran35 r-base r-base-dev &&   rm -rf /var/cache/apt/*
 ---> Running in f90eb78999d0
Get:1 http://security.debian.org/debian-security buster/updates InRelease [65.4 kB]
Get:2 https://deb.debian.org/debian buster InRelease [122 kB]
Get:3 https://deb.debian.org/debian buster-updates InRelease [51.9 kB]
Get:4 http://security.debian.org/debian-security buster/updates/main amd64 Packages [293 kB]
Get:5 https://deb.debian.org/debian buster/main amd64 Packages [7907 kB]
Get:6 https://deb.debian.org/debian buster-updates/main amd64 Packages.diff/Index [7624 B]
Get:7 https://deb.debian.org/debian buster-updates/main amd64 Packages 2021-06-21-1401.46.pdiff [656 B]
Get:8 https://deb.debian.org/debian buster-updates/main amd64 Packages 2021-06-23-1401.37.pdiff [4999 B]
Get:8 https://deb.debian.org/debian buster-updates/main amd64 Packages 2021-06-23-1401.37.pdiff [4999 B]
Fetched 8451 kB in 2s (4109 kB/s)
Reading package lists...

WARNING: apt does not have a stable CLI interface. Use with caution in scripts.

Reading package lists...
Building dependency tree...
Reading state information...
The following additional packages will be installed:
  dirmngr gnupg-l10n gnupg-utils gpg gpg-agent gpg-wks-client gpg-wks-server
  gpgconf gpgsm libassuan0 libksba8 libldap-2.4-2 libldap-common libnpth0
  libreadline7 libsasl2-2 libsasl2-modules libsasl2-modules-db pinentry-curses
  readline-common
Suggested packages:
  dbus-user-session libpam-systemd pinentry-gnome3 tor parcimonie xloadimage
  scdaemon libsasl2-modules-gssapi-mit | libsasl2-modules-gssapi-heimdal
  libsasl2-modules-ldap libsasl2-modules-otp libsasl2-modules-sql pinentry-doc
  readline-doc
The following NEW packages will be installed:
  dirmngr gnupg gnupg-l10n gnupg-utils gpg gpg-agent gpg-wks-client
  gpg-wks-server gpgconf gpgsm libassuan0 libksba8 libldap-2.4-2
  libldap-common libnpth0 libreadline7 libsasl2-2 libsasl2-modules
  libsasl2-modules-db pinentry-curses readline-common
0 upgraded, 21 newly installed, 0 to remove and 7 not upgraded.
Need to get 7904 kB of archives.
After this operation, 16.6 MB of additional disk space will be used.
Get:1 https://deb.debian.org/debian buster/main amd64 readline-common all 7.0-5 [70.6 kB]
Get:2 https://deb.debian.org/debian buster/main amd64 libassuan0 amd64 2.5.2-1 [49.4 kB]
Get:3 https://deb.debian.org/debian buster/main amd64 libreadline7 amd64 7.0-5 [151 kB]
Get:4 https://deb.debian.org/debian buster/main amd64 gpgconf amd64 2.2.12-1+deb10u1 [510 kB]
Get:5 https://deb.debian.org/debian buster/main amd64 libksba8 amd64 1.3.5-2 [99.7 kB]
Get:6 https://deb.debian.org/debian buster/main amd64 libsasl2-modules-db amd64 2.1.27+dfsg-1+deb10u1 [69.1 kB]
Get:7 https://deb.debian.org/debian buster/main amd64 libsasl2-2 amd64 2.1.27+dfsg-1+deb10u1 [106 kB]
Get:8 https://deb.debian.org/debian buster/main amd64 libldap-common all 2.4.47+dfsg-3+deb10u6 [90.0 kB]
Get:9 https://deb.debian.org/debian buster/main amd64 libldap-2.4-2 amd64 2.4.47+dfsg-3+deb10u6 [224 kB]
Get:10 https://deb.debian.org/debian buster/main amd64 libnpth0 amd64 1.6-1 [18.4 kB]
Get:11 https://deb.debian.org/debian buster/main amd64 dirmngr amd64 2.2.12-1+deb10u1 [712 kB]
Get:12 https://deb.debian.org/debian buster/main amd64 gnupg-l10n all 2.2.12-1+deb10u1 [1010 kB]
Get:13 https://deb.debian.org/debian buster/main amd64 gnupg-utils amd64 2.2.12-1+deb10u1 [861 kB]
Get:14 https://deb.debian.org/debian buster/main amd64 gpg amd64 2.2.12-1+deb10u1 [865 kB]
Get:15 https://deb.debian.org/debian buster/main amd64 pinentry-curses amd64 1.1.0-2 [64.5 kB]
Get:16 https://deb.debian.org/debian buster/main amd64 gpg-agent amd64 2.2.12-1+deb10u1 [617 kB]
Get:17 https://deb.debian.org/debian buster/main amd64 gpg-wks-client amd64 2.2.12-1+deb10u1 [485 kB]
Get:18 https://deb.debian.org/debian buster/main amd64 gpg-wks-server amd64 2.2.12-1+deb10u1 [478 kB]
Get:19 https://deb.debian.org/debian buster/main amd64 gpgsm amd64 2.2.12-1+deb10u1 [604 kB]
Get:20 https://deb.debian.org/debian buster/main amd64 gnupg all 2.2.12-1+deb10u1 [715 kB]
Get:21 https://deb.debian.org/debian buster/main amd64 libsasl2-modules amd64 2.1.27+dfsg-1+deb10u1 [104 kB]
debconf: delaying package configuration, since apt-utils is not installed
Fetched 7904 kB in 0s (47.3 MB/s)
Selecting previously unselected package readline-common.
(Reading database ... 
(Reading database ... 5%
(Reading database ... 10%
(Reading database ... 15%
(Reading database ... 20%
(Reading database ... 25%
(Reading database ... 30%
(Reading database ... 35%
(Reading database ... 40%
(Reading database ... 45%
(Reading database ... 50%
(Reading database ... 55%
(Reading database ... 60%
(Reading database ... 65%
(Reading database ... 70%
(Reading database ... 75%
(Reading database ... 80%
(Reading database ... 85%
(Reading database ... 90%
(Reading database ... 95%
(Reading database ... 100%
(Reading database ... 7299 files and directories currently installed.)
Preparing to unpack .../00-readline-common_7.0-5_all.deb ...
Unpacking readline-common (7.0-5) ...
Selecting previously unselected package libassuan0:amd64.
Preparing to unpack .../01-libassuan0_2.5.2-1_amd64.deb ...
Unpacking libassuan0:amd64 (2.5.2-1) ...
Selecting previously unselected package libreadline7:amd64.
Preparing to unpack .../02-libreadline7_7.0-5_amd64.deb ...
Unpacking libreadline7:amd64 (7.0-5) ...
Selecting previously unselected package gpgconf.
Preparing to unpack .../03-gpgconf_2.2.12-1+deb10u1_amd64.deb ...
Unpacking gpgconf (2.2.12-1+deb10u1) ...
Selecting previously unselected package libksba8:amd64.
Preparing to unpack .../04-libksba8_1.3.5-2_amd64.deb ...
Unpacking libksba8:amd64 (1.3.5-2) ...
Selecting previously unselected package libsasl2-modules-db:amd64.
Preparing to unpack .../05-libsasl2-modules-db_2.1.27+dfsg-1+deb10u1_amd64.deb ...
Unpacking libsasl2-modules-db:amd64 (2.1.27+dfsg-1+deb10u1) ...
Selecting previously unselected package libsasl2-2:amd64.
Preparing to unpack .../06-libsasl2-2_2.1.27+dfsg-1+deb10u1_amd64.deb ...
Unpacking libsasl2-2:amd64 (2.1.27+dfsg-1+deb10u1) ...
Selecting previously unselected package libldap-common.
Preparing to unpack .../07-libldap-common_2.4.47+dfsg-3+deb10u6_all.deb ...
Unpacking libldap-common (2.4.47+dfsg-3+deb10u6) ...
Selecting previously unselected package libldap-2.4-2:amd64.
Preparing to unpack .../08-libldap-2.4-2_2.4.47+dfsg-3+deb10u6_amd64.deb ...
Unpacking libldap-2.4-2:amd64 (2.4.47+dfsg-3+deb10u6) ...
Selecting previously unselected package libnpth0:amd64.
Preparing to unpack .../09-libnpth0_1.6-1_amd64.deb ...
Unpacking libnpth0:amd64 (1.6-1) ...
Selecting previously unselected package dirmngr.
Preparing to unpack .../10-dirmngr_2.2.12-1+deb10u1_amd64.deb ...
Unpacking dirmngr (2.2.12-1+deb10u1) ...
Selecting previously unselected package gnupg-l10n.
Preparing to unpack .../11-gnupg-l10n_2.2.12-1+deb10u1_all.deb ...
Unpacking gnupg-l10n (2.2.12-1+deb10u1) ...
Selecting previously unselected package gnupg-utils.
Preparing to unpack .../12-gnupg-utils_2.2.12-1+deb10u1_amd64.deb ...
Unpacking gnupg-utils (2.2.12-1+deb10u1) ...
Selecting previously unselected package gpg.
Preparing to unpack .../13-gpg_2.2.12-1+deb10u1_amd64.deb ...
Unpacking gpg (2.2.12-1+deb10u1) ...
Selecting previously unselected package pinentry-curses.
Preparing to unpack .../14-pinentry-curses_1.1.0-2_amd64.deb ...
Unpacking pinentry-curses (1.1.0-2) ...
Selecting previously unselected package gpg-agent.
Preparing to unpack .../15-gpg-agent_2.2.12-1+deb10u1_amd64.deb ...
Unpacking gpg-agent (2.2.12-1+deb10u1) ...
Selecting previously unselected package gpg-wks-client.
Preparing to unpack .../16-gpg-wks-client_2.2.12-1+deb10u1_amd64.deb ...
Unpacking gpg-wks-client (2.2.12-1+deb10u1) ...
Selecting previously unselected package gpg-wks-server.
Preparing to unpack .../17-gpg-wks-server_2.2.12-1+deb10u1_amd64.deb ...
Unpacking gpg-wks-server (2.2.12-1+deb10u1) ...
Selecting previously unselected package gpgsm.
Preparing to unpack .../18-gpgsm_2.2.12-1+deb10u1_amd64.deb ...
Unpacking gpgsm (2.2.12-1+deb10u1) ...
Selecting previously unselected package gnupg.
Preparing to unpack .../19-gnupg_2.2.12-1+deb10u1_all.deb ...
Unpacking gnupg (2.2.12-1+deb10u1) ...
Selecting previously unselected package libsasl2-modules:amd64.
Preparing to unpack .../20-libsasl2-modules_2.1.27+dfsg-1+deb10u1_amd64.deb ...
Unpacking libsasl2-modules:amd64 (2.1.27+dfsg-1+deb10u1) ...
Setting up libksba8:amd64 (1.3.5-2) ...
Setting up libsasl2-modules:amd64 (2.1.27+dfsg-1+deb10u1) ...
Setting up libnpth0:amd64 (1.6-1) ...
Setting up libassuan0:amd64 (2.5.2-1) ...
Setting up libldap-common (2.4.47+dfsg-3+deb10u6) ...
Setting up libsasl2-modules-db:amd64 (2.1.27+dfsg-1+deb10u1) ...
Setting up gnupg-l10n (2.2.12-1+deb10u1) ...
Setting up libsasl2-2:amd64 (2.1.27+dfsg-1+deb10u1) ...
Setting up readline-common (7.0-5) ...
Setting up libreadline7:amd64 (7.0-5) ...
Setting up gnupg-utils (2.2.12-1+deb10u1) ...
Setting up pinentry-curses (1.1.0-2) ...
Setting up libldap-2.4-2:amd64 (2.4.47+dfsg-3+deb10u6) ...
Setting up gpgconf (2.2.12-1+deb10u1) ...
Setting up gpg (2.2.12-1+deb10u1) ...
Setting up gpg-agent (2.2.12-1+deb10u1) ...
Setting up gpgsm (2.2.12-1+deb10u1) ...
Setting up dirmngr (2.2.12-1+deb10u1) ...
Setting up gpg-wks-server (2.2.12-1+deb10u1) ...
Setting up gpg-wks-client (2.2.12-1+deb10u1) ...
Setting up gnupg (2.2.12-1+deb10u1) ...
Processing triggers for libc-bin (2.28-10) ...
Warning: apt-key output should not be parsed (stdout is not a terminal)
Executing: /tmp/apt-key-gpghome.ftanwAEON1/gpg.1.sh --keyserver keys.gnupg.net --recv-key E19F5F87128899B192B1A2C2AD5F960A256A04AF
gpg: keyserver receive failed: No name
Warning: apt-key output should not be parsed (stdout is not a terminal)
Executing: /tmp/apt-key-gpghome.14l9SXkif2/gpg.1.sh --keyserver keys.openpgp.org --recv-key E19F5F87128899B192B1A2C2AD5F960A256A04AF
gpg: key AD5F960A256A04AF: new key but contains no user ID - skipped
gpg: Total number processed: 1
gpg:           w/o user IDs: 1
Hit:1 http://security.debian.org/debian-security buster/updates InRelease
Get:2 http://cloud.r-project.org/bin/linux/debian buster-cran35/ InRelease [4375 B]
Hit:3 https://deb.debian.org/debian buster InRelease
Hit:4 https://deb.debian.org/debian buster-updates InRelease
Err:2 http://cloud.r-project.org/bin/linux/debian buster-cran35/ InRelease
  The following signatures couldn't be verified because the public key is not available: NO_PUBKEY FCAE2A0E115C3D8A
Reading package lists...
W: GPG error: http://cloud.r-project.org/bin/linux/debian buster-cran35/ InRelease: The following signatures couldn't be verified because the public key is not available: NO_PUBKEY FCAE2A0E115C3D8A
E: The repository 'http://cloud.r-project.org/bin/linux/debian buster-cran35/ InRelease' is not signed.
The command '/bin/sh -c apt-get update &&   apt install -y gnupg &&   echo "deb http://cloud.r-project.org/bin/linux/debian buster-cran35/" >> /etc/apt/sources.list &&   (apt-key adv --keyserver keys.gnupg.net --recv-key 'E19F5F87128899B192B1A2C2AD5F960A256A04AF' || apt-key adv --keyserver keys.openpgp.org --recv-key 'E19F5F87128899B192B1A2C2AD5F960A256A04AF') &&   apt-get update &&   apt install -y -t buster-cran35 r-base r-base-dev &&   rm -rf /var/cache/apt/*' returned a non-zero code: 100
Failed to build SparkR Docker image, please refer to Docker build output for details.
[ERROR] Command execution failed.
org.apache.commons.exec.ExecuteException: Process exited with an error: 1 (Exit value: 1)
    at org.apache.commons.exec.DefaultExecutor.executeInternal (DefaultExecutor.java:404)
    at org.apache.commons.exec.DefaultExecutor.execute (DefaultExecutor.java:166)
    at org.codehaus.mojo.exec.ExecMojo.executeCommandLine (ExecMojo.java:804)
    at org.codehaus.mojo.exec.ExecMojo.executeCommandLine (ExecMojo.java:751)
    at org.codehaus.mojo.exec.ExecMojo.execute (ExecMojo.java:313)
    at org.apache.maven.plugin.DefaultBuildPluginManager.executeMojo (DefaultBuildPluginManager.java:137)
    at org.apache.maven.lifecycle.internal.MojoExecutor.execute (MojoExecutor.java:210)
    at org.apache.maven.lifecycle.internal.MojoExecutor.execute (MojoExecutor.java:156)
    at org.apache.maven.lifecycle.internal.MojoExecutor.execute (MojoExecutor.java:148)
    at org.apache.maven.lifecycle.internal.LifecycleModuleBuilder.buildProject (LifecycleModuleBuilder.java:117)
    at org.apache.maven.lifecycle.internal.LifecycleModuleBuilder.buildProject (LifecycleModuleBuilder.java:81)
    at org.apache.maven.lifecycle.internal.builder.singlethreaded.SingleThreadedBuilder.build (SingleThreadedBuilder.java:56)
    at org.apache.maven.lifecycle.internal.LifecycleStarter.execute (LifecycleStarter.java:128)
    at org.apache.maven.DefaultMaven.doExecute (DefaultMaven.java:305)
    at org.apache.maven.DefaultMaven.doExecute (DefaultMaven.java:192)
    at org.apache.maven.DefaultMaven.execute (DefaultMaven.java:105)
    at org.apache.maven.cli.MavenCli.execute (MavenCli.java:957)
    at org.apache.maven.cli.MavenCli.doMain (MavenCli.java:289)
    at org.apache.maven.cli.MavenCli.main (MavenCli.java:193)
    at sun.reflect.NativeMethodAccessorImpl.invoke0 (Native Method)
    at sun.reflect.NativeMethodAccessorImpl.invoke (NativeMethodAccessorImpl.java:62)
    at sun.reflect.DelegatingMethodAccessorImpl.invoke (DelegatingMethodAccessorImpl.java:43)
    at java.lang.reflect.Method.invoke (Method.java:498)
    at org.codehaus.plexus.classworlds.launcher.Launcher.launchEnhanced (Launcher.java:282)
    at org.codehaus.plexus.classworlds.launcher.Launcher.launch (Launcher.java:225)
    at org.codehaus.plexus.classworlds.launcher.Launcher.mainWithExitCode (Launcher.java:406)
    at org.codehaus.plexus.classworlds.launcher.Launcher.main (Launcher.java:347)
[INFO] ------------------------------------------------------------------------
[INFO] Reactor Summary for Spark Project Parent POM 3.2.0-SNAPSHOT:
[INFO] 
[INFO] Spark Project Parent POM ........................... SUCCESS [  5.368 s]
[INFO] Spark Project Tags ................................. SUCCESS [ 13.074 s]
[INFO] Spark Project Local DB ............................. SUCCESS [  9.840 s]
[INFO] Spark Project Networking ........................... SUCCESS [ 15.995 s]
[INFO] Spark Project Shuffle Streaming Service ............ SUCCESS [ 12.165 s]
[INFO] Spark Project Unsafe ............................... SUCCESS [ 16.987 s]
[INFO] Spark Project Launcher ............................. SUCCESS [  8.736 s]
[INFO] Spark Project Core ................................. SUCCESS [03:49 min]
[INFO] Spark Project Kubernetes Integration Tests ......... FAILURE [01:52 min]
[INFO] ------------------------------------------------------------------------
[INFO] BUILD FAILURE
[INFO] ------------------------------------------------------------------------
[INFO] Total time:  07:05 min
[INFO] Finished at: 2021-06-23T07:42:12-07:00
[INFO] ------------------------------------------------------------------------
[ERROR] Failed to execute goal org.codehaus.mojo:exec-maven-plugin:1.6.0:exec (setup-integration-test-env) on project spark-kubernetes-integration-tests_2.12: Command execution failed.: Process exited with an error: 1 (Exit value: 1) -> [Help 1]
[ERROR] 
[ERROR] To see the full stack trace of the errors, re-run Maven with the -e switch.
[ERROR] Re-run Maven using the -X switch to enable full debug logging.
[ERROR] 
[ERROR] For more information about the errors and possible solutions, please read the following articles:
[ERROR] [Help 1] http://cwiki.apache.org/confluence/display/MAVEN/MojoExecutionException
[ERROR] 
[ERROR] After correcting the problems, you can resume the build with the command
[ERROR]   mvn <args> -rf :spark-kubernetes-integration-tests_2.12
+ retcode3=1
+ kill -9 2898294
+ minikube stop
* Stopping node "minikube"  ...
* Powering off "minikube" via SSH ...
* 1 nodes stopped.
/tmp/jenkins6296095886165145786.sh: line 68: 2898294 Killed                  minikube mount ${PVC_TESTS_HOST_PATH}:${PVC_TESTS_VM_PATH} --9p-version=9p2000.L
+ rm -rf /tmp/tmp.2IGIV42RbG
+ exit 1
Build step 'Execute shell' marked build as failure
Archiving artifacts
Finished: FAILURE