FailedConsole Output

GitHub pull request #66 of commit b40a9b8702960feada68bcd5ade6a0d544af166f automatically merged.
[EnvInject] - Loading node environment variables.
Building remotely on amp-jenkins-worker-01 (centos mongodb) in workspace /home/jenkins/workspace/RNAdam-prb
 > git rev-parse --is-inside-work-tree # timeout=10
Fetching changes from the remote Git repository
 > git config remote.origin.url https://github.com/bigdatagenomics/RNAdam.git # timeout=10
Fetching upstream changes from https://github.com/bigdatagenomics/RNAdam.git
 > git --version # timeout=10
 > git fetch --tags --progress https://github.com/bigdatagenomics/RNAdam.git +refs/pull/*:refs/remotes/origin/pr/*
 > git rev-parse origin/pr/66/merge^{commit} # timeout=10
 > git branch -a --contains bc15e6829ac422e8511ffca901af276931dbccc7 # timeout=10
 > git rev-parse remotes/origin/pr/66/merge^{commit} # timeout=10
Checking out Revision bc15e6829ac422e8511ffca901af276931dbccc7 (origin/pr/66/merge)
 > git config core.sparsecheckout # timeout=10
 > git checkout -f bc15e6829ac422e8511ffca901af276931dbccc7
First time build. Skipping changelog.
Triggering RNAdam-prb ? 2.3.0,centos
Triggering RNAdam-prb ? 2.2.0,centos
Triggering RNAdam-prb ? 1.0.4,centos
RNAdam-prb ? 2.3.0,centos completed with result FAILURE
RNAdam-prb ? 2.2.0,centos completed with result FAILURE
RNAdam-prb ? 1.0.4,centos completed with result FAILURE
Test FAILed.
Refer to this link for build results (access rights to CI server needed): 
https://amplab.cs.berkeley.edu/jenkins//job/RNAdam-prb/80/
Test FAILed.
Finished: FAILURE