FailedConsole Output

GitHub pull request #66 of commit d801ae46ff82ee3e0127df0100f2518bfcee5a8e automatically merged.
[EnvInject] - Loading node environment variables.
Building remotely on amp-jenkins-worker-01 (centos mongodb) in workspace /home/jenkins/workspace/RNAdam-prb
 > git rev-parse --is-inside-work-tree # timeout=10
Fetching changes from the remote Git repository
 > git config remote.origin.url https://github.com/bigdatagenomics/RNAdam.git # timeout=10
Fetching upstream changes from https://github.com/bigdatagenomics/RNAdam.git
 > git --version # timeout=10
 > git fetch --tags --progress https://github.com/bigdatagenomics/RNAdam.git +refs/pull/*:refs/remotes/origin/pr/*
 > git rev-parse origin/pr/66/merge^{commit} # timeout=10
 > git branch -a --contains c13199a09f36aeddb5d4021c09c5c68606da3608 # timeout=10
 > git rev-parse remotes/origin/pr/66/merge^{commit} # timeout=10
Checking out Revision c13199a09f36aeddb5d4021c09c5c68606da3608 (origin/pr/66/merge)
 > git config core.sparsecheckout # timeout=10
 > git checkout -f c13199a09f36aeddb5d4021c09c5c68606da3608
First time build. Skipping changelog.
Triggering RNAdam-prb ? 2.3.0,centos
Triggering RNAdam-prb ? 2.2.0,centos
Triggering RNAdam-prb ? 1.0.4,centos
RNAdam-prb ? 2.3.0,centos completed with result FAILURE
RNAdam-prb ? 2.2.0,centos completed with result FAILURE
RNAdam-prb ? 1.0.4,centos completed with result FAILURE
Test FAILed.
Refer to this link for build results (access rights to CI server needed): 
https://amplab.cs.berkeley.edu/jenkins//job/RNAdam-prb/82/
Test FAILed.
Finished: FAILURE