FailedConsole Output

GitHub pull request #81 of commit aabc5dc1c64b7ec761f308ec1234c53d3b7d0635 automatically merged.
[EnvInject] - Loading node environment variables.
Building remotely on amp-jenkins-worker-01 (spark-packaging spark-experimental-docker centos spark-docs spark-release spark-compile) in workspace /home/jenkins/workspace/RNAdam-prb
 > git rev-parse --is-inside-work-tree # timeout=10
Fetching changes from the remote Git repository
 > git config remote.origin.url https://github.com/bigdatagenomics/RNAdam.git # timeout=10
Fetching upstream changes from https://github.com/bigdatagenomics/RNAdam.git
 > git --version # timeout=10
 > git fetch --tags --progress https://github.com/bigdatagenomics/RNAdam.git +refs/pull/*:refs/remotes/origin/pr/*
 > git rev-parse origin/pr/81/merge^{commit} # timeout=10
 > git branch -a --contains 1dcef433b8129e801053fb37b1622d6052f6f2a5 # timeout=10
 > git rev-parse remotes/origin/pr/81/merge^{commit} # timeout=10
Checking out Revision 1dcef433b8129e801053fb37b1622d6052f6f2a5 (origin/pr/81/merge)
 > git config core.sparsecheckout # timeout=10
 > git checkout -f 1dcef433b8129e801053fb37b1622d6052f6f2a5
First time build. Skipping changelog.
Triggering RNAdam-prb ? 2.2.0,centos
Triggering RNAdam-prb ? 1.0.4,centos
Triggering RNAdam-prb ? 2.3.0,centos
RNAdam-prb ? 2.2.0,centos completed with result FAILURE
RNAdam-prb ? 1.0.4,centos completed with result FAILURE
RNAdam-prb ? 2.3.0,centos completed with result FAILURE
Test FAILed.
Refer to this link for build results (access rights to CI server needed): 
https://amplab.cs.berkeley.edu/jenkins//job/RNAdam-prb/99/
Test FAILed.
Finished: FAILURE