FailedConsole Output

GitHub pull request #42 of commit e87df860d3274777e62588cc970df6681dfc5e11 automatically merged.
[EnvInject] - Loading node environment variables.
Building remotely on amp-jenkins-worker-05 (centos spark-test) in workspace /home/jenkins/workspace/Succinct-PRB
[WS-CLEANUP] Deleting project workspace...
Cloning the remote Git repository
Cloning repository https://github.com/amplab/succinct.git
 > /home/jenkins/git2/bin/git init /home/jenkins/workspace/Succinct-PRB # timeout=10
Fetching upstream changes from https://github.com/amplab/succinct.git
 > /home/jenkins/git2/bin/git --version # timeout=10
 > /home/jenkins/git2/bin/git fetch --tags --progress https://github.com/amplab/succinct.git +refs/heads/*:refs/remotes/origin/*
 > /home/jenkins/git2/bin/git config remote.origin.url https://github.com/amplab/succinct.git # timeout=10
 > /home/jenkins/git2/bin/git config --add remote.origin.fetch +refs/heads/*:refs/remotes/origin/* # timeout=10
 > /home/jenkins/git2/bin/git config remote.origin.url https://github.com/amplab/succinct.git # timeout=10
Fetching upstream changes from https://github.com/amplab/succinct.git
 > /home/jenkins/git2/bin/git fetch --tags --progress https://github.com/amplab/succinct.git +refs/pull/*:refs/remotes/origin/pr/*
 > /home/jenkins/git2/bin/git rev-parse origin/pr/42/merge^{commit} # timeout=10
 > /home/jenkins/git2/bin/git branch -a -v --no-abbrev --contains 129898d02fc8f5bfa36b6f024432a28ae3d11a14 # timeout=10
Checking out Revision 129898d02fc8f5bfa36b6f024432a28ae3d11a14 (origin/pr/42/merge)
 > /home/jenkins/git2/bin/git config core.sparsecheckout # timeout=10
 > /home/jenkins/git2/bin/git checkout -f 129898d02fc8f5bfa36b6f024432a28ae3d11a14
First time build. Skipping changelog.
Parsing POMs
Modules changed, recalculating dependency graph
maven3-agent.jar already up to date
maven3-interceptor.jar already up to date
maven3-interceptor-commons.jar already up to date
[Succinct-PRB] $ java -Xmx12g -XX:MaxPermSize=6g -cp /home/jenkins/maven3-agent.jar:/home/jenkins/tools/hudson.tasks.Maven_MavenInstallation/Maven_3.0.5/boot/plexus-classworlds-2.4.jar org.jvnet.hudson.maven3.agent.Maven3Main /home/jenkins/tools/hudson.tasks.Maven_MavenInstallation/Maven_3.0.5 /home/jenkins/slave.jar /home/jenkins/maven3-interceptor.jar /home/jenkins/maven3-interceptor-commons.jar 38513
<===[JENKINS REMOTING CAPACITY]===>channel started
Executing Maven:  -B -f /home/jenkins/workspace/Succinct-PRB/pom.xml clean install
[INFO] Scanning for projects...
[INFO] ------------------------------------------------------------------------
[INFO] Reactor Build Order:
[INFO] 
[INFO] Succinct
[INFO] Succinct Core
[INFO] Succinct Serialization/Deserialization
[INFO] Succinct on Apache Spark
[INFO] Succinct Assembly
[HUDSON] Collecting dependencies info
[HUDSON] Collecting dependencies info
[HUDSON] Collecting dependencies info
[HUDSON] Collecting dependencies info
[HUDSON] Collecting dependencies info
[INFO]                                                                         
[INFO] ------------------------------------------------------------------------
[INFO] Building Succinct 0.1.8
[INFO] ------------------------------------------------------------------------
[INFO] 
[INFO] --- maven-clean-plugin:2.4.1:clean (default-clean) @ succinct ---
[INFO] 
[INFO] --- maven-enforcer-plugin:1.3.1:enforce (enforce-versions) @ succinct ---
[INFO] 
[INFO] --- maven-dependency-plugin:2.1:copy (copy-artifact) @ succinct ---
[INFO] Configured Artifact: amplab:succinct:0.1.8:pom
[INFO] Copying pom.xml to /home/jenkins/workspace/Succinct-PRB/target/pom.xml
[INFO] 
[INFO] --- maven-install-plugin:2.3.1:install (default-install) @ succinct ---
[INFO] Installing /home/jenkins/workspace/Succinct-PRB/pom.xml to /home/jenkins/.m2/repository/amplab/succinct/0.1.8/succinct-0.1.8.pom
[INFO]                                                                         
[INFO] ------------------------------------------------------------------------
[INFO] Building Succinct Core 0.1.8
[INFO] ------------------------------------------------------------------------
[INFO] 
[INFO] --- maven-clean-plugin:2.4.1:clean (default-clean) @ succinct-core ---
[INFO] 
[INFO] --- maven-enforcer-plugin:1.3.1:enforce (enforce-versions) @ succinct-core ---
[INFO] 
[INFO] --- maven-resources-plugin:2.5:resources (default-resources) @ succinct-core ---
[debug] execute contextualize
[INFO] Using 'UTF-8' encoding to copy filtered resources.
[INFO] skip non existing resourceDirectory /home/jenkins/workspace/Succinct-PRB/core/src/main/resources
[INFO] 
[INFO] --- maven-compiler-plugin:2.5.1:compile (default-compile) @ succinct-core ---
[INFO] Compiling 66 source files to /home/jenkins/workspace/Succinct-PRB/core/target/classes
[INFO] 
[INFO] --- maven-resources-plugin:2.5:testResources (default-testResources) @ succinct-core ---
[debug] execute contextualize
[INFO] Using 'UTF-8' encoding to copy filtered resources.
[INFO] Copying 8 resources
[INFO] 
[INFO] --- maven-compiler-plugin:2.5.1:testCompile (default-testCompile) @ succinct-core ---
[INFO] Compiling 37 source files to /home/jenkins/workspace/Succinct-PRB/core/target/test-classes
[INFO] 
[INFO] --- maven-surefire-plugin:2.10:test (default-test) @ succinct-core ---
[INFO] Surefire report directory: /home/jenkins/workspace/Succinct-PRB/core/target/surefire-reports

-------------------------------------------------------
 T E S T S
-------------------------------------------------------
Running edu.berkeley.cs.succinct.buffers.SuccinctBuffer2Test
Tests run: 7, Failures: 0, Errors: 0, Skipped: 0, Time elapsed: 3.598 sec
Running edu.berkeley.cs.succinct.buffers.SuccinctIndexedFileBufferTest
Tests run: 10, Failures: 0, Errors: 0, Skipped: 0, Time elapsed: 1.334 sec
Running edu.berkeley.cs.succinct.buffers.SuccinctFileBuffer3Test
Tests run: 2, Failures: 0, Errors: 0, Skipped: 0, Time elapsed: 0.118 sec
Running edu.berkeley.cs.succinct.buffers.SuccinctFileBuffer2Test
Tests run: 8, Failures: 0, Errors: 0, Skipped: 0, Time elapsed: 0.779 sec
Running edu.berkeley.cs.succinct.buffers.SuccinctBufferTest
Tests run: 7, Failures: 0, Errors: 0, Skipped: 0, Time elapsed: 9.431 sec
Running edu.berkeley.cs.succinct.buffers.SuccinctFileBufferTest
Tests run: 8, Failures: 0, Errors: 0, Skipped: 0, Time elapsed: 1.024 sec
Running edu.berkeley.cs.succinct.buffers.SuccinctIndexedFileBuffer2Test
Tests run: 10, Failures: 0, Errors: 0, Skipped: 0, Time elapsed: 1.129 sec
Running edu.berkeley.cs.succinct.regex.parser.RegExParserTest
Tests run: 1, Failures: 0, Errors: 0, Skipped: 0, Time elapsed: 0.001 sec
Running edu.berkeley.cs.succinct.regex.executor.SuccinctBwdRegExExecutorTest
Tests run: 2, Failures: 0, Errors: 0, Skipped: 0, Time elapsed: 0.126 sec
Running edu.berkeley.cs.succinct.regex.executor.SuccinctFwdRegExExecutorTest
Tests run: 2, Failures: 0, Errors: 0, Skipped: 0, Time elapsed: 0.127 sec
Running edu.berkeley.cs.succinct.util.DictionaryUtilsTest
Tests run: 4, Failures: 0, Errors: 0, Skipped: 0, Time elapsed: 0.003 sec
Running edu.berkeley.cs.succinct.util.vector.IntVectorTest
Tests run: 4, Failures: 0, Errors: 0, Skipped: 0, Time elapsed: 0.167 sec
Running edu.berkeley.cs.succinct.util.vector.BitVectorTest
Tests run: 6, Failures: 0, Errors: 0, Skipped: 0, Time elapsed: 0.057 sec
Running edu.berkeley.cs.succinct.util.vector.DeltaEncodedIntVectorTest
Tests run: 4, Failures: 0, Errors: 0, Skipped: 0, Time elapsed: 0.71 sec
Running edu.berkeley.cs.succinct.util.bitmap.BitMapTest
Tests run: 9, Failures: 0, Errors: 0, Skipped: 0, Time elapsed: 0.051 sec
Running edu.berkeley.cs.succinct.util.bitmap.BMArrayTest
Tests run: 1, Failures: 0, Errors: 0, Skipped: 0, Time elapsed: 0.002 sec
Running edu.berkeley.cs.succinct.util.CommonUtilsTest
Tests run: 4, Failures: 0, Errors: 0, Skipped: 0, Time elapsed: 0.001 sec
Running edu.berkeley.cs.succinct.util.dictionary.DictionaryTest
Tests run: 3, Failures: 0, Errors: 0, Skipped: 0, Time elapsed: 0.067 sec
Running edu.berkeley.cs.succinct.util.wavelettree.WaveletTreeTest
Tests run: 1, Failures: 0, Errors: 0, Skipped: 0, Time elapsed: 0.007 sec
Running edu.berkeley.cs.succinct.util.container.IntArrayListTest
Tests run: 2, Failures: 0, Errors: 0, Skipped: 0, Time elapsed: 0.018 sec
Running edu.berkeley.cs.succinct.util.suffixarray.DivSufSortTest
Tests run: 1, Failures: 0, Errors: 0, Skipped: 0, Time elapsed: 0.076 sec
Running edu.berkeley.cs.succinct.util.suffixarray.QSufSortTest
Tests run: 3, Failures: 0, Errors: 0, Skipped: 0, Time elapsed: 0.16 sec
Running edu.berkeley.cs.succinct.util.suffixarray.SAISTest
Tests run: 2, Failures: 0, Errors: 0, Skipped: 0, Time elapsed: 0.265 sec
Running edu.berkeley.cs.succinct.util.buffer.serops.BitVectorOpsTest
Tests run: 2, Failures: 0, Errors: 0, Skipped: 0, Time elapsed: 0.033 sec
Running edu.berkeley.cs.succinct.util.buffer.serops.BitMapOpsTest
Tests run: 2, Failures: 0, Errors: 0, Skipped: 0, Time elapsed: 0.001 sec
Running edu.berkeley.cs.succinct.util.buffer.serops.ArrayOpsTest
Tests run: 1, Failures: 0, Errors: 0, Skipped: 0, Time elapsed: 0 sec
Running edu.berkeley.cs.succinct.util.buffer.serops.WaveletTreeOpsTest
Tests run: 1, Failures: 0, Errors: 0, Skipped: 0, Time elapsed: 0 sec
Running edu.berkeley.cs.succinct.util.buffer.serops.DictionaryOpsTest
Tests run: 4, Failures: 0, Errors: 0, Skipped: 0, Time elapsed: 0.06 sec
Running edu.berkeley.cs.succinct.util.buffer.serops.DeltaEncodedIntVectorOpsTest
Tests run: 2, Failures: 0, Errors: 0, Skipped: 0, Time elapsed: 2.257 sec
Running edu.berkeley.cs.succinct.util.buffer.serops.BMArrayOpsTest
Tests run: 1, Failures: 0, Errors: 0, Skipped: 0, Time elapsed: 0.001 sec
Running edu.berkeley.cs.succinct.util.buffer.serops.IntVectorOpsTest
Tests run: 1, Failures: 0, Errors: 0, Skipped: 0, Time elapsed: 0.027 sec
Running edu.berkeley.cs.succinct.util.BitUtilsTest
Tests run: 4, Failures: 0, Errors: 0, Skipped: 0, Time elapsed: 0.002 sec

Results :

Tests run: 119, Failures: 0, Errors: 0, Skipped: 0

[JENKINS] Recording test results
[INFO] 
[INFO] --- maven-jar-plugin:2.4:jar (default-jar) @ succinct-core ---
[INFO] Building jar: /home/jenkins/workspace/Succinct-PRB/core/target/succinct-core-0.1.8.jar
[INFO] 
[INFO] --- maven-dependency-plugin:2.1:copy (copy-artifact) @ succinct-core ---
[INFO] Configured Artifact: amplab:succinct-core:0.1.8:jar
[INFO] amplab:succinct-core:0.1.8:jar already exists in /home/jenkins/workspace/Succinct-PRB/core/target
[INFO] 
[INFO] --- maven-jar-plugin:2.4:jar (default) @ succinct-core ---
[INFO] 
[INFO] --- maven-jar-plugin:2.4:test-jar (default) @ succinct-core ---
[INFO] Building jar: /home/jenkins/workspace/Succinct-PRB/core/target/succinct-core-0.1.8-tests.jar
[INFO] 
[INFO] --- maven-assembly-plugin:2.5.5:single (make-assembly) @ succinct-core ---
[INFO] Building jar: /home/jenkins/workspace/Succinct-PRB/core/target/succinct-core-0.1.8-jar-with-dependencies.jar
[INFO] 
[INFO] --- maven-install-plugin:2.3.1:install (default-install) @ succinct-core ---
[INFO] Installing /home/jenkins/workspace/Succinct-PRB/core/target/succinct-core-0.1.8.jar to /home/jenkins/.m2/repository/amplab/succinct-core/0.1.8/succinct-core-0.1.8.jar
[INFO] Installing /home/jenkins/workspace/Succinct-PRB/core/pom.xml to /home/jenkins/.m2/repository/amplab/succinct-core/0.1.8/succinct-core-0.1.8.pom
[INFO] Installing /home/jenkins/workspace/Succinct-PRB/core/target/succinct-core-0.1.8-tests.jar to /home/jenkins/.m2/repository/amplab/succinct-core/0.1.8/succinct-core-0.1.8-tests.jar
[INFO] Installing /home/jenkins/workspace/Succinct-PRB/core/target/succinct-core-0.1.8-jar-with-dependencies.jar to /home/jenkins/.m2/repository/amplab/succinct-core/0.1.8/succinct-core-0.1.8-jar-with-dependencies.jar
[INFO]                                                                         
[INFO] ------------------------------------------------------------------------
[INFO] Building Succinct Serialization/Deserialization 0.1.8
[INFO] ------------------------------------------------------------------------
[INFO] 
[INFO] --- maven-clean-plugin:2.4.1:clean (default-clean) @ succinct-serde ---
[INFO] 
[INFO] --- maven-enforcer-plugin:1.3.1:enforce (enforce-versions) @ succinct-serde ---
[INFO] 
[INFO] --- maven-resources-plugin:2.5:resources (default-resources) @ succinct-serde ---
[debug] execute contextualize
[INFO] Using 'UTF-8' encoding to copy filtered resources.
[INFO] skip non existing resourceDirectory /home/jenkins/workspace/Succinct-PRB/serde/src/main/resources
[INFO] 
[INFO] --- maven-compiler-plugin:2.5.1:compile (default-compile) @ succinct-serde ---
[INFO] Compiling 12 source files to /home/jenkins/workspace/Succinct-PRB/serde/target/classes
[INFO] -------------------------------------------------------------
[ERROR] COMPILATION ERROR : 
[INFO] -------------------------------------------------------------
[ERROR] /home/jenkins/workspace/Succinct-PRB/serde/src/main/java/edu/berkeley/cs/succinct/object/deserializer/JsonDeserializer.java:[119,54] error: ';' expected
[INFO] 1 error
[INFO] -------------------------------------------------------------
[INFO] ------------------------------------------------------------------------
[INFO] Reactor Summary:
[INFO] 
[INFO] Succinct .......................................... SUCCESS [2.131s]
[INFO] Succinct Core ..................................... SUCCESS [29.774s]
[INFO] Succinct Serialization/Deserialization ............ FAILURE [0.156s]
[INFO] Succinct on Apache Spark .......................... SKIPPED
[INFO] Succinct Assembly ................................. SKIPPED
[INFO] ------------------------------------------------------------------------
[INFO] BUILD FAILURE
[INFO] ------------------------------------------------------------------------
[INFO] Total time: 33.092s
[INFO] Finished at: Sat Feb 02 13:41:28 PST 2019
[INFO] Final Memory: 27M/1931M
[INFO] ------------------------------------------------------------------------
Waiting for Jenkins to finish collecting data
[ERROR] Failed to execute goal org.apache.maven.plugins:maven-compiler-plugin:2.5.1:compile (default-compile) on project succinct-serde: Compilation failure
[ERROR] /home/jenkins/workspace/Succinct-PRB/serde/src/main/java/edu/berkeley/cs/succinct/object/deserializer/JsonDeserializer.java:[119,54] error: ';' expected
[ERROR] -> [Help 1]
[ERROR] 
[ERROR] To see the full stack trace of the errors, re-run Maven with the -e switch.
[ERROR] Re-run Maven using the -X switch to enable full debug logging.
[ERROR] 
[ERROR] For more information about the errors and possible solutions, please read the following articles:
[ERROR] [Help 1] http://cwiki.apache.org/confluence/display/MAVEN/MojoFailureException
[ERROR] 
[ERROR] After correcting the problems, you can resume the build with the command
[ERROR]   mvn <goals> -rf :succinct-serde
[JENKINS] Archiving /home/jenkins/workspace/Succinct-PRB/assembly/pom.xml to amplab/succinct-assembly/0.1.8/succinct-assembly-0.1.8.pom
[JENKINS] Archiving /home/jenkins/workspace/Succinct-PRB/pom.xml to amplab/succinct/0.1.8/succinct-0.1.8.pom
[JENKINS] Archiving /home/jenkins/workspace/Succinct-PRB/spark/pom.xml to amplab/succinct-spark/0.1.8/succinct-spark-0.1.8.pom
[JENKINS] Archiving /home/jenkins/workspace/Succinct-PRB/serde/pom.xml to amplab/succinct-serde/0.1.8/succinct-serde-0.1.8.pom
[JENKINS] Archiving /home/jenkins/workspace/Succinct-PRB/core/pom.xml to amplab/succinct-core/0.1.8/succinct-core-0.1.8.pom
[JENKINS] Archiving /home/jenkins/workspace/Succinct-PRB/core/target/succinct-core-0.1.8.jar to amplab/succinct-core/0.1.8/succinct-core-0.1.8.jar
[JENKINS] Archiving /home/jenkins/workspace/Succinct-PRB/core/target/succinct-core-0.1.8-tests.jar to amplab/succinct-core/0.1.8/succinct-core-0.1.8-tests.jar
[JENKINS] Archiving /home/jenkins/workspace/Succinct-PRB/core/target/succinct-core-0.1.8-jar-with-dependencies.jar to amplab/succinct-core/0.1.8/succinct-core-0.1.8-jar-with-dependencies.jar
Sending e-mails to: anuragk@berkeley.edu
channel stopped
Test FAILed.
Refer to this link for build results (access rights to CI server needed): 
https://amplab.cs.berkeley.edu/jenkins//job/Succinct-PRB/3/<h2>Build result: FAILURE</span></h2>[...truncated 216 lines...][INFO] ------------------------------------------------------------------------Waiting for Jenkins to finish collecting data[ERROR] Failed to execute goal org.apache.maven.plugins:maven-compiler-plugin:2.5.1:compile (default-compile) on project succinct-serde: Compilation failure[ERROR] /home/jenkins/workspace/Succinct-PRB/serde/src/main/java/edu/berkeley/cs/succinct/object/deserializer/JsonDeserializer.java:[119,54] error: ';' expected[ERROR] -> [Help 1][ERROR] [ERROR] To see the full stack trace of the errors, re-run Maven with the -e switch.[ERROR] Re-run Maven using the -X switch to enable full debug logging.[ERROR] [ERROR] For more information about the errors and possible solutions, please read the following articles:[ERROR] [Help 1] http://cwiki.apache.org/confluence/display/MAVEN/MojoFailureException[ERROR] [ERROR] After correcting the problems, you can resume the build with the command[ERROR]   mvn <goals> -rf :succinct-serde[JENKINS] Archiving /home/jenkins/workspace/Succinct-PRB/assembly/pom.xml to amplab/succinct-assembly/0.1.8/succinct-assembly-0.1.8.pom[JENKINS] Archiving /home/jenkins/workspace/Succinct-PRB/pom.xml to amplab/succinct/0.1.8/succinct-0.1.8.pom[JENKINS] Archiving /home/jenkins/workspace/Succinct-PRB/spark/pom.xml to amplab/succinct-spark/0.1.8/succinct-spark-0.1.8.pom[JENKINS] Archiving /home/jenkins/workspace/Succinct-PRB/serde/pom.xml to amplab/succinct-serde/0.1.8/succinct-serde-0.1.8.pom[JENKINS] Archiving /home/jenkins/workspace/Succinct-PRB/core/pom.xml to amplab/succinct-core/0.1.8/succinct-core-0.1.8.pom[JENKINS] Archiving /home/jenkins/workspace/Succinct-PRB/core/target/succinct-core-0.1.8.jar to amplab/succinct-core/0.1.8/succinct-core-0.1.8.jar[JENKINS] Archiving /home/jenkins/workspace/Succinct-PRB/core/target/succinct-core-0.1.8-tests.jar to amplab/succinct-core/0.1.8/succinct-core-0.1.8-tests.jar[JENKINS] Archiving /home/jenkins/workspace/Succinct-PRB/core/target/succinct-core-0.1.8-jar-with-dependencies.jar to amplab/succinct-core/0.1.8/succinct-core-0.1.8-jar-with-dependencies.jarSending e-mails to: anuragk@berkeley.educhannel stopped
Test FAILed.
Sending e-mails to: anuragk@berkeley.edu
Finished: FAILURE