FailedConsole Output

Skipping 9,623 KB.. Full Log
45],[46],[47],[48],[49],[50],[51],[52],[53],[54],[55],[56],[57],[58],[59],[60],[61],[62],[63],[64],[65],[66],[67],[68],[69],[70],[71],[72],[73],[74],[75],[76],[77],[78],[79],[80],[81],[82],[83],[84],[85],[86],[87],[88],[89],[90],[91],[92],[93],[94]
     StopStream
     AddKafkaData(topics = Set(stress14, stress4, stress6, stress12, stress2, stress8, stress1, stress5, stress3, stress16), data = Range(94, 95, 96, 97, 98, 99), message = )
     AddKafkaData(topics = Set(stress14, stress4, stress6, stress12, stress2, stress8, stress1, stress5, stress18, stress3, stress16), data = Range(100, 101, 102, 103, 104, 105, 106, 107), message = Add topic stress19)
     AddKafkaData(topics = Set(stress14, stress4, stress6, stress12, stress2, stress8, stress1, stress5, stress18, stress3, stress16), data = Range(108, 109, 110, 111, 112, 113, 114, 115, 116), message = )
     AddKafkaData(topics = Set(stress14, stress4, stress6, stress12, stress2, stress8, stress1, stress5, stress18, stress3, stress16), data = Range(117, 118, 119, 120, 121, 122), message = )
     StartStream(ProcessingTime(0),org.apache.spark.util.SystemClock@2a02a253,Map(),null)
     AddKafkaData(topics = Set(stress14, stress4, stress6, stress12, stress2, stress20, stress8, stress1, stress5, stress18, stress3, stress16), data = Range(123, 124, 125, 126, 127), message = Add topic stress21)
     AddKafkaData(topics = Set(stress14, stress4, stress6, stress12, stress2, stress20, stress8, stress1, stress5, stress18, stress22, stress3, stress16), data = Range(128, 129, 130, 131, 132, 133, 134, 135, 136), message = Add topic stress23)
     CheckAnswer: [1],[2],[3],[4],[5],[6],[7],[8],[9],[10],[11],[12],[13],[14],[15],[16],[17],[18],[19],[20],[21],[22],[23],[24],[25],[26],[27],[28],[29],[30],[31],[32],[33],[34],[35],[36],[37],[38],[39],[40],[41],[42],[43],[44],[45],[46],[47],[48],[49],[50],[51],[52],[53],[54],[55],[56],[57],[58],[59],[60],[61],[62],[63],[64],[65],[66],[67],[68],[69],[70],[71],[72],[73],[74],[75],[76],[77],[78],[79],[80],[81],[82],[83],[84],[85],[86],[87],[88],[89],[90],[91],[92],[93],[94],[95],[96],[97],[98],[99],[100],[101],[102],[103],[104],[105],[106],[107],[108],[109],[110],[111],[112],[113],[114],[115],[116],[117],[118],[119],[120],[121],[122],[123],[124],[125],[126],[127],[128],[129],[130],[131],[132],[133],[134],[135],[136],[137]
     StopStream
     AddKafkaData(topics = Set(stress14, stress4, stress6, stress12, stress2, stress20, stress8, stress1, stress5, stress18, stress22, stress3, stress16), data = Range(137, 138, 139, 140, 141, 142, 143, 144, 145), message = )
     StartStream(ProcessingTime(0),org.apache.spark.util.SystemClock@3408c39d,Map(),null)
     CheckAnswer: [1],[2],[3],[4],[5],[6],[7],[8],[9],[10],[11],[12],[13],[14],[15],[16],[17],[18],[19],[20],[21],[22],[23],[24],[25],[26],[27],[28],[29],[30],[31],[32],[33],[34],[35],[36],[37],[38],[39],[40],[41],[42],[43],[44],[45],[46],[47],[48],[49],[50],[51],[52],[53],[54],[55],[56],[57],[58],[59],[60],[61],[62],[63],[64],[65],[66],[67],[68],[69],[70],[71],[72],[73],[74],[75],[76],[77],[78],[79],[80],[81],[82],[83],[84],[85],[86],[87],[88],[89],[90],[91],[92],[93],[94],[95],[96],[97],[98],[99],[100],[101],[102],[103],[104],[105],[106],[107],[108],[109],[110],[111],[112],[113],[114],[115],[116],[117],[118],[119],[120],[121],[122],[123],[124],[125],[126],[127],[128],[129],[130],[131],[132],[133],[134],[135],[136],[137],[138],[139],[140],[141],[142],[143],[144],[145],[146]
     StopStream
     AddKafkaData(topics = Set(stress14, stress4, stress6, stress12, stress2, stress20, stress8, stress1, stress5, stress18, stress22, stress3, stress16), data = Range(146, 147, 148, 149), message = )
     AddKafkaData(topics = Set(stress14, stress4, stress6, stress12, stress2, stress20, stress8, stress1, stress5, stress18, stress22, stress3, stress16), data = Range(150, 151, 152, 153, 154, 155, 156), message = )
     AddKafkaData(topics = Set(stress14, stress4, stress6, stress12, stress2, stress20, stress8, stress1, stress5, stress18, stress22, stress3, stress16), data = Range(157, 158, 159, 160, 161, 162, 163, 164), message = )
     StartStream(ProcessingTime(0),org.apache.spark.util.SystemClock@4599c485,Map(),null)
     CheckAnswer: [1],[2],[3],[4],[5],[6],[7],[8],[9],[10],[11],[12],[13],[14],[15],[16],[17],[18],[19],[20],[21],[22],[23],[24],[25],[26],[27],[28],[29],[30],[31],[32],[33],[34],[35],[36],[37],[38],[39],[40],[41],[42],[43],[44],[45],[46],[47],[48],[49],[50],[51],[52],[53],[54],[55],[56],[57],[58],[59],[60],[61],[62],[63],[64],[65],[66],[67],[68],[69],[70],[71],[72],[73],[74],[75],[76],[77],[78],[79],[80],[81],[82],[83],[84],[85],[86],[87],[88],[89],[90],[91],[92],[93],[94],[95],[96],[97],[98],[99],[100],[101],[102],[103],[104],[105],[106],[107],[108],[109],[110],[111],[112],[113],[114],[115],[116],[117],[118],[119],[120],[121],[122],[123],[124],[125],[126],[127],[128],[129],[130],[131],[132],[133],[134],[135],[136],[137],[138],[139],[140],[141],[142],[143],[144],[145],[146],[147],[148],[149],[150],[151],[152],[153],[154],[155],[156],[157],[158],[159],[160],[161],[162],[163],[164],[165]
     AddKafkaData(topics = Set(stress14, stress24, stress4, stress6, stress12, stress2, stress20, stress8, stress1, stress5, stress18, stress22, stress3, stress16), data = Range(165, 166, 167, 168), message = Add topic stress25)
     AddKafkaData(topics = Set(stress14, stress24, stress4, stress6, stress12, stress2, stress20, stress8, stress1, stress5, stress22, stress3, stress16), data = Range(169, 170), message = Delete topic stress18)
     CheckAnswer: [1],[2],[3],[4],[5],[6],[7],[8],[9],[10],[11],[12],[13],[14],[15],[16],[17],[18],[19],[20],[21],[22],[23],[24],[25],[26],[27],[28],[29],[30],[31],[32],[33],[34],[35],[36],[37],[38],[39],[40],[41],[42],[43],[44],[45],[46],[47],[48],[49],[50],[51],[52],[53],[54],[55],[56],[57],[58],[59],[60],[61],[62],[63],[64],[65],[66],[67],[68],[69],[70],[71],[72],[73],[74],[75],[76],[77],[78],[79],[80],[81],[82],[83],[84],[85],[86],[87],[88],[89],[90],[91],[92],[93],[94],[95],[96],[97],[98],[99],[100],[101],[102],[103],[104],[105],[106],[107],[108],[109],[110],[111],[112],[113],[114],[115],[116],[117],[118],[119],[120],[121],[122],[123],[124],[125],[126],[127],[128],[129],[130],[131],[132],[133],[134],[135],[136],[137],[138],[139],[140],[141],[142],[143],[144],[145],[146],[147],[148],[149],[150],[151],[152],[153],[154],[155],[156],[157],[158],[159],[160],[161],[162],[163],[164],[165],[166],[167],[168],[169],[170],[171]
     StopStream
     StartStream(ProcessingTime(0),org.apache.spark.util.SystemClock@1fb33598,Map(),null)
     CheckAnswer: [1],[2],[3],[4],[5],[6],[7],[8],[9],[10],[11],[12],[13],[14],[15],[16],[17],[18],[19],[20],[21],[22],[23],[24],[25],[26],[27],[28],[29],[30],[31],[32],[33],[34],[35],[36],[37],[38],[39],[40],[41],[42],[43],[44],[45],[46],[47],[48],[49],[50],[51],[52],[53],[54],[55],[56],[57],[58],[59],[60],[61],[62],[63],[64],[65],[66],[67],[68],[69],[70],[71],[72],[73],[74],[75],[76],[77],[78],[79],[80],[81],[82],[83],[84],[85],[86],[87],[88],[89],[90],[91],[92],[93],[94],[95],[96],[97],[98],[99],[100],[101],[102],[103],[104],[105],[106],[107],[108],[109],[110],[111],[112],[113],[114],[115],[116],[117],[118],[119],[120],[121],[122],[123],[124],[125],[126],[127],[128],[129],[130],[131],[132],[133],[134],[135],[136],[137],[138],[139],[140],[141],[142],[143],[144],[145],[146],[147],[148],[149],[150],[151],[152],[153],[154],[155],[156],[157],[158],[159],[160],[161],[162],[163],[164],[165],[166],[167],[168],[169],[170],[171]
  
  == Stream ==
  Output Mode: Append
  Stream state: {KafkaV2[SubscribePattern[stress.*]]: {"stress5":{"2":1,"5":1,"4":1,"1":1,"3":1,"6":1,"0":6},"stress8":{"2":1,"1":0,"3":0,"0":1},"stress1":{"2":2,"5":4,"4":5,"1":3,"3":4,"6":1,"0":3},"stress4":{"8":0,"2":0,"5":1,"4":1,"7":0,"1":1,"9":0,"3":1,"6":0,"0":1},"stress3":{"2":0,"4":0,"1":3,"3":0,"0":2},"stress6":{"2":1,"5":1,"4":0,"1":0,"3":1,"0":1},"stress12":{"2":0,"4":0,"1":0,"3":0,"0":0},"stress2":{"8":0,"2":1,"5":0,"4":1,"7":0,"10":0,"1":1,"9":0,"3":1,"6":0,"0":1}}}
  Thread state: alive
  Thread stack trace: scala.collection.TraversableLike$class.to(TraversableLike.scala:590)
  scala.collection.AbstractTraversable.to(Traversable.scala:104)
  scala.collection.TraversableOnce$class.toList(TraversableOnce.scala:294)
  scala.collection.AbstractTraversable.toList(Traversable.scala:104)
  scala.reflect.ManifestFactory$.classType(Manifest.scala:225)
  org.apache.spark.sql.kafka010.JsonUtils$.partitionOffsets(JsonUtils.scala:67)
  org.apache.spark.sql.kafka010.KafkaMicroBatchReader.deserializeOffset(KafkaMicroBatchReader.scala:174)
  org.apache.spark.sql.execution.streaming.MicroBatchExecution$$anonfun$org$apache$spark$sql$execution$streaming$MicroBatchExecution$$constructNextBatch$1$$anonfun$6$$anonfun$apply$3$$anonfun$apply$mcV$sp$2.apply(MicroBatchExecution.scala:365)
  org.apache.spark.sql.execution.streaming.MicroBatchExecution$$anonfun$org$apache$spark$sql$execution$streaming$MicroBatchExecution$$constructNextBatch$1$$anonfun$6$$anonfun$apply$3$$anonfun$apply$mcV$sp$2.apply(MicroBatchExecution.scala:365)
  scala.Option.map(Option.scala:146)
  org.apache.spark.sql.execution.streaming.MicroBatchExecution$$anonfun$org$apache$spark$sql$execution$streaming$MicroBatchExecution$$constructNextBatch$1$$anonfun$6$$anonfun$apply$3.apply$mcV$sp(MicroBatchExecution.scala:365)
  org.apache.spark.sql.execution.streaming.MicroBatchExecution$$anonfun$org$apache$spark$sql$execution$streaming$MicroBatchExecution$$constructNextBatch$1$$anonfun$6$$anonfun$apply$3.apply(MicroBatchExecution.scala:364)
  org.apache.spark.sql.execution.streaming.MicroBatchExecution$$anonfun$org$apache$spark$sql$execution$streaming$MicroBatchExecution$$constructNextBatch$1$$anonfun$6$$anonfun$apply$3.apply(MicroBatchExecution.scala:364)
  org.apache.spark.sql.execution.streaming.ProgressReporter$class.reportTimeTaken(ProgressReporter.scala:351)
  org.apache.spark.sql.execution.streaming.StreamExecution.reportTimeTaken(StreamExecution.scala:58)
  org.apache.spark.sql.execution.streaming.MicroBatchExecution$$anonfun$org$apache$spark$sql$execution$streaming$MicroBatchExecution$$constructNextBatch$1$$anonfun$6.apply(MicroBatchExecution.scala:360)
  org.apache.spark.sql.execution.streaming.MicroBatchExecution$$anonfun$org$apache$spark$sql$execution$streaming$MicroBatchExecution$$constructNextBatch$1$$anonfun$6.apply(MicroBatchExecution.scala:352)
  scala.collection.TraversableLike$$anonfun$map$1.apply(TraversableLike.scala:234)
  scala.collection.TraversableLike$$anonfun$map$1.apply(TraversableLike.scala:234)
  scala.collection.mutable.ResizableArray$class.foreach(ResizableArray.scala:59)
  scala.collection.mutable.ArrayBuffer.foreach(ArrayBuffer.scala:48)
  scala.collection.TraversableLike$class.map(TraversableLike.scala:234)
  scala.collection.AbstractTraversable.map(Traversable.scala:104)
  org.apache.spark.sql.execution.streaming.MicroBatchExecution$$anonfun$org$apache$spark$sql$execution$streaming$MicroBatchExecution$$constructNextBatch$1.apply$mcZ$sp(MicroBatchExecution.scala:352)
  org.apache.spark.sql.execution.streaming.MicroBatchExecution$$anonfun$org$apache$spark$sql$execution$streaming$MicroBatchExecution$$constructNextBatch$1.apply(MicroBatchExecution.scala:348)
  org.apache.spark.sql.execution.streaming.MicroBatchExecution$$anonfun$org$apache$spark$sql$execution$streaming$MicroBatchExecution$$constructNextBatch$1.apply(MicroBatchExecution.scala:348)
  org.apache.spark.sql.execution.streaming.MicroBatchExecution.withProgressLocked(MicroBatchExecution.scala:568)
  org.apache.spark.sql.execution.streaming.MicroBatchExecution.org$apache$spark$sql$execution$streaming$MicroBatchExecution$$constructNextBatch(MicroBatchExecution.scala:348)
  org.apache.spark.sql.execution.streaming.MicroBatchExecution$$anonfun$runActivatedStream$1$$anonfun$apply$mcZ$sp$1.apply$mcV$sp(MicroBatchExecution.scala:183)
  org.apache.spark.sql.execution.streaming.MicroBatchExecution$$anonfun$runActivatedStream$1$$anonfun$apply$mcZ$sp$1.apply(MicroBatchExecution.scala:166)
  org.apache.spark.sql.execution.streaming.MicroBatchExecution$$anonfun$runActivatedStream$1$$anonfun$apply$mcZ$sp$1.apply(MicroBatchExecution.scala:166)
  org.apache.spark.sql.execution.streaming.ProgressReporter$class.reportTimeTaken(ProgressReporter.scala:351)
  org.apache.spark.sql.execution.streaming.StreamExecution.reportTimeTaken(StreamExecution.scala:58)
  org.apache.spark.sql.execution.streaming.MicroBatchExecution$$anonfun$runActivatedStream$1.apply$mcZ$sp(MicroBatchExecution.scala:166)
  org.apache.spark.sql.execution.streaming.ProcessingTimeExecutor.execute(TriggerExecutor.scala:56)
  org.apache.spark.sql.execution.streaming.MicroBatchExecution.runActivatedStream(MicroBatchExecution.scala:160)
  org.apache.spark.sql.execution.streaming.StreamExecution.org$apache$spark$sql$execution$streaming$StreamExecution$$runStream(StreamExecution.scala:281)
  org.apache.spark.sql.execution.streaming.StreamExecution$$anon$1.run(StreamExecution.scala:193)
  
  
  == Sink ==
  0: 
  1: [2] [8] [10] [20] [4] [9] [12] [21] [22] [6] [15] [13] [18] [3] [11] [1] [7] [16] [17] [5] [14] [19]
  2: [29] [27] [28]
  3: [30]
  4: [32] [31]
  5: [34] [33]
  
  
  == Plan ==
  == Parsed Logical Plan ==
  SerializeFromObject [input[0, int, false] AS value#10720]
  +- MapElements <function1>, class scala.Tuple2, [StructField(_1,StringType,true), StructField(_2,StringType,true)], obj#10719: int
     +- DeserializeToObject newInstance(class scala.Tuple2), obj#10718: scala.Tuple2
        +- Project [cast(key#10696 as string) AS key#10710, cast(value#10697 as string) AS value#10711]
           +- Project [key#10808 AS key#10696, value#10809 AS value#10697, topic#10810 AS topic#10698, partition#10811 AS partition#10699, offset#10812L AS offset#10700L, timestamp#10813 AS timestamp#10701, timestampType#10814 AS timestampType#10702]
              +- Streaming RelationV2 kafka[key#10808, value#10809, topic#10810, partition#10811, offset#10812L, timestamp#10813, timestampType#10814] (Options: [kafka.metadata.max.age.ms=1,failOnDataLoss=false,kafka.bootstrap.servers=127.0.0.1:35096,kafka.d...)
  
  == Analyzed Logical Plan ==
  value: int
  SerializeFromObject [input[0, int, false] AS value#10720]
  +- MapElements <function1>, class scala.Tuple2, [StructField(_1,StringType,true), StructField(_2,StringType,true)], obj#10719: int
     +- DeserializeToObject newInstance(class scala.Tuple2), obj#10718: scala.Tuple2
        +- Project [cast(key#10696 as string) AS key#10710, cast(value#10697 as string) AS value#10711]
           +- Project [key#10808 AS key#10696, value#10809 AS value#10697, topic#10810 AS topic#10698, partition#10811 AS partition#10699, offset#10812L AS offset#10700L, timestamp#10813 AS timestamp#10701, timestampType#10814 AS timestampType#10702]
              +- Streaming RelationV2 kafka[key#10808, value#10809, topic#10810, partition#10811, offset#10812L, timestamp#10813, timestampType#10814] (Options: [kafka.metadata.max.age.ms=1,failOnDataLoss=false,kafka.bootstrap.servers=127.0.0.1:35096,kafka.d...)
  
  == Optimized Logical Plan ==
  SerializeFromObject [input[0, int, false] AS value#10720]
  +- MapElements <function1>, class scala.Tuple2, [StructField(_1,StringType,true), StructField(_2,StringType,true)], obj#10719: int
     +- DeserializeToObject newInstance(class scala.Tuple2), obj#10718: scala.Tuple2
        +- Project [cast(key#10808 as string) AS key#10710, cast(value#10809 as string) AS value#10711]
           +- Streaming RelationV2 kafka[key#10808, value#10809, topic#10810, partition#10811, offset#10812L, timestamp#10813, timestampType#10814] (Options: [kafka.metadata.max.age.ms=1,failOnDataLoss=false,kafka.bootstrap.servers=127.0.0.1:35096,kafka.d...)
  
  == Physical Plan ==
  *(1) SerializeFromObject [input[0, int, false] AS value#10720]
  +- *(1) MapElements <function1>, obj#10719: int
     +- *(1) DeserializeToObject newInstance(class scala.Tuple2), obj#10718: scala.Tuple2
        +- *(1) Project [cast(key#10808 as string) AS key#10710, cast(value#10809 as string) AS value#10711]
           +- *(1) Project [key#10808, value#10809, topic#10810, partition#10811, offset#10812L, timestamp#10813, timestampType#10814]
              +- *(1) ScanV2 kafka[key#10808, value#10809, topic#10810, partition#10811, offset#10812L, timestamp#10813, timestampType#10814] (Options: [kafka.metadata.max.age.ms=1,failOnDataLoss=false,kafka.bootstrap.servers=127.0.0.1:35096,kafka.d...) (StreamTest.scala:458)
KafkaDontFailOnDataLossSuite:
- failOnDataLoss=false should not return duplicated records: v1
- failOnDataLoss=false should not return duplicated records: v2
- failOnDataLoss=false should not return duplicated records: continuous processing
- failOnDataLoss=false should not return duplicated records: batch
CachedKafkaProducerSuite:
- Should return the cached instance on calling getOrCreate with same params.
- Should close the correct kafka producer for the given kafkaPrams.
KafkaContinuousSourceSuite:
- cannot stop Kafka stream
- assign from latest offsets (failOnDataLoss: true)
- assign from earliest offsets (failOnDataLoss: true)
- assign from specific offsets (failOnDataLoss: true)
- subscribing topic by name from latest offsets (failOnDataLoss: true)
- subscribing topic by name from earliest offsets (failOnDataLoss: true)
- subscribing topic by name from specific offsets (failOnDataLoss: true)
- subscribing topic by pattern from latest offsets (failOnDataLoss: true)
- subscribing topic by pattern from earliest offsets (failOnDataLoss: true)
- subscribing topic by pattern from specific offsets (failOnDataLoss: true)
- assign from latest offsets (failOnDataLoss: false)
- assign from earliest offsets (failOnDataLoss: false)
- assign from specific offsets (failOnDataLoss: false)
- subscribing topic by name from latest offsets (failOnDataLoss: false)
- subscribing topic by name from earliest offsets (failOnDataLoss: false)
- subscribing topic by name from specific offsets (failOnDataLoss: false)
- subscribing topic by pattern from latest offsets (failOnDataLoss: false)
- subscribing topic by pattern from earliest offsets (failOnDataLoss: false)
- subscribing topic by pattern from specific offsets (failOnDataLoss: false)
- bad source options
- unsupported kafka configs
- get offsets from case insensitive parameters
- Kafka column types
- ensure continuous stream is being used
- read Kafka transactional messages: read_committed
- read Kafka transactional messages: read_uncommitted
- SPARK-27494: read kafka record containing null key/values.
KafkaSourceStressForDontFailOnDataLossSuite:
- stress test for failOnDataLoss=false
KafkaContinuousSourceTopicDeletionSuite:
- ensure continuous stream is being used
- subscribing topic by pattern with topic deletions
Run completed in 11 minutes, 19 seconds.
Total number of tests run: 171
Suites: completed 17, aborted 0
Tests: succeeded 169, failed 2, canceled 0, ignored 0, pending 0
*** 2 TESTS FAILED ***
[INFO] 
[INFO] ---------< org.apache.spark:spark-streaming-kinesis-asl_2.11 >----------
[INFO] Building Spark Kinesis Integration 2.4.8-SNAPSHOT                [26/30]
[INFO] --------------------------------[ jar ]---------------------------------
[INFO] 
[INFO] --- maven-enforcer-plugin:3.0.0-M1:enforce (enforce-versions) @ spark-streaming-kinesis-asl_2.11 ---
[INFO] 
[INFO] --- maven-enforcer-plugin:3.0.0-M1:enforce (enforce-no-duplicate-dependencies) @ spark-streaming-kinesis-asl_2.11 ---
[INFO] 
[INFO] --- scala-maven-plugin:3.2.2:add-source (eclipse-add-source) @ spark-streaming-kinesis-asl_2.11 ---
[INFO] Add Source directory: /home/jenkins/workspace/spark-branch-2.4-test-maven-hadoop-2.7/external/kinesis-asl/src/main/scala
[INFO] Add Test Source directory: /home/jenkins/workspace/spark-branch-2.4-test-maven-hadoop-2.7/external/kinesis-asl/src/test/scala
[INFO] 
[INFO] --- maven-dependency-plugin:3.0.2:build-classpath (default-cli) @ spark-streaming-kinesis-asl_2.11 ---
[INFO] Dependencies classpath:
/home/jenkins/.m2/repository/com/fasterxml/jackson/module/jackson-module-scala_2.11/2.6.7.1/jackson-module-scala_2.11-2.6.7.1.jar:/home/jenkins/.m2/repository/org/apache/htrace/htrace-core/3.1.0-incubating/htrace-core-3.1.0-incubating.jar:/home/jenkins/.m2/repository/org/lz4/lz4-java/1.4.0/lz4-java-1.4.0.jar:/home/jenkins/.m2/repository/com/google/protobuf/protobuf-java/2.5.0/protobuf-java-2.5.0.jar:/home/jenkins/.m2/repository/com/fasterxml/jackson/module/jackson-module-paranamer/2.7.9/jackson-module-paranamer-2.7.9.jar:/home/jenkins/.m2/repository/org/apache/commons/commons-compress/1.8.1/commons-compress-1.8.1.jar:/home/jenkins/.m2/repository/org/json4s/json4s-ast_2.11/3.5.3/json4s-ast_2.11-3.5.3.jar:/home/jenkins/.m2/repository/io/netty/netty-all/4.1.47.Final/netty-all-4.1.47.Final.jar:/home/jenkins/.m2/repository/com/thoughtworks/paranamer/paranamer/2.8/paranamer-2.8.jar:/home/jenkins/.m2/repository/org/fusesource/leveldbjni/leveldbjni-all/1.8/leveldbjni-all-1.8.jar:/home/jenkins/.m2/repository/org/tukaani/xz/1.5/xz-1.5.jar:/home/jenkins/workspace/spark-branch-2.4-test-maven-hadoop-2.7/common/kvstore/target/scala-2.11/classes:/home/jenkins/.m2/repository/org/glassfish/jersey/bundles/repackaged/jersey-guava/2.22.2/jersey-guava-2.22.2.jar:/home/jenkins/.m2/repository/com/amazonaws/aws-java-sdk-core/1.11.655/aws-java-sdk-core-1.11.655.jar:/home/jenkins/.m2/repository/org/apache/commons/commons-crypto/1.0.0/commons-crypto-1.0.0.jar:/home/jenkins/.m2/repository/com/amazonaws/aws-java-sdk-sts/1.11.655/aws-java-sdk-sts-1.11.655.jar:/home/jenkins/.m2/repository/com/amazonaws/aws-java-sdk-cloudwatch/1.11.655/aws-java-sdk-cloudwatch-1.11.655.jar:/home/jenkins/.m2/repository/commons-io/commons-io/2.4/commons-io-2.4.jar:/home/jenkins/.m2/repository/org/scala-lang/scala-reflect/2.11.12/scala-reflect-2.11.12.jar:/home/jenkins/.m2/repository/org/apache/commons/commons-lang3/3.5/commons-lang3-3.5.jar:/home/jenkins/.m2/repository/org/codehaus/jackson/jackson-jaxrs/1.9.13/jackson-jaxrs-1.9.13.jar:/home/jenkins/.m2/repository/org/apache/hadoop/hadoop-auth/2.7.3/hadoop-auth-2.7.3.jar:/home/jenkins/.m2/repository/com/esotericsoftware/kryo-shaded/4.0.2/kryo-shaded-4.0.2.jar:/home/jenkins/.m2/repository/com/esotericsoftware/minlog/1.3.0/minlog-1.3.0.jar:/home/jenkins/.m2/repository/org/apache/hadoop/hadoop-client/2.7.3/hadoop-client-2.7.3.jar:/home/jenkins/.m2/repository/org/apache/hadoop/hadoop-mapreduce-client-shuffle/2.7.3/hadoop-mapreduce-client-shuffle-2.7.3.jar:/home/jenkins/.m2/repository/org/codehaus/jackson/jackson-core-asl/1.9.13/jackson-core-asl-1.9.13.jar:/home/jenkins/.m2/repository/javax/validation/validation-api/1.1.0.Final/validation-api-1.1.0.Final.jar:/home/jenkins/workspace/spark-branch-2.4-test-maven-hadoop-2.7/core/target/scala-2.11/classes:/home/jenkins/.m2/repository/org/glassfish/jersey/core/jersey-common/2.22.2/jersey-common-2.22.2.jar:/home/jenkins/.m2/repository/org/apache/hadoop/hadoop-mapreduce-client-core/2.7.3/hadoop-mapreduce-client-core-2.7.3.jar:/home/jenkins/.m2/repository/joda-time/joda-time/2.9.3/joda-time-2.9.3.jar:/home/jenkins/.m2/repository/org/scala-lang/modules/scala-xml_2.11/1.0.5/scala-xml_2.11-1.0.5.jar:/home/jenkins/.m2/repository/com/amazonaws/aws-java-sdk-kms/1.11.655/aws-java-sdk-kms-1.11.655.jar:/home/jenkins/.m2/repository/com/google/code/findbugs/jsr305/1.3.9/jsr305-1.3.9.jar:/home/jenkins/.m2/repository/commons-net/commons-net/3.1/commons-net-3.1.jar:/home/jenkins/.m2/repository/javax/xml/bind/jaxb-api/2.2.2/jaxb-api-2.2.2.jar:/home/jenkins/.m2/repository/org/glassfish/hk2/hk2-api/2.4.0-b34/hk2-api-2.4.0-b34.jar:/home/jenkins/.m2/repository/org/xerial/snappy/snappy-java/1.1.7.5/snappy-java-1.1.7.5.jar:/home/jenkins/.m2/repository/org/glassfish/jersey/core/jersey-server/2.22.2/jersey-server-2.22.2.jar:/home/jenkins/.m2/repository/com/twitter/chill_2.11/0.9.3/chill_2.11-0.9.3.jar:/home/jenkins/.m2/repository/commons-lang/commons-lang/2.6/commons-lang-2.6.jar:/home/jenkins/.m2/repository/org/apache/hadoop/hadoop-yarn-client/2.7.3/hadoop-yarn-client-2.7.3.jar:/home/jenkins/.m2/repository/com/amazonaws/aws-java-sdk-s3/1.11.655/aws-java-sdk-s3-1.11.655.jar:/home/jenkins/.m2/repository/com/amazonaws/aws-java-sdk-dynamodb/1.11.655/aws-java-sdk-dynamodb-1.11.655.jar:/home/jenkins/.m2/repository/org/apache/zookeeper/zookeeper/3.4.6/zookeeper-3.4.6.jar:/home/jenkins/.m2/repository/javax/activation/activation/1.1.1/activation-1.1.1.jar:/home/jenkins/.m2/repository/commons-codec/commons-codec/1.10/commons-codec-1.10.jar:/home/jenkins/.m2/repository/org/json4s/json4s-jackson_2.11/3.5.3/json4s-jackson_2.11-3.5.3.jar:/home/jenkins/.m2/repository/org/javassist/javassist/3.18.1-GA/javassist-3.18.1-GA.jar:/home/jenkins/.m2/repository/org/apache/xbean/xbean-asm6-shaded/4.8/xbean-asm6-shaded-4.8.jar:/home/jenkins/.m2/repository/commons-beanutils/commons-beanutils/1.9.4/commons-beanutils-1.9.4.jar:/home/jenkins/.m2/repository/org/apache/ivy/ivy/2.4.0/ivy-2.4.0.jar:/home/jenkins/.m2/repository/javax/servlet/javax.servlet-api/3.1.0/javax.servlet-api-3.1.0.jar:/home/jenkins/.m2/repository/org/glassfish/hk2/osgi-resource-locator/1.0.1/osgi-resource-locator-1.0.1.jar:/home/jenkins/.m2/repository/com/fasterxml/jackson/core/jackson-core/2.6.7/jackson-core-2.6.7.jar:/home/jenkins/.m2/repository/org/apache/commons/commons-math3/3.4.1/commons-math3-3.4.1.jar:/home/jenkins/.m2/repository/org/apache/hadoop/hadoop-mapreduce-client-common/2.7.3/hadoop-mapreduce-client-common-2.7.3.jar:/home/jenkins/.m2/repository/io/dropwizard/metrics/metrics-graphite/3.1.5/metrics-graphite-3.1.5.jar:/home/jenkins/.m2/repository/javax/xml/stream/stax-api/1.0-2/stax-api-1.0-2.jar:/home/jenkins/.m2/repository/org/apache/hadoop/hadoop-mapreduce-client-jobclient/2.7.3/hadoop-mapreduce-client-jobclient-2.7.3.jar:/home/jenkins/.m2/repository/org/codehaus/jackson/jackson-xc/1.9.13/jackson-xc-1.9.13.jar:/home/jenkins/.m2/repository/com/amazonaws/amazon-kinesis-client/1.12.0/amazon-kinesis-client-1.12.0.jar:/home/jenkins/.m2/repository/org/glassfish/hk2/hk2-utils/2.4.0-b34/hk2-utils-2.4.0-b34.jar:/home/jenkins/.m2/repository/org/glassfish/hk2/external/aopalliance-repackaged/2.4.0-b34/aopalliance-repackaged-2.4.0-b34.jar:/home/jenkins/.m2/repository/net/sf/py4j/py4j/0.10.7/py4j-0.10.7.jar:/home/jenkins/.m2/repository/org/json4s/json4s-scalap_2.11/3.5.3/json4s-scalap_2.11-3.5.3.jar:/home/jenkins/.m2/repository/org/glassfish/hk2/external/javax.inject/2.4.0-b34/javax.inject-2.4.0-b34.jar:/home/jenkins/.m2/repository/org/glassfish/jersey/containers/jersey-container-servlet-core/2.22.2/jersey-container-servlet-core-2.22.2.jar:/home/jenkins/.m2/repository/oro/oro/2.0.8/oro-2.0.8.jar:/home/jenkins/.m2/repository/org/apache/avro/avro-mapred/1.8.2/avro-mapred-1.8.2-hadoop2.jar:/home/jenkins/workspace/spark-branch-2.4-test-maven-hadoop-2.7/common/network-common/target/scala-2.11/classes:/home/jenkins/.m2/repository/org/apache/hadoop/hadoop-yarn-common/2.7.3/hadoop-yarn-common-2.7.3.jar:/home/jenkins/workspace/spark-branch-2.4-test-maven-hadoop-2.7/common/unsafe/target/scala-2.11/classes:/home/jenkins/.m2/repository/org/apache/hadoop/hadoop-yarn-api/2.7.3/hadoop-yarn-api-2.7.3.jar:/home/jenkins/.m2/repository/log4j/log4j/1.2.17/log4j-1.2.17.jar:/home/jenkins/.m2/repository/org/apache/hadoop/hadoop-yarn-server-common/2.7.3/hadoop-yarn-server-common-2.7.3.jar:/home/jenkins/.m2/repository/org/apache/httpcomponents/httpcore/4.4.10/httpcore-4.4.10.jar:/home/jenkins/workspace/spark-branch-2.4-test-maven-hadoop-2.7/streaming/target/scala-2.11/classes:/home/jenkins/.m2/repository/org/apache/curator/curator-framework/2.7.1/curator-framework-2.7.1.jar:/home/jenkins/.m2/repository/org/apache/curator/curator-recipes/2.7.1/curator-recipes-2.7.1.jar:/home/jenkins/.m2/repository/io/dropwizard/metrics/metrics-json/3.1.5/metrics-json-3.1.5.jar:/home/jenkins/.m2/repository/com/amazonaws/aws-java-sdk-kinesis/1.11.655/aws-java-sdk-kinesis-1.11.655.jar:/home/jenkins/.m2/repository/org/apache/avro/avro/1.8.2/avro-1.8.2.jar:/home/jenkins/.m2/repository/org/apache/directory/server/apacheds-kerberos-codec/2.0.0-M15/apacheds-kerberos-codec-2.0.0-M15.jar:/home/jenkins/.m2/repository/io/dropwizard/metrics/metrics-core/3.1.5/metrics-core-3.1.5.jar:/home/jenkins/workspace/spark-branch-2.4-test-maven-hadoop-2.7/common/tags/target/scala-2.11/classes:/home/jenkins/.m2/repository/org/slf4j/slf4j-api/1.7.16/slf4j-api-1.7.16.jar:/home/jenkins/workspace/spark-branch-2.4-test-maven-hadoop-2.7/launcher/target/scala-2.11/classes:/home/jenkins/.m2/repository/org/mortbay/jetty/jetty-util/6.1.26/jetty-util-6.1.26.jar:/home/jenkins/.m2/repository/org/codehaus/jackson/jackson-mapper-asl/1.9.13/jackson-mapper-asl-1.9.13.jar:/home/jenkins/workspace/spark-branch-2.4-test-maven-hadoop-2.7/common/network-shuffle/target/scala-2.11/classes:/home/jenkins/.m2/repository/javax/ws/rs/javax.ws.rs-api/2.0.1/javax.ws.rs-api-2.0.1.jar:/home/jenkins/.m2/repository/javax/servlet/jsp/jsp-api/2.1/jsp-api-2.1.jar:/home/jenkins/.m2/repository/org/glassfish/jersey/core/jersey-client/2.22.2/jersey-client-2.22.2.jar:/home/jenkins/.m2/repository/io/netty/netty/3.9.9.Final/netty-3.9.9.Final.jar:/home/jenkins/.m2/repository/org/roaringbitmap/shims/0.7.45/shims-0.7.45.jar:/home/jenkins/.m2/repository/org/apache/avro/avro-ipc/1.8.2/avro-ipc-1.8.2.jar:/home/jenkins/.m2/repository/xmlenc/xmlenc/0.52/xmlenc-0.52.jar:/home/jenkins/.m2/repository/com/ning/compress-lzf/1.0.3/compress-lzf-1.0.3.jar:/home/jenkins/.m2/repository/org/apache/hadoop/hadoop-hdfs/2.7.3/hadoop-hdfs-2.7.3.jar:/home/jenkins/.m2/repository/org/apache/directory/api/api-util/1.0.0-M20/api-util-1.0.0-M20.jar:/home/jenkins/.m2/repository/com/google/code/gson/gson/2.2.4/gson-2.2.4.jar:/home/jenkins/.m2/repository/org/apache/directory/api/api-asn1-api/1.0.0-M20/api-asn1-api-1.0.0-M20.jar:/home/jenkins/.m2/repository/com/clearspring/analytics/stream/2.7.0/stream-2.7.0.jar:/home/jenkins/.m2/repository/org/apache/hadoop/hadoop-common/2.7.3/hadoop-common-2.7.3.jar:/home/jenkins/.m2/repository/com/fasterxml/jackson/core/jackson-annotations/2.6.7/jackson-annotations-2.6.7.jar:/home/jenkins/.m2/repository/commons-configuration/commons-configuration/1.6/commons-configuration-1.6.jar:/home/jenkins/.m2/repository/org/glassfish/jersey/containers/jersey-container-servlet/2.22.2/jersey-container-servlet-2.22.2.jar:/home/jenkins/.m2/repository/commons-digester/commons-digester/1.8/commons-digester-1.8.jar:/home/jenkins/.m2/repository/org/slf4j/jul-to-slf4j/1.7.16/jul-to-slf4j-1.7.16.jar:/home/jenkins/.m2/repository/org/scala-lang/scala-library/2.11.12/scala-library-2.11.12.jar:/home/jenkins/.m2/repository/org/apache/directory/server/apacheds-i18n/2.0.0-M15/apacheds-i18n-2.0.0-M15.jar:/home/jenkins/.m2/repository/com/fasterxml/jackson/dataformat/jackson-dataformat-cbor/2.6.7/jackson-dataformat-cbor-2.6.7.jar:/home/jenkins/.m2/repository/org/apache/curator/curator-client/2.7.1/curator-client-2.7.1.jar:/home/jenkins/.m2/repository/org/roaringbitmap/RoaringBitmap/0.7.45/RoaringBitmap-0.7.45.jar:/home/jenkins/.m2/repository/com/fasterxml/jackson/core/jackson-databind/2.6.7.3/jackson-databind-2.6.7.3.jar:/home/jenkins/.m2/repository/commons-cli/commons-cli/1.2/commons-cli-1.2.jar:/home/jenkins/.m2/repository/xerces/xercesImpl/2.9.1/xercesImpl-2.9.1.jar:/home/jenkins/.m2/repository/javax/annotation/javax.annotation-api/1.2/javax.annotation-api-1.2.jar:/home/jenkins/.m2/repository/org/objenesis/objenesis/2.1/objenesis-2.1.jar:/home/jenkins/.m2/repository/org/slf4j/slf4j-log4j12/1.7.16/slf4j-log4j12-1.7.16.jar:/home/jenkins/.m2/repository/org/glassfish/jersey/media/jersey-media-jaxb/2.22.2/jersey-media-jaxb-2.22.2.jar:/home/jenkins/.m2/repository/org/spark-project/spark/unused/1.0.0/unused-1.0.0.jar:/home/jenkins/.m2/repository/com/twitter/chill-java/0.9.3/chill-java-0.9.3.jar:/home/jenkins/.m2/repository/io/dropwizard/metrics/metrics-jvm/3.1.5/metrics-jvm-3.1.5.jar:/home/jenkins/.m2/repository/org/apache/hadoop/hadoop-annotations/2.7.3/hadoop-annotations-2.7.3.jar:/home/jenkins/.m2/repository/com/github/luben/zstd-jni/1.3.2-2/zstd-jni-1.3.2-2.jar:/home/jenkins/.m2/repository/org/json4s/json4s-core_2.11/3.5.3/json4s-core_2.11-3.5.3.jar:/home/jenkins/.m2/repository/commons-collections/commons-collections/3.2.2/commons-collections-3.2.2.jar:/home/jenkins/.m2/repository/org/glassfish/hk2/hk2-locator/2.4.0-b34/hk2-locator-2.4.0-b34.jar:/home/jenkins/.m2/repository/org/apache/hadoop/hadoop-mapreduce-client-app/2.7.3/hadoop-mapreduce-client-app-2.7.3.jar:/home/jenkins/.m2/repository/commons-logging/commons-logging/1.1.3/commons-logging-1.1.3.jar:/home/jenkins/.m2/repository/net/razorvine/pyrolite/4.13/pyrolite-4.13.jar:/home/jenkins/.m2/repository/org/apache/httpcomponents/httpclient/4.5.6/httpclient-4.5.6.jar:/home/jenkins/.m2/repository/com/amazonaws/jmespath-java/1.11.655/jmespath-java-1.11.655.jar:/home/jenkins/.m2/repository/software/amazon/ion/ion-java/1.0.2/ion-java-1.0.2.jar:/home/jenkins/.m2/repository/org/slf4j/jcl-over-slf4j/1.7.16/jcl-over-slf4j-1.7.16.jar:/home/jenkins/.m2/repository/commons-httpclient/commons-httpclient/3.1/commons-httpclient-3.1.jar
[INFO] 
[INFO] --- maven-remote-resources-plugin:1.5:process (process-resource-bundles) @ spark-streaming-kinesis-asl_2.11 ---
[INFO] 
[INFO] --- maven-resources-plugin:2.7:resources (default-resources) @ spark-streaming-kinesis-asl_2.11 ---
[INFO] Using 'UTF-8' encoding to copy filtered resources.
[INFO] Copying 1 resource
[INFO] Copying 3 resources
[INFO] 
[INFO] --- maven-compiler-plugin:3.7.0:compile (default-compile) @ spark-streaming-kinesis-asl_2.11 ---
[INFO] Not compiling main sources
[INFO] 
[INFO] --- scala-maven-plugin:3.2.2:compile (scala-compile-first) @ spark-streaming-kinesis-asl_2.11 ---
[INFO] Using zinc server for incremental compilation
[info] Compiling 11 Scala sources and 2 Java sources to /home/jenkins/workspace/spark-branch-2.4-test-maven-hadoop-2.7/external/kinesis-asl/target/scala-2.11/classes...
[warn] /home/jenkins/workspace/spark-branch-2.4-test-maven-hadoop-2.7/external/kinesis-asl/src/main/scala/org/apache/spark/examples/streaming/KinesisWordCountASL.scala:107: constructor AmazonKinesisClient in class AmazonKinesisClient is deprecated: see corresponding Javadoc for more information.
[warn]     val kinesisClient = new AmazonKinesisClient(credentials)
[warn]                         ^
[warn] /home/jenkins/workspace/spark-branch-2.4-test-maven-hadoop-2.7/external/kinesis-asl/src/main/scala/org/apache/spark/examples/streaming/KinesisWordCountASL.scala:108: method setEndpoint in class AmazonWebServiceClient is deprecated: see corresponding Javadoc for more information.
[warn]     kinesisClient.setEndpoint(endpointUrl)
[warn]                   ^
[warn] /home/jenkins/workspace/spark-branch-2.4-test-maven-hadoop-2.7/external/kinesis-asl/src/main/scala/org/apache/spark/examples/streaming/KinesisWordCountASL.scala:223: constructor AmazonKinesisClient in class AmazonKinesisClient is deprecated: see corresponding Javadoc for more information.
[warn]     val kinesisClient = new AmazonKinesisClient(new DefaultAWSCredentialsProviderChain())
[warn]                         ^
[warn] /home/jenkins/workspace/spark-branch-2.4-test-maven-hadoop-2.7/external/kinesis-asl/src/main/scala/org/apache/spark/examples/streaming/KinesisWordCountASL.scala:224: method setEndpoint in class AmazonWebServiceClient is deprecated: see corresponding Javadoc for more information.
[warn]     kinesisClient.setEndpoint(endpoint)
[warn]                   ^
[warn] /home/jenkins/workspace/spark-branch-2.4-test-maven-hadoop-2.7/external/kinesis-asl/src/main/scala/org/apache/spark/streaming/kinesis/KinesisBackedBlockRDD.scala:140: constructor AmazonKinesisClient in class AmazonKinesisClient is deprecated: see corresponding Javadoc for more information.
[warn]   private val client = new AmazonKinesisClient(credentials)
[warn]                        ^
[warn] /home/jenkins/workspace/spark-branch-2.4-test-maven-hadoop-2.7/external/kinesis-asl/src/main/scala/org/apache/spark/streaming/kinesis/KinesisBackedBlockRDD.scala:150: method setEndpoint in class AmazonWebServiceClient is deprecated: see corresponding Javadoc for more information.
[warn]   client.setEndpoint(endpointUrl)
[warn]          ^
[warn] /home/jenkins/workspace/spark-branch-2.4-test-maven-hadoop-2.7/external/kinesis-asl/src/main/scala/org/apache/spark/streaming/kinesis/KinesisBackedBlockRDD.scala:219: method setRequestCredentials in class AmazonWebServiceRequest is deprecated: see corresponding Javadoc for more information.
[warn]     getRecordsRequest.setRequestCredentials(credentials)
[warn]                       ^
[warn] /home/jenkins/workspace/spark-branch-2.4-test-maven-hadoop-2.7/external/kinesis-asl/src/main/scala/org/apache/spark/streaming/kinesis/KinesisBackedBlockRDD.scala:240: method setRequestCredentials in class AmazonWebServiceRequest is deprecated: see corresponding Javadoc for more information.
[warn]     getShardIteratorRequest.setRequestCredentials(credentials)
[warn]                             ^
[warn] /home/jenkins/workspace/spark-branch-2.4-test-maven-hadoop-2.7/external/kinesis-asl/src/main/scala/org/apache/spark/streaming/kinesis/KinesisReceiver.scala:187: constructor Worker in class Worker is deprecated: see corresponding Javadoc for more information.
[warn]     worker = new Worker(recordProcessorFactory, kinesisClientLibConfiguration)
[warn]              ^
[warn] /home/jenkins/workspace/spark-branch-2.4-test-maven-hadoop-2.7/external/kinesis-asl/src/main/scala/org/apache/spark/streaming/kinesis/KinesisTestUtils.scala:58: constructor AmazonKinesisClient in class AmazonKinesisClient is deprecated: see corresponding Javadoc for more information.
[warn]     val client = new AmazonKinesisClient(KinesisTestUtils.getAWSCredentials())
[warn]                  ^
[warn] /home/jenkins/workspace/spark-branch-2.4-test-maven-hadoop-2.7/external/kinesis-asl/src/main/scala/org/apache/spark/streaming/kinesis/KinesisTestUtils.scala:59: method setEndpoint in class AmazonWebServiceClient is deprecated: see corresponding Javadoc for more information.
[warn]     client.setEndpoint(endpointUrl)
[warn]            ^
[warn] /home/jenkins/workspace/spark-branch-2.4-test-maven-hadoop-2.7/external/kinesis-asl/src/main/scala/org/apache/spark/streaming/kinesis/KinesisTestUtils.scala:64: constructor AmazonDynamoDBClient in class AmazonDynamoDBClient is deprecated: see corresponding Javadoc for more information.
[warn]     val dynamoDBClient = new AmazonDynamoDBClient(new DefaultAWSCredentialsProviderChain())
[warn]                          ^
[warn] /home/jenkins/workspace/spark-branch-2.4-test-maven-hadoop-2.7/external/kinesis-asl/src/main/scala/org/apache/spark/streaming/kinesis/KinesisTestUtils.scala:65: method setRegion in class AmazonWebServiceClient is deprecated: see corresponding Javadoc for more information.
[warn]     dynamoDBClient.setRegion(RegionUtils.getRegion(regionName))
[warn]                    ^
[warn] /home/jenkins/workspace/spark-branch-2.4-test-maven-hadoop-2.7/external/kinesis-asl/src/main/scala/org/apache/spark/streaming/kinesis/KinesisUtils.scala:606: method createStream in object KinesisUtils is deprecated: Use KinesisInputDStream.builder instead
[warn]       KinesisUtils.createStream(jssc.ssc, kinesisAppName, streamName, endpointUrl, regionName,
[warn]                    ^
[warn] /home/jenkins/workspace/spark-branch-2.4-test-maven-hadoop-2.7/external/kinesis-asl/src/main/scala/org/apache/spark/streaming/kinesis/KinesisUtils.scala:613: method createStream in object KinesisUtils is deprecated: Use KinesisInputDStream.builder instead
[warn]         KinesisUtils.createStream(jssc, kinesisAppName, streamName, endpointUrl, regionName,
[warn]                      ^
[warn] /home/jenkins/workspace/spark-branch-2.4-test-maven-hadoop-2.7/external/kinesis-asl/src/main/scala/org/apache/spark/streaming/kinesis/KinesisUtils.scala:616: method createStream in object KinesisUtils is deprecated: Use KinesisInputDStream.builder instead
[warn]         KinesisUtils.createStream(jssc, kinesisAppName, streamName, endpointUrl, regionName,
[warn]                      ^
[warn] /home/jenkins/workspace/spark-branch-2.4-test-maven-hadoop-2.7/external/kinesis-asl/src/main/scala/org/apache/spark/streaming/kinesis/SparkAWSCredentials.scala:76: method withLongLivedCredentialsProvider in class Builder is deprecated: see corresponding Javadoc for more information.
[warn]       .withLongLivedCredentialsProvider(longLivedCreds.provider)
[warn]        ^
[warn] 17 warnings found
[warn] /home/jenkins/workspace/spark-branch-2.4-test-maven-hadoop-2.7/external/kinesis-asl/src/main/java/org/apache/spark/examples/streaming/JavaKinesisWordCountASL.java:109: warning: [deprecation] AmazonKinesisClient(AWSCredentialsProvider) in AmazonKinesisClient has been deprecated
[warn]         new AmazonKinesisClient(new DefaultAWSCredentialsProviderChain());
[warn]         ^
[warn] /home/jenkins/workspace/spark-branch-2.4-test-maven-hadoop-2.7/external/kinesis-asl/src/main/java/org/apache/spark/examples/streaming/JavaKinesisWordCountASL.java:110: warning: [deprecation] setEndpoint(String) in AmazonWebServiceClient has been deprecated
[warn]     kinesisClient.setEndpoint(endpointUrl);
[warn]                  ^
[warn] 2 warnings
[info] Compile success at Sep 23, 2020 12:12:33 PM [4.335s]
[INFO] 
[INFO] --- maven-antrun-plugin:1.8:run (create-tmp-dir) @ spark-streaming-kinesis-asl_2.11 ---
[INFO] Executing tasks

main:
[INFO] Executed tasks
[INFO] 
[INFO] --- maven-resources-plugin:2.7:testResources (default-testResources) @ spark-streaming-kinesis-asl_2.11 ---
[INFO] Using 'UTF-8' encoding to copy filtered resources.
[INFO] Copying 1 resource
[INFO] Copying 3 resources
[INFO] 
[INFO] --- maven-compiler-plugin:3.7.0:testCompile (default-testCompile) @ spark-streaming-kinesis-asl_2.11 ---
[INFO] Not compiling test sources
[INFO] 
[INFO] --- maven-dependency-plugin:3.0.2:build-classpath (generate-test-classpath) @ spark-streaming-kinesis-asl_2.11 ---
[INFO] Dependencies classpath:
/home/jenkins/.m2/repository/org/eclipse/jetty/jetty-security/9.3.27.v20190418/jetty-security-9.3.27.v20190418.jar:/home/jenkins/.m2/repository/com/fasterxml/jackson/module/jackson-module-scala_2.11/2.6.7.1/jackson-module-scala_2.11-2.6.7.1.jar:/home/jenkins/.m2/repository/org/apache/htrace/htrace-core/3.1.0-incubating/htrace-core-3.1.0-incubating.jar:/home/jenkins/.m2/repository/org/lz4/lz4-java/1.4.0/lz4-java-1.4.0.jar:/home/jenkins/.m2/repository/com/google/protobuf/protobuf-java/2.5.0/protobuf-java-2.5.0.jar:/home/jenkins/.m2/repository/org/scalactic/scalactic_2.11/3.0.3/scalactic_2.11-3.0.3.jar:/home/jenkins/.m2/repository/com/fasterxml/jackson/module/jackson-module-paranamer/2.7.9/jackson-module-paranamer-2.7.9.jar:/home/jenkins/.m2/repository/org/apache/commons/commons-compress/1.8.1/commons-compress-1.8.1.jar:/home/jenkins/.m2/repository/org/json4s/json4s-ast_2.11/3.5.3/json4s-ast_2.11-3.5.3.jar:/home/jenkins/.m2/repository/io/netty/netty-all/4.1.47.Final/netty-all-4.1.47.Final.jar:/home/jenkins/.m2/repository/com/thoughtworks/paranamer/paranamer/2.8/paranamer-2.8.jar:/home/jenkins/.m2/repository/org/mockito/mockito-core/1.10.19/mockito-core-1.10.19.jar:/home/jenkins/.m2/repository/xml-apis/xml-apis/1.4.01/xml-apis-1.4.01.jar:/home/jenkins/.m2/repository/org/fusesource/leveldbjni/leveldbjni-all/1.8/leveldbjni-all-1.8.jar:/home/jenkins/.m2/repository/org/tukaani/xz/1.5/xz-1.5.jar:/home/jenkins/workspace/spark-branch-2.4-test-maven-hadoop-2.7/common/kvstore/target/scala-2.11/classes:/home/jenkins/.m2/repository/org/glassfish/jersey/bundles/repackaged/jersey-guava/2.22.2/jersey-guava-2.22.2.jar:/home/jenkins/.m2/repository/com/amazonaws/aws-java-sdk-core/1.11.655/aws-java-sdk-core-1.11.655.jar:/home/jenkins/.m2/repository/org/apache/commons/commons-crypto/1.0.0/commons-crypto-1.0.0.jar:/home/jenkins/.m2/repository/com/amazonaws/aws-java-sdk-sts/1.11.655/aws-java-sdk-sts-1.11.655.jar:/home/jenkins/.m2/repository/com/amazonaws/aws-java-sdk-cloudwatch/1.11.655/aws-java-sdk-cloudwatch-1.11.655.jar:/home/jenkins/.m2/repository/commons-io/commons-io/2.4/commons-io-2.4.jar:/home/jenkins/.m2/repository/org/scala-lang/scala-reflect/2.11.12/scala-reflect-2.11.12.jar:/home/jenkins/.m2/repository/org/eclipse/jetty/jetty-servlet/9.3.27.v20190418/jetty-servlet-9.3.27.v20190418.jar:/home/jenkins/.m2/repository/org/apache/commons/commons-lang3/3.5/commons-lang3-3.5.jar:/home/jenkins/.m2/repository/org/codehaus/jackson/jackson-jaxrs/1.9.13/jackson-jaxrs-1.9.13.jar:/home/jenkins/.m2/repository/org/apache/hadoop/hadoop-auth/2.7.3/hadoop-auth-2.7.3.jar:/home/jenkins/.m2/repository/com/esotericsoftware/kryo-shaded/4.0.2/kryo-shaded-4.0.2.jar:/home/jenkins/.m2/repository/com/esotericsoftware/minlog/1.3.0/minlog-1.3.0.jar:/home/jenkins/.m2/repository/org/apache/hadoop/hadoop-client/2.7.3/hadoop-client-2.7.3.jar:/home/jenkins/.m2/repository/org/apache/hadoop/hadoop-mapreduce-client-shuffle/2.7.3/hadoop-mapreduce-client-shuffle-2.7.3.jar:/home/jenkins/.m2/repository/org/codehaus/jackson/jackson-core-asl/1.9.13/jackson-core-asl-1.9.13.jar:/home/jenkins/.m2/repository/javax/validation/validation-api/1.1.0.Final/validation-api-1.1.0.Final.jar:/home/jenkins/.m2/repository/org/scalacheck/scalacheck_2.11/1.13.5/scalacheck_2.11-1.13.5.jar:/home/jenkins/workspace/spark-branch-2.4-test-maven-hadoop-2.7/core/target/scala-2.11/classes:/home/jenkins/.m2/repository/org/glassfish/jersey/core/jersey-common/2.22.2/jersey-common-2.22.2.jar:/home/jenkins/.m2/repository/org/apache/hadoop/hadoop-mapreduce-client-core/2.7.3/hadoop-mapreduce-client-core-2.7.3.jar:/home/jenkins/.m2/repository/joda-time/joda-time/2.9.3/joda-time-2.9.3.jar:/home/jenkins/.m2/repository/org/scala-lang/modules/scala-xml_2.11/1.0.5/scala-xml_2.11-1.0.5.jar:/home/jenkins/.m2/repository/com/amazonaws/aws-java-sdk-kms/1.11.655/aws-java-sdk-kms-1.11.655.jar:/home/jenkins/.m2/repository/com/google/code/findbugs/jsr305/1.3.9/jsr305-1.3.9.jar:/home/jenkins/.m2/repository/commons-net/commons-net/3.1/commons-net-3.1.jar:/home/jenkins/.m2/repository/com/amazonaws/amazon-kinesis-producer/0.12.8/amazon-kinesis-producer-0.12.8.jar:/home/jenkins/.m2/repository/javax/xml/bind/jaxb-api/2.2.2/jaxb-api-2.2.2.jar:/home/jenkins/.m2/repository/org/glassfish/hk2/hk2-api/2.4.0-b34/hk2-api-2.4.0-b34.jar:/home/jenkins/.m2/repository/org/xerial/snappy/snappy-java/1.1.7.5/snappy-java-1.1.7.5.jar:/home/jenkins/.m2/repository/org/glassfish/jersey/core/jersey-server/2.22.2/jersey-server-2.22.2.jar:/home/jenkins/.m2/repository/com/twitter/chill_2.11/0.9.3/chill_2.11-0.9.3.jar:/home/jenkins/.m2/repository/commons-lang/commons-lang/2.6/commons-lang-2.6.jar:/home/jenkins/.m2/repository/org/apache/hadoop/hadoop-yarn-client/2.7.3/hadoop-yarn-client-2.7.3.jar:/home/jenkins/.m2/repository/com/amazonaws/aws-java-sdk-s3/1.11.655/aws-java-sdk-s3-1.11.655.jar:/home/jenkins/.m2/repository/com/amazonaws/aws-java-sdk-dynamodb/1.11.655/aws-java-sdk-dynamodb-1.11.655.jar:/home/jenkins/.m2/repository/org/apache/zookeeper/zookeeper/3.4.6/zookeeper-3.4.6.jar:/home/jenkins/.m2/repository/javax/activation/activation/1.1.1/activation-1.1.1.jar:/home/jenkins/.m2/repository/commons-codec/commons-codec/1.10/commons-codec-1.10.jar:/home/jenkins/.m2/repository/org/eclipse/jetty/jetty-webapp/9.3.27.v20190418/jetty-webapp-9.3.27.v20190418.jar:/home/jenkins/.m2/repository/org/json4s/json4s-jackson_2.11/3.5.3/json4s-jackson_2.11-3.5.3.jar:/home/jenkins/.m2/repository/org/javassist/javassist/3.18.1-GA/javassist-3.18.1-GA.jar:/home/jenkins/.m2/repository/com/google/guava/guava/14.0.1/guava-14.0.1.jar:/home/jenkins/.m2/repository/org/apache/xbean/xbean-asm6-shaded/4.8/xbean-asm6-shaded-4.8.jar:/home/jenkins/.m2/repository/commons-beanutils/commons-beanutils/1.9.4/commons-beanutils-1.9.4.jar:/home/jenkins/.m2/repository/org/apache/ivy/ivy/2.4.0/ivy-2.4.0.jar:/home/jenkins/workspace/spark-branch-2.4-test-maven-hadoop-2.7/core/target/scala-2.11/test-classes:/home/jenkins/.m2/repository/org/eclipse/jetty/jetty-util/9.3.27.v20190418/jetty-util-9.3.27.v20190418.jar:/home/jenkins/.m2/repository/org/eclipse/jetty/jetty-client/9.3.27.v20190418/jetty-client-9.3.27.v20190418.jar:/home/jenkins/.m2/repository/javax/servlet/javax.servlet-api/3.1.0/javax.servlet-api-3.1.0.jar:/home/jenkins/.m2/repository/org/glassfish/hk2/osgi-resource-locator/1.0.1/osgi-resource-locator-1.0.1.jar:/home/jenkins/.m2/repository/com/fasterxml/jackson/core/jackson-core/2.6.7/jackson-core-2.6.7.jar:/home/jenkins/.m2/repository/org/apache/commons/commons-math3/3.4.1/commons-math3-3.4.1.jar:/home/jenkins/workspace/spark-branch-2.4-test-maven-hadoop-2.7/streaming/target/scala-2.11/test-classes:/home/jenkins/.m2/repository/org/apache/hadoop/hadoop-mapreduce-client-common/2.7.3/hadoop-mapreduce-client-common-2.7.3.jar:/home/jenkins/.m2/repository/org/scala-lang/modules/scala-parser-combinators_2.11/1.1.0/scala-parser-combinators_2.11-1.1.0.jar:/home/jenkins/.m2/repository/io/dropwizard/metrics/metrics-graphite/3.1.5/metrics-graphite-3.1.5.jar:/home/jenkins/.m2/repository/javax/xml/stream/stax-api/1.0-2/stax-api-1.0-2.jar:/home/jenkins/.m2/repository/org/apache/hadoop/hadoop-mapreduce-client-jobclient/2.7.3/hadoop-mapreduce-client-jobclient-2.7.3.jar:/home/jenkins/.m2/repository/org/codehaus/jackson/jackson-xc/1.9.13/jackson-xc-1.9.13.jar:/home/jenkins/.m2/repository/com/amazonaws/amazon-kinesis-client/1.12.0/amazon-kinesis-client-1.12.0.jar:/home/jenkins/.m2/repository/org/eclipse/jetty/jetty-server/9.3.27.v20190418/jetty-server-9.3.27.v20190418.jar:/home/jenkins/.m2/repository/org/glassfish/hk2/hk2-utils/2.4.0-b34/hk2-utils-2.4.0-b34.jar:/home/jenkins/.m2/repository/org/glassfish/hk2/external/aopalliance-repackaged/2.4.0-b34/aopalliance-repackaged-2.4.0-b34.jar:/home/jenkins/.m2/repository/net/sf/py4j/py4j/0.10.7/py4j-0.10.7.jar:/home/jenkins/.m2/repository/org/json4s/json4s-scalap_2.11/3.5.3/json4s-scalap_2.11-3.5.3.jar:/home/jenkins/.m2/repository/org/glassfish/hk2/external/javax.inject/2.4.0-b34/javax.inject-2.4.0-b34.jar:/home/jenkins/.m2/repository/org/glassfish/jersey/containers/jersey-container-servlet-core/2.22.2/jersey-container-servlet-core-2.22.2.jar:/home/jenkins/.m2/repository/oro/oro/2.0.8/oro-2.0.8.jar:/home/jenkins/.m2/repository/org/apache/avro/avro-mapred/1.8.2/avro-mapred-1.8.2-hadoop2.jar:/home/jenkins/workspace/spark-branch-2.4-test-maven-hadoop-2.7/common/tags/target/scala-2.11/test-classes:/home/jenkins/.m2/repository/org/eclipse/jetty/jetty-continuation/9.3.27.v20190418/jetty-continuation-9.3.27.v20190418.jar:/home/jenkins/workspace/spark-branch-2.4-test-maven-hadoop-2.7/common/network-common/target/scala-2.11/classes:/home/jenkins/.m2/repository/org/apache/hadoop/hadoop-yarn-common/2.7.3/hadoop-yarn-common-2.7.3.jar:/home/jenkins/.m2/repository/org/eclipse/jetty/jetty-http/9.3.27.v20190418/jetty-http-9.3.27.v20190418.jar:/home/jenkins/.m2/repository/org/scalatest/scalatest_2.11/3.0.3/scalatest_2.11-3.0.3.jar:/home/jenkins/workspace/spark-branch-2.4-test-maven-hadoop-2.7/common/unsafe/target/scala-2.11/classes:/home/jenkins/.m2/repository/org/apache/hadoop/hadoop-yarn-api/2.7.3/hadoop-yarn-api-2.7.3.jar:/home/jenkins/.m2/repository/log4j/log4j/1.2.17/log4j-1.2.17.jar:/home/jenkins/.m2/repository/com/novocode/junit-interface/0.11/junit-interface-0.11.jar:/home/jenkins/.m2/repository/org/apache/hadoop/hadoop-yarn-server-common/2.7.3/hadoop-yarn-server-common-2.7.3.jar:/home/jenkins/.m2/repository/org/apache/httpcomponents/httpcore/4.4.10/httpcore-4.4.10.jar:/home/jenkins/workspace/spark-branch-2.4-test-maven-hadoop-2.7/streaming/target/scala-2.11/classes:/home/jenkins/.m2/repository/org/apache/curator/curator-framework/2.7.1/curator-framework-2.7.1.jar:/home/jenkins/.m2/repository/org/apache/curator/curator-recipes/2.7.1/curator-recipes-2.7.1.jar:/home/jenkins/.m2/repository/org/eclipse/jetty/jetty-xml/9.3.27.v20190418/jetty-xml-9.3.27.v20190418.jar:/home/jenkins/.m2/repository/io/dropwizard/metrics/metrics-json/3.1.5/metrics-json-3.1.5.jar:/home/jenkins/.m2/repository/com/amazonaws/aws-java-sdk-kinesis/1.11.655/aws-java-sdk-kinesis-1.11.655.jar:/home/jenkins/.m2/repository/org/apache/avro/avro/1.8.2/avro-1.8.2.jar:/home/jenkins/.m2/repository/org/apache/directory/server/apacheds-kerberos-codec/2.0.0-M15/apacheds-kerberos-codec-2.0.0-M15.jar:/home/jenkins/.m2/repository/io/dropwizard/metrics/metrics-core/3.1.5/metrics-core-3.1.5.jar:/home/jenkins/workspace/spark-branch-2.4-test-maven-hadoop-2.7/common/tags/target/scala-2.11/classes:/home/jenkins/.m2/repository/org/slf4j/slf4j-api/1.7.16/slf4j-api-1.7.16.jar:/home/jenkins/.m2/repository/org/eclipse/jetty/jetty-io/9.3.27.v20190418/jetty-io-9.3.27.v20190418.jar:/home/jenkins/workspace/spark-branch-2.4-test-maven-hadoop-2.7/launcher/target/scala-2.11/classes:/home/jenkins/.m2/repository/org/mortbay/jetty/jetty-util/6.1.26/jetty-util-6.1.26.jar:/home/jenkins/.m2/repository/org/scala-sbt/test-interface/1.0/test-interface-1.0.jar:/home/jenkins/.m2/repository/org/hamcrest/hamcrest-core/1.3/hamcrest-core-1.3.jar:/home/jenkins/.m2/repository/org/codehaus/jackson/jackson-mapper-asl/1.9.13/jackson-mapper-asl-1.9.13.jar:/home/jenkins/workspace/spark-branch-2.4-test-maven-hadoop-2.7/common/network-shuffle/target/scala-2.11/classes:/home/jenkins/.m2/repository/javax/ws/rs/javax.ws.rs-api/2.0.1/javax.ws.rs-api-2.0.1.jar:/home/jenkins/.m2/repository/javax/servlet/jsp/jsp-api/2.1/jsp-api-2.1.jar:/home/jenkins/.m2/repository/org/glassfish/jersey/core/jersey-client/2.22.2/jersey-client-2.22.2.jar:/home/jenkins/.m2/repository/io/netty/netty/3.9.9.Final/netty-3.9.9.Final.jar:/home/jenkins/.m2/repository/org/roaringbitmap/shims/0.7.45/shims-0.7.45.jar:/home/jenkins/.m2/repository/org/apache/avro/avro-ipc/1.8.2/avro-ipc-1.8.2.jar:/home/jenkins/.m2/repository/xmlenc/xmlenc/0.52/xmlenc-0.52.jar:/home/jenkins/.m2/repository/com/ning/compress-lzf/1.0.3/compress-lzf-1.0.3.jar:/home/jenkins/.m2/repository/org/apache/hadoop/hadoop-hdfs/2.7.3/hadoop-hdfs-2.7.3.jar:/home/jenkins/.m2/repository/org/apache/directory/api/api-util/1.0.0-M20/api-util-1.0.0-M20.jar:/home/jenkins/.m2/repository/com/google/code/gson/gson/2.2.4/gson-2.2.4.jar:/home/jenkins/.m2/repository/org/apache/directory/api/api-asn1-api/1.0.0-M20/api-asn1-api-1.0.0-M20.jar:/home/jenkins/.m2/repository/com/clearspring/analytics/stream/2.7.0/stream-2.7.0.jar:/home/jenkins/.m2/repository/org/apache/hadoop/hadoop-common/2.7.3/hadoop-common-2.7.3.jar:/home/jenkins/.m2/repository/com/fasterxml/jackson/core/jackson-annotations/2.6.7/jackson-annotations-2.6.7.jar:/home/jenkins/.m2/repository/commons-configuration/commons-configuration/1.6/commons-configuration-1.6.jar:/home/jenkins/.m2/repository/org/glassfish/jersey/containers/jersey-container-servlet/2.22.2/jersey-container-servlet-2.22.2.jar:/home/jenkins/.m2/repository/commons-digester/commons-digester/1.8/commons-digester-1.8.jar:/home/jenkins/.m2/repository/org/slf4j/jul-to-slf4j/1.7.16/jul-to-slf4j-1.7.16.jar:/home/jenkins/.m2/repository/org/scala-lang/scala-library/2.11.12/scala-library-2.11.12.jar:/home/jenkins/.m2/repository/org/apache/directory/server/apacheds-i18n/2.0.0-M15/apacheds-i18n-2.0.0-M15.jar:/home/jenkins/.m2/repository/com/fasterxml/jackson/dataformat/jackson-dataformat-cbor/2.6.7/jackson-dataformat-cbor-2.6.7.jar:/home/jenkins/.m2/repository/org/eclipse/jetty/jetty-proxy/9.3.27.v20190418/jetty-proxy-9.3.27.v20190418.jar:/home/jenkins/.m2/repository/org/apache/curator/curator-client/2.7.1/curator-client-2.7.1.jar:/home/jenkins/.m2/repository/org/roaringbitmap/RoaringBitmap/0.7.45/RoaringBitmap-0.7.45.jar:/home/jenkins/.m2/repository/com/fasterxml/jackson/core/jackson-databind/2.6.7.3/jackson-databind-2.6.7.3.jar:/home/jenkins/.m2/repository/org/eclipse/jetty/jetty-jndi/9.3.27.v20190418/jetty-jndi-9.3.27.v20190418.jar:/home/jenkins/.m2/repository/commons-cli/commons-cli/1.2/commons-cli-1.2.jar:/home/jenkins/.m2/repository/xerces/xercesImpl/2.9.1/xercesImpl-2.9.1.jar:/home/jenkins/.m2/repository/javax/annotation/javax.annotation-api/1.2/javax.annotation-api-1.2.jar:/home/jenkins/.m2/repository/org/objenesis/objenesis/2.1/objenesis-2.1.jar:/home/jenkins/.m2/repository/org/slf4j/slf4j-log4j12/1.7.16/slf4j-log4j12-1.7.16.jar:/home/jenkins/.m2/repository/org/glassfish/jersey/media/jersey-media-jaxb/2.22.2/jersey-media-jaxb-2.22.2.jar:/home/jenkins/.m2/repository/org/spark-project/spark/unused/1.0.0/unused-1.0.0.jar:/home/jenkins/.m2/repository/com/twitter/chill-java/0.9.3/chill-java-0.9.3.jar:/home/jenkins/.m2/repository/org/eclipse/jetty/jetty-plus/9.3.27.v20190418/jetty-plus-9.3.27.v20190418.jar:/home/jenkins/.m2/repository/io/dropwizard/metrics/metrics-jvm/3.1.5/metrics-jvm-3.1.5.jar:/home/jenkins/.m2/repository/org/apache/hadoop/hadoop-annotations/2.7.3/hadoop-annotations-2.7.3.jar:/home/jenkins/.m2/repository/com/github/luben/zstd-jni/1.3.2-2/zstd-jni-1.3.2-2.jar:/home/jenkins/.m2/repository/org/json4s/json4s-core_2.11/3.5.3/json4s-core_2.11-3.5.3.jar:/home/jenkins/.m2/repository/commons-collections/commons-collections/3.2.2/commons-collections-3.2.2.jar:/home/jenkins/.m2/repository/junit/junit/4.12/junit-4.12.jar:/home/jenkins/.m2/repository/org/eclipse/jetty/jetty-servlets/9.3.27.v20190418/jetty-servlets-9.3.27.v20190418.jar:/home/jenkins/.m2/repository/org/glassfish/hk2/hk2-locator/2.4.0-b34/hk2-locator-2.4.0-b34.jar:/home/jenkins/.m2/repository/org/apache/hadoop/hadoop-mapreduce-client-app/2.7.3/hadoop-mapreduce-client-app-2.7.3.jar:/home/jenkins/.m2/repository/commons-logging/commons-logging/1.1.3/commons-logging-1.1.3.jar:/home/jenkins/.m2/repository/net/razorvine/pyrolite/4.13/pyrolite-4.13.jar:/home/jenkins/.m2/repository/org/apache/httpcomponents/httpclient/4.5.6/httpclient-4.5.6.jar:/home/jenkins/.m2/repository/com/amazonaws/jmespath-java/1.11.655/jmespath-java-1.11.655.jar:/home/jenkins/.m2/repository/software/amazon/ion/ion-java/1.0.2/ion-java-1.0.2.jar:/home/jenkins/.m2/repository/org/slf4j/jcl-over-slf4j/1.7.16/jcl-over-slf4j-1.7.16.jar:/home/jenkins/.m2/repository/commons-httpclient/commons-httpclient/3.1/commons-httpclient-3.1.jar
[INFO] 
[INFO] --- scala-maven-plugin:3.2.2:testCompile (scala-test-compile-first) @ spark-streaming-kinesis-asl_2.11 ---
[INFO] Using zinc server for incremental compilation
[info] Compiling 8 Scala sources and 2 Java sources to /home/jenkins/workspace/spark-branch-2.4-test-maven-hadoop-2.7/external/kinesis-asl/target/scala-2.11/test-classes...
[warn] /home/jenkins/workspace/spark-branch-2.4-test-maven-hadoop-2.7/external/kinesis-asl/src/test/scala/org/apache/spark/streaming/kinesis/KinesisInputDStreamBuilderSuite.scala:163: method initialPositionInStream in class Builder is deprecated: use initialPosition(initialPosition: KinesisInitialPosition)
[warn]         .initialPositionInStream(InitialPositionInStream.AT_TIMESTAMP)
[warn]          ^
[warn] /home/jenkins/workspace/spark-branch-2.4-test-maven-hadoop-2.7/external/kinesis-asl/src/test/scala/org/apache/spark/streaming/kinesis/KinesisStreamSuite.scala:103: method createStream in object KinesisUtils is deprecated: Use KinesisInputDStream.builder instead
[warn]     val kinesisStream1 = KinesisUtils.createStream(ssc, "myAppName", "mySparkStream",
[warn]                                       ^
[warn] /home/jenkins/workspace/spark-branch-2.4-test-maven-hadoop-2.7/external/kinesis-asl/src/test/scala/org/apache/spark/streaming/kinesis/KinesisStreamSuite.scala:106: method createStream in object KinesisUtils is deprecated: Use KinesisInputDStream.builder instead
[warn]     val kinesisStream2 = KinesisUtils.createStream(ssc, "myAppName", "mySparkStream",
[warn]                                       ^
[warn] /home/jenkins/workspace/spark-branch-2.4-test-maven-hadoop-2.7/external/kinesis-asl/src/test/scala/org/apache/spark/streaming/kinesis/KinesisStreamSuite.scala:113: method createStream in object KinesisUtils is deprecated: Use KinesisInputDStream.builder instead
[warn]     val inputStream = KinesisUtils.createStream(ssc, appName, "dummyStream",
[warn]                                    ^
[warn] four warnings found
[warn] /home/jenkins/workspace/spark-branch-2.4-test-maven-hadoop-2.7/external/kinesis-asl/src/test/java/org/apache/spark/streaming/kinesis/JavaKinesisInputDStreamBuilderSuite.java:37: warning: auxiliary class KinesisInitialPosition in KinesisInitialPositions.java should not be accessed from outside its own source file
[warn]     KinesisInitialPosition initialPosition = new TrimHorizon();
[warn]     ^
[warn] /home/jenkins/workspace/spark-branch-2.4-test-maven-hadoop-2.7/external/kinesis-asl/src/test/java/org/apache/spark/streaming/kinesis/JavaKinesisInputDStreamBuilderSuite.java:81: warning: [deprecation] initialPositionInStream(InitialPositionInStream) in Builder has been deprecated
[warn]       .initialPositionInStream(InitialPositionInStream.LATEST)
[warn]       ^
[warn] 2 warnings
[info] Compile success at Sep 23, 2020 12:12:42 PM [9.094s]
[INFO] 
[INFO] --- maven-surefire-plugin:2.22.0:test (default-test) @ spark-streaming-kinesis-asl_2.11 ---
[INFO] 
[INFO] -------------------------------------------------------
[INFO]  T E S T S
[INFO] -------------------------------------------------------
[INFO] Running org.apache.spark.streaming.kinesis.JavaKinesisInputDStreamBuilderSuite
[INFO] Tests run: 2, Failures: 0, Errors: 0, Skipped: 0, Time elapsed: 2.569 s - in org.apache.spark.streaming.kinesis.JavaKinesisInputDStreamBuilderSuite
[INFO] Running org.apache.spark.streaming.kinesis.JavaKinesisStreamSuite
[INFO] Tests run: 5, Failures: 0, Errors: 0, Skipped: 0, Time elapsed: 0.802 s - in org.apache.spark.streaming.kinesis.JavaKinesisStreamSuite
[INFO] 
[INFO] Results:
[INFO] 
[INFO] Tests run: 7, Failures: 0, Errors: 0, Skipped: 0
[INFO] 
[INFO] 
[INFO] --- maven-surefire-plugin:2.22.0:test (test) @ spark-streaming-kinesis-asl_2.11 ---
[INFO] Skipping execution of surefire because it has already been run for this configuration
[INFO] 
[INFO] --- scalatest-maven-plugin:1.0:test (test) @ spark-streaming-kinesis-asl_2.11 ---
Discovery starting.
Discovery completed in 2 seconds, 267 milliseconds.
Run starting. Expected test count is: 37
KinesisInputDStreamBuilderSuite:
- should raise an exception if the StreamingContext is missing
- should raise an exception if the stream name is missing
- should raise an exception if the checkpoint app name is missing
- should propagate required values to KinesisInputDStream
- should propagate default values to KinesisInputDStream
- should propagate custom non-auth values to KinesisInputDStream
- old Api should throw UnsupportedOperationExceptionexception with AT_TIMESTAMP
WithoutAggregationKinesisBackedBlockRDDSuite:
- Basic reading from Kinesis [enable by setting env var ENABLE_KINESIS_TESTS=1] !!! IGNORED !!!
- Read data available in both block manager and Kinesis [enable by setting env var ENABLE_KINESIS_TESTS=1] !!! IGNORED !!!
- Read data available only in block manager, not in Kinesis [enable by setting env var ENABLE_KINESIS_TESTS=1] !!! IGNORED !!!
- Read data available only in Kinesis, not in block manager [enable by setting env var ENABLE_KINESIS_TESTS=1] !!! IGNORED !!!
- Read data available partially in block manager, rest in Kinesis [enable by setting env var ENABLE_KINESIS_TESTS=1] !!! IGNORED !!!
- Test isBlockValid skips block fetching from block manager [enable by setting env var ENABLE_KINESIS_TESTS=1] !!! IGNORED !!!
- Test whether RDD is valid after removing blocks from block manager [enable by setting env var ENABLE_KINESIS_TESTS=1] !!! IGNORED !!!
KinesisReceiverSuite:
- process records including store and set checkpointer
- split into multiple processes if a limitation is set
- shouldn't store and update checkpointer when receiver is stopped
- shouldn't update checkpointer when exception occurs during store
- shutdown should checkpoint if the reason is TERMINATE
- shutdown should not checkpoint if the reason is something other than TERMINATE
- retry success on first attempt
- retry success on second attempt after a Kinesis throttling exception
- retry success on second attempt after a Kinesis dependency exception
- retry failed after a shutdown exception
- retry failed after an invalid state exception
- retry failed after unexpected exception
- retry failed after exhausting all retries
WithAggregationKinesisBackedBlockRDDSuite:
- Basic reading from Kinesis [enable by setting env var ENABLE_KINESIS_TESTS=1] !!! IGNORED !!!
- Read data available in both block manager and Kinesis [enable by setting env var ENABLE_KINESIS_TESTS=1] !!! IGNORED !!!
- Read data available only in block manager, not in Kinesis [enable by setting env var ENABLE_KINESIS_TESTS=1] !!! IGNORED !!!
- Read data available only in Kinesis, not in block manager [enable by setting env var ENABLE_KINESIS_TESTS=1] !!! IGNORED !!!
- Read data available partially in block manager, rest in Kinesis [enable by setting env var ENABLE_KINESIS_TESTS=1] !!! IGNORED !!!
- Test isBlockValid skips block fetching from block manager [enable by setting env var ENABLE_KINESIS_TESTS=1] !!! IGNORED !!!
- Test whether RDD is valid after removing blocks from block manager [enable by setting env var ENABLE_KINESIS_TESTS=1] !!! IGNORED !!!
WithAggregationKinesisStreamSuite:
- KinesisUtils API
- RDD generation
- basic operation [enable by setting env var ENABLE_KINESIS_TESTS=1] !!! IGNORED !!!
- custom message handling [enable by setting env var ENABLE_KINESIS_TESTS=1] !!! IGNORED !!!
- Kinesis read with custom configurations
- split and merge shards in a stream [enable by setting env var ENABLE_KINESIS_TESTS=1] !!! IGNORED !!!
- failure recovery [enable by setting env var ENABLE_KINESIS_TESTS=1] !!! IGNORED !!!
- Prepare KinesisTestUtils [enable by setting env var ENABLE_KINESIS_TESTS=1] !!! IGNORED !!!
KinesisCheckpointerSuite:
- checkpoint is not called twice for the same sequence number
- checkpoint is called after sequence number increases
- should checkpoint if we have exceeded the checkpoint interval
- shouldn't checkpoint if we have not exceeded the checkpoint interval
- should not checkpoint for the same sequence number
- removing checkpointer checkpoints one last time
- if checkpointing is going on, wait until finished before removing and checkpointing
SparkAWSCredentialsBuilderSuite:
- should build DefaultCredentials when given no params
- should build BasicCredentials
- should build STSCredentials
- SparkAWSCredentials classes should be serializable
WithoutAggregationKinesisStreamSuite:
- KinesisUtils API
- RDD generation
- basic operation [enable by setting env var ENABLE_KINESIS_TESTS=1] !!! IGNORED !!!
- custom message handling [enable by setting env var ENABLE_KINESIS_TESTS=1] !!! IGNORED !!!
- Kinesis read with custom configurations
- split and merge shards in a stream [enable by setting env var ENABLE_KINESIS_TESTS=1] !!! IGNORED !!!
- failure recovery [enable by setting env var ENABLE_KINESIS_TESTS=1] !!! IGNORED !!!
- Prepare KinesisTestUtils [enable by setting env var ENABLE_KINESIS_TESTS=1] !!! IGNORED !!!
Run completed in 3 seconds, 794 milliseconds.
Total number of tests run: 37
Suites: completed 9, aborted 0
Tests: succeeded 37, failed 0, canceled 0, ignored 24, pending 0
All tests passed.
[INFO] 
[INFO] ------------------------------------------------------------------------
[INFO] Skipping Spark Project Examples
[INFO] This project has been banned from the build due to previous failures.
[INFO] ------------------------------------------------------------------------
[INFO] 
[INFO] -----< org.apache.spark:spark-streaming-kafka-0-10-assembly_2.11 >------
[INFO] Building Spark Integration for Kafka 0.10 Assembly 2.4.8-SNAPSHOT [27/30]
[INFO] --------------------------------[ jar ]---------------------------------
[INFO] 
[INFO] --- maven-enforcer-plugin:3.0.0-M1:enforce (enforce-versions) @ spark-streaming-kafka-0-10-assembly_2.11 ---
[INFO] 
[INFO] --- maven-enforcer-plugin:3.0.0-M1:enforce (enforce-no-duplicate-dependencies) @ spark-streaming-kafka-0-10-assembly_2.11 ---
[INFO] 
[INFO] --- scala-maven-plugin:3.2.2:add-source (eclipse-add-source) @ spark-streaming-kafka-0-10-assembly_2.11 ---
[INFO] Add Source directory: /home/jenkins/workspace/spark-branch-2.4-test-maven-hadoop-2.7/external/kafka-0-10-assembly/src/main/scala
[INFO] Add Test Source directory: /home/jenkins/workspace/spark-branch-2.4-test-maven-hadoop-2.7/external/kafka-0-10-assembly/src/test/scala
[INFO] 
[INFO] --- maven-dependency-plugin:3.0.2:build-classpath (default-cli) @ spark-streaming-kafka-0-10-assembly_2.11 ---
[INFO] Dependencies classpath:
/home/jenkins/.m2/repository/org/mortbay/jetty/jetty-util/6.1.26/jetty-util-6.1.26.jar:/home/jenkins/.m2/repository/org/apache/hadoop/hadoop-yarn-common/2.7.3/hadoop-yarn-common-2.7.3.jar:/home/jenkins/.m2/repository/org/apache/hadoop/hadoop-yarn-api/2.7.3/hadoop-yarn-api-2.7.3.jar:/home/jenkins/.m2/repository/org/spark-project/spark/unused/1.0.0/unused-1.0.0.jar:/home/jenkins/.m2/repository/org/apache/kafka/kafka-clients/2.0.0/kafka-clients-2.0.0.jar:/home/jenkins/.m2/repository/commons-io/commons-io/2.4/commons-io-2.4.jar:/home/jenkins/.m2/repository/org/codehaus/jackson/jackson-mapper-asl/1.9.13/jackson-mapper-asl-1.9.13.jar:/home/jenkins/.m2/repository/javax/xml/bind/jaxb-api/2.2.2/jaxb-api-2.2.2.jar:/home/jenkins/.m2/repository/org/codehaus/jackson/jackson-jaxrs/1.9.13/jackson-jaxrs-1.9.13.jar:/home/jenkins/.m2/repository/javax/xml/stream/stax-api/1.0-2/stax-api-1.0-2.jar:/home/jenkins/.m2/repository/com/thoughtworks/paranamer/paranamer/2.8/paranamer-2.8.jar:/home/jenkins/.m2/repository/org/codehaus/jackson/jackson-xc/1.9.13/jackson-xc-1.9.13.jar:/home/jenkins/.m2/repository/org/apache/commons/commons-compress/1.4.1/commons-compress-1.4.1.jar:/home/jenkins/.m2/repository/org/apache/hadoop/hadoop-yarn-client/2.7.3/hadoop-yarn-client-2.7.3.jar:/home/jenkins/.m2/repository/org/codehaus/jackson/jackson-core-asl/1.9.13/jackson-core-asl-1.9.13.jar:/home/jenkins/workspace/spark-branch-2.4-test-maven-hadoop-2.7/common/tags/target/scala-2.11/classes:/home/jenkins/workspace/spark-branch-2.4-test-maven-hadoop-2.7/external/kafka-0-10/target/scala-2.11/classes:/home/jenkins/.m2/repository/javax/activation/activation/1.1.1/activation-1.1.1.jar:/home/jenkins/.m2/repository/commons-cli/commons-cli/1.2/commons-cli-1.2.jar:/home/jenkins/.m2/repository/org/tukaani/xz/1.5/xz-1.5.jar
[INFO] 
[INFO] --- maven-remote-resources-plugin:1.5:process (process-resource-bundles) @ spark-streaming-kafka-0-10-assembly_2.11 ---
[INFO] 
[INFO] --- maven-resources-plugin:2.7:resources (default-resources) @ spark-streaming-kafka-0-10-assembly_2.11 ---
[INFO] Using 'UTF-8' encoding to copy filtered resources.
[INFO] skip non existing resourceDirectory /home/jenkins/workspace/spark-branch-2.4-test-maven-hadoop-2.7/external/kafka-0-10-assembly/src/main/resources
[INFO] Copying 3 resources
[INFO] 
[INFO] --- maven-compiler-plugin:3.7.0:compile (default-compile) @ spark-streaming-kafka-0-10-assembly_2.11 ---
[INFO] Not compiling main sources
[INFO] 
[INFO] --- scala-maven-plugin:3.2.2:compile (scala-compile-first) @ spark-streaming-kafka-0-10-assembly_2.11 ---
[INFO] No sources to compile
[INFO] 
[INFO] --- maven-antrun-plugin:1.8:run (create-tmp-dir) @ spark-streaming-kafka-0-10-assembly_2.11 ---
[INFO] Executing tasks

main:
[INFO] Executed tasks
[INFO] 
[INFO] --- maven-resources-plugin:2.7:testResources (default-testResources) @ spark-streaming-kafka-0-10-assembly_2.11 ---
[INFO] Using 'UTF-8' encoding to copy filtered resources.
[INFO] skip non existing resourceDirectory /home/jenkins/workspace/spark-branch-2.4-test-maven-hadoop-2.7/external/kafka-0-10-assembly/src/test/resources
[INFO] Copying 3 resources
[INFO] 
[INFO] --- maven-compiler-plugin:3.7.0:testCompile (default-testCompile) @ spark-streaming-kafka-0-10-assembly_2.11 ---
[INFO] Not compiling test sources
[INFO] 
[INFO] --- maven-dependency-plugin:3.0.2:build-classpath (generate-test-classpath) @ spark-streaming-kafka-0-10-assembly_2.11 ---
[INFO] Dependencies classpath:
/home/jenkins/.m2/repository/org/eclipse/jetty/jetty-security/9.3.27.v20190418/jetty-security-9.3.27.v20190418.jar:/home/jenkins/.m2/repository/com/fasterxml/jackson/module/jackson-module-scala_2.11/2.6.7.1/jackson-module-scala_2.11-2.6.7.1.jar:/home/jenkins/.m2/repository/org/apache/htrace/htrace-core/3.1.0-incubating/htrace-core-3.1.0-incubating.jar:/home/jenkins/.m2/repository/com/google/protobuf/protobuf-java/2.5.0/protobuf-java-2.5.0.jar:/home/jenkins/.m2/repository/org/lz4/lz4-java/1.4.0/lz4-java-1.4.0.jar:/home/jenkins/.m2/repository/org/scalactic/scalactic_2.11/3.0.3/scalactic_2.11-3.0.3.jar:/home/jenkins/.m2/repository/com/fasterxml/jackson/module/jackson-module-paranamer/2.7.9/jackson-module-paranamer-2.7.9.jar:/home/jenkins/.m2/repository/org/json4s/json4s-ast_2.11/3.5.3/json4s-ast_2.11-3.5.3.jar:/home/jenkins/.m2/repository/io/netty/netty-all/4.1.47.Final/netty-all-4.1.47.Final.jar:/home/jenkins/.m2/repository/com/thoughtworks/paranamer/paranamer/2.8/paranamer-2.8.jar:/home/jenkins/.m2/repository/xml-apis/xml-apis/1.4.01/xml-apis-1.4.01.jar:/home/jenkins/.m2/repository/org/fusesource/leveldbjni/leveldbjni-all/1.8/leveldbjni-all-1.8.jar:/home/jenkins/.m2/repository/org/tukaani/xz/1.5/xz-1.5.jar:/home/jenkins/workspace/spark-branch-2.4-test-maven-hadoop-2.7/common/kvstore/target/scala-2.11/classes:/home/jenkins/.m2/repository/org/glassfish/jersey/bundles/repackaged/jersey-guava/2.22.2/jersey-guava-2.22.2.jar:/home/jenkins/.m2/repository/org/apache/commons/commons-crypto/1.0.0/commons-crypto-1.0.0.jar:/home/jenkins/.m2/repository/commons-io/commons-io/2.4/commons-io-2.4.jar:/home/jenkins/.m2/repository/org/scala-lang/scala-reflect/2.11.12/scala-reflect-2.11.12.jar:/home/jenkins/.m2/repository/org/eclipse/jetty/jetty-servlet/9.3.27.v20190418/jetty-servlet-9.3.27.v20190418.jar:/home/jenkins/.m2/repository/org/apache/commons/commons-lang3/3.5/commons-lang3-3.5.jar:/home/jenkins/.m2/repository/org/codehaus/jackson/jackson-jaxrs/1.9.13/jackson-jaxrs-1.9.13.jar:/home/jenkins/.m2/repository/org/apache/hadoop/hadoop-auth/2.7.3/hadoop-auth-2.7.3.jar:/home/jenkins/.m2/repository/com/esotericsoftware/kryo-shaded/4.0.2/kryo-shaded-4.0.2.jar:/home/jenkins/.m2/repository/com/esotericsoftware/minlog/1.3.0/minlog-1.3.0.jar:/home/jenkins/.m2/repository/org/apache/hadoop/hadoop-client/2.7.3/hadoop-client-2.7.3.jar:/home/jenkins/.m2/repository/org/apache/hadoop/hadoop-mapreduce-client-shuffle/2.7.3/hadoop-mapreduce-client-shuffle-2.7.3.jar:/home/jenkins/.m2/repository/org/codehaus/jackson/jackson-core-asl/1.9.13/jackson-core-asl-1.9.13.jar:/home/jenkins/.m2/repository/javax/validation/validation-api/1.1.0.Final/validation-api-1.1.0.Final.jar:/home/jenkins/workspace/spark-branch-2.4-test-maven-hadoop-2.7/core/target/scala-2.11/classes:/home/jenkins/.m2/repository/org/glassfish/jersey/core/jersey-common/2.22.2/jersey-common-2.22.2.jar:/home/jenkins/.m2/repository/org/objenesis/objenesis/2.5.1/objenesis-2.5.1.jar:/home/jenkins/.m2/repository/org/apache/hadoop/hadoop-mapreduce-client-core/2.7.3/hadoop-mapreduce-client-core-2.7.3.jar:/home/jenkins/.m2/repository/org/scala-lang/modules/scala-xml_2.11/1.0.5/scala-xml_2.11-1.0.5.jar:/home/jenkins/.m2/repository/com/google/code/findbugs/jsr305/1.3.9/jsr305-1.3.9.jar:/home/jenkins/.m2/repository/commons-net/commons-net/3.1/commons-net-3.1.jar:/home/jenkins/.m2/repository/javax/xml/bind/jaxb-api/2.2.2/jaxb-api-2.2.2.jar:/home/jenkins/.m2/repository/org/glassfish/hk2/hk2-api/2.4.0-b34/hk2-api-2.4.0-b34.jar:/home/jenkins/.m2/repository/org/xerial/snappy/snappy-java/1.1.7.5/snappy-java-1.1.7.5.jar:/home/jenkins/.m2/repository/org/glassfish/jersey/core/jersey-server/2.22.2/jersey-server-2.22.2.jar:/home/jenkins/.m2/repository/com/twitter/chill_2.11/0.9.3/chill_2.11-0.9.3.jar:/home/jenkins/.m2/repository/commons-lang/commons-lang/2.6/commons-lang-2.6.jar:/home/jenkins/.m2/repository/org/apache/hadoop/hadoop-yarn-client/2.7.3/hadoop-yarn-client-2.7.3.jar:/home/jenkins/.m2/repository/org/apache/zookeeper/zookeeper/3.4.6/zookeeper-3.4.6.jar:/home/jenkins/.m2/repository/javax/activation/activation/1.1.1/activation-1.1.1.jar:/home/jenkins/.m2/repository/commons-codec/commons-codec/1.10/commons-codec-1.10.jar:/home/jenkins/.m2/repository/org/eclipse/jetty/jetty-webapp/9.3.27.v20190418/jetty-webapp-9.3.27.v20190418.jar:/home/jenkins/.m2/repository/org/json4s/json4s-jackson_2.11/3.5.3/json4s-jackson_2.11-3.5.3.jar:/home/jenkins/.m2/repository/org/javassist/javassist/3.18.1-GA/javassist-3.18.1-GA.jar:/home/jenkins/.m2/repository/com/google/guava/guava/14.0.1/guava-14.0.1.jar:/home/jenkins/.m2/repository/org/apache/xbean/xbean-asm6-shaded/4.8/xbean-asm6-shaded-4.8.jar:/home/jenkins/.m2/repository/commons-beanutils/commons-beanutils/1.9.4/commons-beanutils-1.9.4.jar:/home/jenkins/.m2/repository/org/apache/ivy/ivy/2.4.0/ivy-2.4.0.jar:/home/jenkins/.m2/repository/org/apache/kafka/kafka-clients/2.0.0/kafka-clients-2.0.0.jar:/home/jenkins/.m2/repository/org/eclipse/jetty/jetty-util/9.3.27.v20190418/jetty-util-9.3.27.v20190418.jar:/home/jenkins/.m2/repository/org/eclipse/jetty/jetty-client/9.3.27.v20190418/jetty-client-9.3.27.v20190418.jar:/home/jenkins/.m2/repository/javax/servlet/javax.servlet-api/3.1.0/javax.servlet-api-3.1.0.jar:/home/jenkins/.m2/repository/org/glassfish/hk2/osgi-resource-locator/1.0.1/osgi-resource-locator-1.0.1.jar:/home/jenkins/.m2/repository/com/fasterxml/jackson/core/jackson-core/2.6.7/jackson-core-2.6.7.jar:/home/jenkins/.m2/repository/org/apache/commons/commons-math3/3.4.1/commons-math3-3.4.1.jar:/home/jenkins/.m2/repository/org/apache/hadoop/hadoop-mapreduce-client-common/2.7.3/hadoop-mapreduce-client-common-2.7.3.jar:/home/jenkins/.m2/repository/org/scala-lang/modules/scala-parser-combinators_2.11/1.1.0/scala-parser-combinators_2.11-1.1.0.jar:/home/jenkins/.m2/repository/io/dropwizard/metrics/metrics-graphite/3.1.5/metrics-graphite-3.1.5.jar:/home/jenkins/.m2/repository/javax/xml/stream/stax-api/1.0-2/stax-api-1.0-2.jar:/home/jenkins/.m2/repository/org/apache/hadoop/hadoop-mapreduce-client-jobclient/2.7.3/hadoop-mapreduce-client-jobclient-2.7.3.jar:/home/jenkins/.m2/repository/org/codehaus/jackson/jackson-xc/1.9.13/jackson-xc-1.9.13.jar:/home/jenkins/.m2/repository/org/eclipse/jetty/jetty-server/9.3.27.v20190418/jetty-server-9.3.27.v20190418.jar:/home/jenkins/.m2/repository/org/glassfish/hk2/hk2-utils/2.4.0-b34/hk2-utils-2.4.0-b34.jar:/home/jenkins/.m2/repository/org/glassfish/hk2/external/aopalliance-repackaged/2.4.0-b34/aopalliance-repackaged-2.4.0-b34.jar:/home/jenkins/.m2/repository/net/sf/py4j/py4j/0.10.7/py4j-0.10.7.jar:/home/jenkins/.m2/repository/org/json4s/json4s-scalap_2.11/3.5.3/json4s-scalap_2.11-3.5.3.jar:/home/jenkins/.m2/repository/org/glassfish/hk2/external/javax.inject/2.4.0-b34/javax.inject-2.4.0-b34.jar:/home/jenkins/.m2/repository/org/glassfish/jersey/containers/jersey-container-servlet-core/2.22.2/jersey-container-servlet-core-2.22.2.jar:/home/jenkins/.m2/repository/oro/oro/2.0.8/oro-2.0.8.jar:/home/jenkins/.m2/repository/org/apache/avro/avro-mapred/1.8.2/avro-mapred-1.8.2-hadoop2.jar:/home/jenkins/.m2/repository/org/eclipse/jetty/jetty-continuation/9.3.27.v20190418/jetty-continuation-9.3.27.v20190418.jar:/home/jenkins/workspace/spark-branch-2.4-test-maven-hadoop-2.7/common/network-common/target/scala-2.11/classes:/home/jenkins/.m2/repository/org/eclipse/jetty/jetty-http/9.3.27.v20190418/jetty-http-9.3.27.v20190418.jar:/home/jenkins/.m2/repository/org/apache/hadoop/hadoop-yarn-common/2.7.3/hadoop-yarn-common-2.7.3.jar:/home/jenkins/.m2/repository/org/scalatest/scalatest_2.11/3.0.3/scalatest_2.11-3.0.3.jar:/home/jenkins/workspace/spark-branch-2.4-test-maven-hadoop-2.7/common/unsafe/target/scala-2.11/classes:/home/jenkins/.m2/repository/org/apache/hadoop/hadoop-yarn-api/2.7.3/hadoop-yarn-api-2.7.3.jar:/home/jenkins/.m2/repository/log4j/log4j/1.2.17/log4j-1.2.17.jar:/home/jenkins/.m2/repository/com/novocode/junit-interface/0.11/junit-interface-0.11.jar:/home/jenkins/.m2/repository/org/apache/hadoop/hadoop-yarn-server-common/2.7.3/hadoop-yarn-server-common-2.7.3.jar:/home/jenkins/.m2/repository/org/apache/httpcomponents/httpcore/4.4.10/httpcore-4.4.10.jar:/home/jenkins/workspace/spark-branch-2.4-test-maven-hadoop-2.7/streaming/target/scala-2.11/classes:/home/jenkins/.m2/repository/org/apache/curator/curator-framework/2.7.1/curator-framework-2.7.1.jar:/home/jenkins/.m2/repository/org/apache/curator/curator-recipes/2.7.1/curator-recipes-2.7.1.jar:/home/jenkins/.m2/repository/org/eclipse/jetty/jetty-xml/9.3.27.v20190418/jetty-xml-9.3.27.v20190418.jar:/home/jenkins/.m2/repository/io/dropwizard/metrics/metrics-json/3.1.5/metrics-json-3.1.5.jar:/home/jenkins/.m2/repository/org/apache/avro/avro/1.8.2/avro-1.8.2.jar:/home/jenkins/.m2/repository/org/apache/commons/commons-compress/1.4.1/commons-compress-1.4.1.jar:/home/jenkins/.m2/repository/org/apache/directory/server/apacheds-kerberos-codec/2.0.0-M15/apacheds-kerberos-codec-2.0.0-M15.jar:/home/jenkins/.m2/repository/io/dropwizard/metrics/metrics-core/3.1.5/metrics-core-3.1.5.jar:/home/jenkins/workspace/spark-branch-2.4-test-maven-hadoop-2.7/common/tags/target/scala-2.11/classes:/home/jenkins/workspace/spark-branch-2.4-test-maven-hadoop-2.7/external/kafka-0-10/target/scala-2.11/classes:/home/jenkins/.m2/repository/org/slf4j/slf4j-api/1.7.16/slf4j-api-1.7.16.jar:/home/jenkins/.m2/repository/org/eclipse/jetty/jetty-io/9.3.27.v20190418/jetty-io-9.3.27.v20190418.jar:/home/jenkins/workspace/spark-branch-2.4-test-maven-hadoop-2.7/launcher/target/scala-2.11/classes:/home/jenkins/.m2/repository/org/mortbay/jetty/jetty-util/6.1.26/jetty-util-6.1.26.jar:/home/jenkins/.m2/repository/org/scala-sbt/test-interface/1.0/test-interface-1.0.jar:/home/jenkins/.m2/repository/org/hamcrest/hamcrest-core/1.3/hamcrest-core-1.3.jar:/home/jenkins/.m2/repository/org/codehaus/jackson/jackson-mapper-asl/1.9.13/jackson-mapper-asl-1.9.13.jar:/home/jenkins/workspace/spark-branch-2.4-test-maven-hadoop-2.7/common/network-shuffle/target/scala-2.11/classes:/home/jenkins/.m2/repository/javax/ws/rs/javax.ws.rs-api/2.0.1/javax.ws.rs-api-2.0.1.jar:/home/jenkins/.m2/repository/javax/servlet/jsp/jsp-api/2.1/jsp-api-2.1.jar:/home/jenkins/.m2/repository/org/glassfish/jersey/core/jersey-client/2.22.2/jersey-client-2.22.2.jar:/home/jenkins/.m2/repository/io/netty/netty/3.9.9.Final/netty-3.9.9.Final.jar:/home/jenkins/.m2/repository/org/roaringbitmap/shims/0.7.45/shims-0.7.45.jar:/home/jenkins/.m2/repository/com/ning/compress-lzf/1.0.3/compress-lzf-1.0.3.jar:/home/jenkins/.m2/repository/xmlenc/xmlenc/0.52/xmlenc-0.52.jar:/home/jenkins/.m2/repository/org/apache/avro/avro-ipc/1.8.2/avro-ipc-1.8.2.jar:/home/jenkins/.m2/repository/org/apache/hadoop/hadoop-hdfs/2.7.3/hadoop-hdfs-2.7.3.jar:/home/jenkins/.m2/repository/org/apache/directory/api/api-util/1.0.0-M20/api-util-1.0.0-M20.jar:/home/jenkins/.m2/repository/com/google/code/gson/gson/2.2.4/gson-2.2.4.jar:/home/jenkins/.m2/repository/com/clearspring/analytics/stream/2.7.0/stream-2.7.0.jar:/home/jenkins/.m2/repository/org/apache/directory/api/api-asn1-api/1.0.0-M20/api-asn1-api-1.0.0-M20.jar:/home/jenkins/.m2/repository/com/fasterxml/jackson/core/jackson-annotations/2.6.7/jackson-annotations-2.6.7.jar:/home/jenkins/.m2/repository/org/apache/hadoop/hadoop-common/2.7.3/hadoop-common-2.7.3.jar:/home/jenkins/.m2/repository/org/glassfish/jersey/containers/jersey-container-servlet/2.22.2/jersey-container-servlet-2.22.2.jar:/home/jenkins/.m2/repository/commons-configuration/commons-configuration/1.6/commons-configuration-1.6.jar:/home/jenkins/.m2/repository/org/slf4j/jul-to-slf4j/1.7.16/jul-to-slf4j-1.7.16.jar:/home/jenkins/.m2/repository/commons-digester/commons-digester/1.8/commons-digester-1.8.jar:/home/jenkins/.m2/repository/org/apache/directory/server/apacheds-i18n/2.0.0-M15/apacheds-i18n-2.0.0-M15.jar:/home/jenkins/.m2/repository/org/scala-lang/scala-library/2.11.12/scala-library-2.11.12.jar:/home/jenkins/.m2/repository/org/eclipse/jetty/jetty-proxy/9.3.27.v20190418/jetty-proxy-9.3.27.v20190418.jar:/home/jenkins/.m2/repository/org/apache/curator/curator-client/2.7.1/curator-client-2.7.1.jar:/home/jenkins/.m2/repository/org/roaringbitmap/RoaringBitmap/0.7.45/RoaringBitmap-0.7.45.jar:/home/jenkins/.m2/repository/com/fasterxml/jackson/core/jackson-databind/2.6.7.3/jackson-databind-2.6.7.3.jar:/home/jenkins/.m2/repository/org/eclipse/jetty/jetty-jndi/9.3.27.v20190418/jetty-jndi-9.3.27.v20190418.jar:/home/jenkins/.m2/repository/commons-cli/commons-cli/1.2/commons-cli-1.2.jar:/home/jenkins/.m2/repository/xerces/xercesImpl/2.9.1/xercesImpl-2.9.1.jar:/home/jenkins/.m2/repository/javax/annotation/javax.annotation-api/1.2/javax.annotation-api-1.2.jar:/home/jenkins/.m2/repository/org/slf4j/slf4j-log4j12/1.7.16/slf4j-log4j12-1.7.16.jar:/home/jenkins/.m2/repository/org/glassfish/jersey/media/jersey-media-jaxb/2.22.2/jersey-media-jaxb-2.22.2.jar:/home/jenkins/.m2/repository/org/spark-project/spark/unused/1.0.0/unused-1.0.0.jar:/home/jenkins/.m2/repository/com/twitter/chill-java/0.9.3/chill-java-0.9.3.jar:/home/jenkins/.m2/repository/org/eclipse/jetty/jetty-plus/9.3.27.v20190418/jetty-plus-9.3.27.v20190418.jar:/home/jenkins/.m2/repository/io/dropwizard/metrics/metrics-jvm/3.1.5/metrics-jvm-3.1.5.jar:/home/jenkins/.m2/repository/com/github/luben/zstd-jni/1.3.2-2/zstd-jni-1.3.2-2.jar:/home/jenkins/.m2/repository/org/apache/hadoop/hadoop-annotations/2.7.3/hadoop-annotations-2.7.3.jar:/home/jenkins/.m2/repository/org/json4s/json4s-core_2.11/3.5.3/json4s-core_2.11-3.5.3.jar:/home/jenkins/.m2/repository/commons-collections/commons-collections/3.2.2/commons-collections-3.2.2.jar:/home/jenkins/.m2/repository/junit/junit/4.12/junit-4.12.jar:/home/jenkins/.m2/repository/org/eclipse/jetty/jetty-servlets/9.3.27.v20190418/jetty-servlets-9.3.27.v20190418.jar:/home/jenkins/.m2/repository/org/glassfish/hk2/hk2-locator/2.4.0-b34/hk2-locator-2.4.0-b34.jar:/home/jenkins/.m2/repository/org/apache/hadoop/hadoop-mapreduce-client-app/2.7.3/hadoop-mapreduce-client-app-2.7.3.jar:/home/jenkins/.m2/repository/net/razorvine/pyrolite/4.13/pyrolite-4.13.jar:/home/jenkins/.m2/repository/org/apache/httpcomponents/httpclient/4.5.6/httpclient-4.5.6.jar:/home/jenkins/.m2/repository/org/slf4j/jcl-over-slf4j/1.7.16/jcl-over-slf4j-1.7.16.jar:/home/jenkins/.m2/repository/commons-httpclient/commons-httpclient/3.1/commons-httpclient-3.1.jar
[INFO] 
[INFO] --- scala-maven-plugin:3.2.2:testCompile (scala-test-compile-first) @ spark-streaming-kafka-0-10-assembly_2.11 ---
[INFO] No sources to compile
[INFO] 
[INFO] --- maven-surefire-plugin:2.22.0:test (default-test) @ spark-streaming-kafka-0-10-assembly_2.11 ---
[INFO] 
[INFO] --- maven-surefire-plugin:2.22.0:test (test) @ spark-streaming-kafka-0-10-assembly_2.11 ---
[INFO] Skipping execution of surefire because it has already been run for this configuration
[INFO] 
[INFO] --- scalatest-maven-plugin:1.0:test (test) @ spark-streaming-kafka-0-10-assembly_2.11 ---
Discovery starting.
Discovery completed in 41 milliseconds.
Run starting. Expected test count is: 0
DiscoverySuite:
Run completed in 97 milliseconds.
Total number of tests run: 0
Suites: completed 1, aborted 0
Tests: succeeded 0, failed 0, canceled 0, ignored 0, pending 0
No tests were executed.
[INFO] 
[INFO] ------------------< org.apache.spark:spark-avro_2.11 >------------------
[INFO] Building Spark Avro 2.4.8-SNAPSHOT                               [28/30]
[INFO] --------------------------------[ jar ]---------------------------------
[INFO] 
[INFO] --- maven-enforcer-plugin:3.0.0-M1:enforce (enforce-versions) @ spark-avro_2.11 ---
[INFO] 
[INFO] --- maven-enforcer-plugin:3.0.0-M1:enforce (enforce-no-duplicate-dependencies) @ spark-avro_2.11 ---
[INFO] 
[INFO] --- scala-maven-plugin:3.2.2:add-source (eclipse-add-source) @ spark-avro_2.11 ---
[INFO] Add Source directory: /home/jenkins/workspace/spark-branch-2.4-test-maven-hadoop-2.7/external/avro/src/main/scala
[INFO] Add Test Source directory: /home/jenkins/workspace/spark-branch-2.4-test-maven-hadoop-2.7/external/avro/src/test/scala
[INFO] 
[INFO] --- maven-dependency-plugin:3.0.2:build-classpath (default-cli) @ spark-avro_2.11 ---
[INFO] Dependencies classpath:
/home/jenkins/.m2/repository/org/apache/hadoop/hadoop-yarn-common/2.7.3/hadoop-yarn-common-2.7.3.jar:/home/jenkins/.m2/repository/org/apache/hadoop/hadoop-yarn-api/2.7.3/hadoop-yarn-api-2.7.3.jar:/home/jenkins/.m2/repository/log4j/log4j/1.2.17/log4j-1.2.17.jar:/home/jenkins/.m2/repository/org/apache/htrace/htrace-core/3.1.0-incubating/htrace-core-3.1.0-incubating.jar:/home/jenkins/.m2/repository/org/apache/hadoop/hadoop-yarn-server-common/2.7.3/hadoop-yarn-server-common-2.7.3.jar:/home/jenkins/.m2/repository/com/google/protobuf/protobuf-java/2.5.0/protobuf-java-2.5.0.jar:/home/jenkins/.m2/repository/org/apache/httpcomponents/httpcore/4.4.10/httpcore-4.4.10.jar:/home/jenkins/.m2/repository/org/apache/curator/curator-framework/2.7.1/curator-framework-2.7.1.jar:/home/jenkins/.m2/repository/org/apache/parquet/parquet-column/1.10.1/parquet-column-1.10.1.jar:/home/jenkins/.m2/repository/org/apache/curator/curator-recipes/2.7.1/curator-recipes-2.7.1.jar:/home/jenkins/.m2/repository/org/apache/commons/commons-compress/1.8.1/commons-compress-1.8.1.jar:/home/jenkins/.m2/repository/io/netty/netty-all/4.1.47.Final/netty-all-4.1.47.Final.jar:/home/jenkins/.m2/repository/com/thoughtworks/paranamer/paranamer/2.8/paranamer-2.8.jar:/home/jenkins/.m2/repository/org/apache/avro/avro/1.8.2/avro-1.8.2.jar:/home/jenkins/.m2/repository/org/apache/directory/server/apacheds-kerberos-codec/2.0.0-M15/apacheds-kerberos-codec-2.0.0-M15.jar:/home/jenkins/workspace/spark-branch-2.4-test-maven-hadoop-2.7/common/tags/target/scala-2.11/classes:/home/jenkins/.m2/repository/org/fusesource/leveldbjni/leveldbjni-all/1.8/leveldbjni-all-1.8.jar:/home/jenkins/.m2/repository/org/slf4j/slf4j-api/1.7.16/slf4j-api-1.7.16.jar:/home/jenkins/.m2/repository/org/tukaani/xz/1.5/xz-1.5.jar:/home/jenkins/.m2/repository/org/mortbay/jetty/jetty-util/6.1.26/jetty-util-6.1.26.jar:/home/jenkins/.m2/repository/commons-io/commons-io/2.4/commons-io-2.4.jar:/home/jenkins/.m2/repository/org/codehaus/jackson/jackson-mapper-asl/1.9.13/jackson-mapper-asl-1.9.13.jar:/home/jenkins/.m2/repository/javax/servlet/jsp/jsp-api/2.1/jsp-api-2.1.jar:/home/jenkins/.m2/repository/org/codehaus/jackson/jackson-jaxrs/1.9.13/jackson-jaxrs-1.9.13.jar:/home/jenkins/.m2/repository/org/apache/parquet/parquet-hadoop/1.10.1/parquet-hadoop-1.10.1.jar:/home/jenkins/.m2/repository/io/netty/netty/3.9.9.Final/netty-3.9.9.Final.jar:/home/jenkins/.m2/repository/org/apache/orc/orc-shims/1.5.5/orc-shims-1.5.5.jar:/home/jenkins/.m2/repository/org/apache/hadoop/hadoop-auth/2.7.3/hadoop-auth-2.7.3.jar:/home/jenkins/.m2/repository/org/apache/avro/avro-ipc/1.8.2/avro-ipc-1.8.2.jar:/home/jenkins/.m2/repository/org/apache/hadoop/hadoop-client/2.7.3/hadoop-client-2.7.3.jar:/home/jenkins/.m2/repository/xmlenc/xmlenc/0.52/xmlenc-0.52.jar:/home/jenkins/.m2/repository/org/apache/hadoop/hadoop-hdfs/2.7.3/hadoop-hdfs-2.7.3.jar:/home/jenkins/.m2/repository/org/apache/hadoop/hadoop-mapreduce-client-shuffle/2.7.3/hadoop-mapreduce-client-shuffle-2.7.3.jar:/home/jenkins/.m2/repository/org/codehaus/jackson/jackson-core-asl/1.9.13/jackson-core-asl-1.9.13.jar:/home/jenkins/.m2/repository/org/apache/directory/api/api-util/1.0.0-M20/api-util-1.0.0-M20.jar:/home/jenkins/.m2/repository/com/google/code/gson/gson/2.2.4/gson-2.2.4.jar:/home/jenkins/.m2/repository/org/apache/directory/api/api-asn1-api/1.0.0-M20/api-asn1-api-1.0.0-M20.jar:/home/jenkins/.m2/repository/org/apache/parquet/parquet-common/1.10.1/parquet-common-1.10.1.jar:/home/jenkins/.m2/repository/org/apache/hadoop/hadoop-mapreduce-client-core/2.7.3/hadoop-mapreduce-client-core-2.7.3.jar:/home/jenkins/.m2/repository/org/apache/hadoop/hadoop-common/2.7.3/hadoop-common-2.7.3.jar:/home/jenkins/.m2/repository/org/apache/orc/orc-mapreduce/1.5.5/orc-mapreduce-1.5.5-nohive.jar:/home/jenkins/.m2/repository/org/apache/parquet/parquet-format/2.4.0/parquet-format-2.4.0.jar:/home/jenkins/.m2/repository/commons-configuration/commons-configuration/1.6/commons-configuration-1.6.jar:/home/jenkins/.m2/repository/com/google/code/findbugs/jsr305/1.3.9/jsr305-1.3.9.jar:/home/jenkins/.m2/repository/commons-net/commons-net/3.1/commons-net-3.1.jar:/home/jenkins/.m2/repository/commons-digester/commons-digester/1.8/commons-digester-1.8.jar:/home/jenkins/.m2/repository/io/airlift/aircompressor/0.10/aircompressor-0.10.jar:/home/jenkins/.m2/repository/org/apache/directory/server/apacheds-i18n/2.0.0-M15/apacheds-i18n-2.0.0-M15.jar:/home/jenkins/.m2/repository/org/scala-lang/scala-library/2.11.12/scala-library-2.11.12.jar:/home/jenkins/.m2/repository/javax/xml/bind/jaxb-api/2.2.2/jaxb-api-2.2.2.jar:/home/jenkins/.m2/repository/org/xerial/snappy/snappy-java/1.1.7.5/snappy-java-1.1.7.5.jar:/home/jenkins/.m2/repository/commons-lang/commons-lang/2.6/commons-lang-2.6.jar:/home/jenkins/.m2/repository/org/apache/hadoop/hadoop-yarn-client/2.7.3/hadoop-yarn-client-2.7.3.jar:/home/jenkins/.m2/repository/org/apache/curator/curator-client/2.7.1/curator-client-2.7.1.jar:/home/jenkins/.m2/repository/org/apache/orc/orc-core/1.5.5/orc-core-1.5.5-nohive.jar:/home/jenkins/.m2/repository/org/apache/zookeeper/zookeeper/3.4.6/zookeeper-3.4.6.jar:/home/jenkins/.m2/repository/javax/activation/activation/1.1.1/activation-1.1.1.jar:/home/jenkins/.m2/repository/commons-cli/commons-cli/1.2/commons-cli-1.2.jar:/home/jenkins/.m2/repository/commons-codec/commons-codec/1.10/commons-codec-1.10.jar:/home/jenkins/.m2/repository/org/apache/parquet/parquet-encoding/1.10.1/parquet-encoding-1.10.1.jar:/home/jenkins/.m2/repository/xerces/xercesImpl/2.9.1/xercesImpl-2.9.1.jar:/home/jenkins/.m2/repository/org/slf4j/slf4j-log4j12/1.7.16/slf4j-log4j12-1.7.16.jar:/home/jenkins/.m2/repository/commons-beanutils/commons-beanutils/1.9.4/commons-beanutils-1.9.4.jar:/home/jenkins/.m2/repository/org/spark-project/spark/unused/1.0.0/unused-1.0.0.jar:/home/jenkins/.m2/repository/org/apache/hadoop/hadoop-annotations/2.7.3/hadoop-annotations-2.7.3.jar:/home/jenkins/.m2/repository/org/apache/commons/commons-math3/3.4.1/commons-math3-3.4.1.jar:/home/jenkins/.m2/repository/commons-collections/commons-collections/3.2.2/commons-collections-3.2.2.jar:/home/jenkins/.m2/repository/org/apache/hadoop/hadoop-mapreduce-client-common/2.7.3/hadoop-mapreduce-client-common-2.7.3.jar:/home/jenkins/.m2/repository/javax/xml/stream/stax-api/1.0-2/stax-api-1.0-2.jar:/home/jenkins/.m2/repository/org/apache/hadoop/hadoop-mapreduce-client-jobclient/2.7.3/hadoop-mapreduce-client-jobclient-2.7.3.jar:/home/jenkins/.m2/repository/org/apache/parquet/parquet-jackson/1.10.1/parquet-jackson-1.10.1.jar:/home/jenkins/.m2/repository/org/apache/hadoop/hadoop-mapreduce-client-app/2.7.3/hadoop-mapreduce-client-app-2.7.3.jar:/home/jenkins/.m2/repository/org/codehaus/jackson/jackson-xc/1.9.13/jackson-xc-1.9.13.jar:/home/jenkins/.m2/repository/org/apache/httpcomponents/httpclient/4.5.6/httpclient-4.5.6.jar:/home/jenkins/.m2/repository/org/apache/avro/avro-mapred/1.8.2/avro-mapred-1.8.2-hadoop2.jar:/home/jenkins/.m2/repository/commons-httpclient/commons-httpclient/3.1/commons-httpclient-3.1.jar
[INFO] 
[INFO] --- maven-remote-resources-plugin:1.5:process (process-resource-bundles) @ spark-avro_2.11 ---
[INFO] 
[INFO] --- maven-resources-plugin:2.7:resources (default-resources) @ spark-avro_2.11 ---
[INFO] Using 'UTF-8' encoding to copy filtered resources.
[INFO] Copying 1 resource
[INFO] Copying 3 resources
[INFO] 
[INFO] --- maven-compiler-plugin:3.7.0:compile (default-compile) @ spark-avro_2.11 ---
[INFO] Not compiling main sources
[INFO] 
[INFO] --- scala-maven-plugin:3.2.2:compile (scala-compile-first) @ spark-avro_2.11 ---
[INFO] Using zinc server for incremental compilation
[info] Compiling 10 Scala sources and 1 Java source to /home/jenkins/workspace/spark-branch-2.4-test-maven-hadoop-2.7/external/avro/target/scala-2.11/classes...
[warn] /home/jenkins/workspace/spark-branch-2.4-test-maven-hadoop-2.7/external/avro/src/main/java/org/apache/spark/sql/avro/SparkAvroKeyOutputFormat.java:55: warning: [rawtypes] found raw type: SparkAvroKeyRecordWriter
[warn]       return new SparkAvroKeyRecordWriter(
[warn]                  ^
[warn]   missing type arguments for generic class SparkAvroKeyRecordWriter<T>
[warn]   where T is a type-variable:
[warn]     T extends Object declared in class SparkAvroKeyRecordWriter
[warn] /home/jenkins/workspace/spark-branch-2.4-test-maven-hadoop-2.7/external/avro/src/main/java/org/apache/spark/sql/avro/SparkAvroKeyOutputFormat.java:55: warning: [unchecked] unchecked call to SparkAvroKeyRecordWriter(Schema,GenericData,CodecFactory,OutputStream,int,Map<String,String>) as a member of the raw type SparkAvroKeyRecordWriter
[warn]       return new SparkAvroKeyRecordWriter(
[warn]              ^
[warn] /home/jenkins/workspace/spark-branch-2.4-test-maven-hadoop-2.7/external/avro/src/main/java/org/apache/spark/sql/avro/SparkAvroKeyOutputFormat.java:55: warning: [unchecked] unchecked conversion
[warn]       return new SparkAvroKeyRecordWriter(
[warn]              ^
[warn]   required: RecordWriter<AvroKey<GenericRecord>,NullWritable>
[warn]   found:    SparkAvroKeyRecordWriter
[warn] /home/jenkins/workspace/spark-branch-2.4-test-maven-hadoop-2.7/external/avro/src/main/java/org/apache/spark/sql/avro/SparkAvroKeyOutputFormat.java:74: warning: [rawtypes] found raw type: DataFileWriter
[warn]     this.mAvroFileWriter = new DataFileWriter(dataModel.createDatumWriter(writerSchema));
[warn]                                ^
[warn]   missing type arguments for generic class DataFileWriter<D>
[warn]   where D is a type-variable:
[warn]     D extends Object declared in class DataFileWriter
[warn] /home/jenkins/workspace/spark-branch-2.4-test-maven-hadoop-2.7/external/avro/src/main/java/org/apache/spark/sql/avro/SparkAvroKeyOutputFormat.java:74: warning: [unchecked] unchecked call to DataFileWriter(DatumWriter<D>) as a member of the raw type DataFileWriter
[warn]     this.mAvroFileWriter = new DataFileWriter(dataModel.createDatumWriter(writerSchema));
[warn]                            ^
[warn]   where D is a type-variable:
[warn]     D extends Object declared in class DataFileWriter
[warn] /home/jenkins/workspace/spark-branch-2.4-test-maven-hadoop-2.7/external/avro/src/main/java/org/apache/spark/sql/avro/SparkAvroKeyOutputFormat.java:74: warning: [unchecked] unchecked conversion
[warn]     this.mAvroFileWriter = new DataFileWriter(dataModel.createDatumWriter(writerSchema));
[warn]                            ^
[warn]   required: DataFileWriter<T>
[warn]   found:    DataFileWriter
[warn]   where T is a type-variable:
[warn]     T extends Object declared in class SparkAvroKeyRecordWriter
[warn] 6 warnings
[info] Compile success at Sep 23, 2020 12:13:09 PM [15.274s]
[INFO] 
[INFO] --- maven-antrun-plugin:1.8:run (create-tmp-dir) @ spark-avro_2.11 ---
[INFO] Executing tasks

main:
[INFO] Executed tasks
[INFO] 
[INFO] --- maven-resources-plugin:2.7:testResources (default-testResources) @ spark-avro_2.11 ---
[INFO] Using 'UTF-8' encoding to copy filtered resources.
[INFO] Copying 16 resources
[INFO] Copying 3 resources
[INFO] 
[INFO] --- maven-compiler-plugin:3.7.0:testCompile (default-testCompile) @ spark-avro_2.11 ---
[INFO] Not compiling test sources
[INFO] 
[INFO] --- maven-dependency-plugin:3.0.2:build-classpath (generate-test-classpath) @ spark-avro_2.11 ---
[INFO] Dependencies classpath:
/home/jenkins/.m2/repository/org/eclipse/jetty/jetty-security/9.3.27.v20190418/jetty-security-9.3.27.v20190418.jar:/home/jenkins/.m2/repository/com/fasterxml/jackson/module/jackson-module-scala_2.11/2.6.7.1/jackson-module-scala_2.11-2.6.7.1.jar:/home/jenkins/.m2/repository/org/apache/htrace/htrace-core/3.1.0-incubating/htrace-core-3.1.0-incubating.jar:/home/jenkins/.m2/repository/com/google/protobuf/protobuf-java/2.5.0/protobuf-java-2.5.0.jar:/home/jenkins/.m2/repository/org/lz4/lz4-java/1.4.0/lz4-java-1.4.0.jar:/home/jenkins/.m2/repository/org/scalactic/scalactic_2.11/3.0.3/scalactic_2.11-3.0.3.jar:/home/jenkins/.m2/repository/org/apache/parquet/parquet-column/1.10.1/parquet-column-1.10.1.jar:/home/jenkins/.m2/repository/com/fasterxml/jackson/module/jackson-module-paranamer/2.7.9/jackson-module-paranamer-2.7.9.jar:/home/jenkins/.m2/repository/org/apache/commons/commons-compress/1.8.1/commons-compress-1.8.1.jar:/home/jenkins/.m2/repository/org/json4s/json4s-ast_2.11/3.5.3/json4s-ast_2.11-3.5.3.jar:/home/jenkins/.m2/repository/io/netty/netty-all/4.1.47.Final/netty-all-4.1.47.Final.jar:/home/jenkins/.m2/repository/com/thoughtworks/paranamer/paranamer/2.8/paranamer-2.8.jar:/home/jenkins/.m2/repository/xml-apis/xml-apis/1.4.01/xml-apis-1.4.01.jar:/home/jenkins/.m2/repository/org/fusesource/leveldbjni/leveldbjni-all/1.8/leveldbjni-all-1.8.jar:/home/jenkins/.m2/repository/org/tukaani/xz/1.5/xz-1.5.jar:/home/jenkins/workspace/spark-branch-2.4-test-maven-hadoop-2.7/common/kvstore/target/scala-2.11/classes:/home/jenkins/.m2/repository/org/glassfish/jersey/bundles/repackaged/jersey-guava/2.22.2/jersey-guava-2.22.2.jar:/home/jenkins/.m2/repository/org/apache/commons/commons-crypto/1.0.0/commons-crypto-1.0.0.jar:/home/jenkins/.m2/repository/org/antlr/antlr4-runtime/4.7/antlr4-runtime-4.7.jar:/home/jenkins/.m2/repository/commons-io/commons-io/2.4/commons-io-2.4.jar:/home/jenkins/.m2/repository/org/scala-lang/scala-reflect/2.11.12/scala-reflect-2.11.12.jar:/home/jenkins/.m2/repository/org/eclipse/jetty/jetty-servlet/9.3.27.v20190418/jetty-servlet-9.3.27.v20190418.jar:/home/jenkins/.m2/repository/org/apache/commons/commons-lang3/3.5/commons-lang3-3.5.jar:/home/jenkins/.m2/repository/org/codehaus/jackson/jackson-jaxrs/1.9.13/jackson-jaxrs-1.9.13.jar:/home/jenkins/.m2/repository/org/apache/parquet/parquet-hadoop/1.10.1/parquet-hadoop-1.10.1.jar:/home/jenkins/.m2/repository/org/apache/orc/orc-shims/1.5.5/orc-shims-1.5.5.jar:/home/jenkins/.m2/repository/org/apache/hadoop/hadoop-auth/2.7.3/hadoop-auth-2.7.3.jar:/home/jenkins/.m2/repository/com/esotericsoftware/kryo-shaded/4.0.2/kryo-shaded-4.0.2.jar:/home/jenkins/.m2/repository/com/esotericsoftware/minlog/1.3.0/minlog-1.3.0.jar:/home/jenkins/.m2/repository/org/apache/hadoop/hadoop-client/2.7.3/hadoop-client-2.7.3.jar:/home/jenkins/.m2/repository/org/apache/hadoop/hadoop-mapreduce-client-shuffle/2.7.3/hadoop-mapreduce-client-shuffle-2.7.3.jar:/home/jenkins/.m2/repository/org/codehaus/jackson/jackson-core-asl/1.9.13/jackson-core-asl-1.9.13.jar:/home/jenkins/.m2/repository/javax/validation/validation-api/1.1.0.Final/validation-api-1.1.0.Final.jar:/home/jenkins/.m2/repository/org/scalacheck/scalacheck_2.11/1.13.5/scalacheck_2.11-1.13.5.jar:/home/jenkins/workspace/spark-branch-2.4-test-maven-hadoop-2.7/core/target/scala-2.11/classes:/home/jenkins/.m2/repository/org/glassfish/jersey/core/jersey-common/2.22.2/jersey-common-2.22.2.jar:/home/jenkins/.m2/repository/org/objenesis/objenesis/2.5.1/objenesis-2.5.1.jar:/home/jenkins/.m2/repository/org/apache/hadoop/hadoop-mapreduce-client-core/2.7.3/hadoop-mapreduce-client-core-2.7.3.jar:/home/jenkins/.m2/repository/joda-time/joda-time/2.9.3/joda-time-2.9.3.jar:/home/jenkins/.m2/repository/org/scala-lang/modules/scala-xml_2.11/1.0.5/scala-xml_2.11-1.0.5.jar:/home/jenkins/.m2/repository/org/apache/orc/orc-mapreduce/1.5.5/orc-mapreduce-1.5.5-nohive.jar:/home/jenkins/.m2/repository/com/google/code/findbugs/jsr305/1.3.9/jsr305-1.3.9.jar:/home/jenkins/.m2/repository/commons-net/commons-net/3.1/commons-net-3.1.jar:/home/jenkins/.m2/repository/javax/xml/bind/jaxb-api/2.2.2/jaxb-api-2.2.2.jar:/home/jenkins/.m2/repository/org/glassfish/hk2/hk2-api/2.4.0-b34/hk2-api-2.4.0-b34.jar:/home/jenkins/.m2/repository/org/xerial/snappy/snappy-java/1.1.7.5/snappy-java-1.1.7.5.jar:/home/jenkins/.m2/repository/org/glassfish/jersey/core/jersey-server/2.22.2/jersey-server-2.22.2.jar:/home/jenkins/.m2/repository/com/twitter/chill_2.11/0.9.3/chill_2.11-0.9.3.jar:/home/jenkins/.m2/repository/commons-lang/commons-lang/2.6/commons-lang-2.6.jar:/home/jenkins/.m2/repository/org/apache/hadoop/hadoop-yarn-client/2.7.3/hadoop-yarn-client-2.7.3.jar:/home/jenkins/.m2/repository/org/apache/zookeeper/zookeeper/3.4.6/zookeeper-3.4.6.jar:/home/jenkins/.m2/repository/org/codehaus/janino/janino/3.0.16/janino-3.0.16.jar:/home/jenkins/.m2/repository/javax/activation/activation/1.1.1/activation-1.1.1.jar:/home/jenkins/.m2/repository/commons-codec/commons-codec/1.10/commons-codec-1.10.jar:/home/jenkins/.m2/repository/com/univocity/univocity-parsers/2.7.3/univocity-parsers-2.7.3.jar:/home/jenkins/.m2/repository/com/google/guava/guava/14.0.1/guava-14.0.1.jar:/home/jenkins/.m2/repository/org/apache/parquet/parquet-encoding/1.10.1/parquet-encoding-1.10.1.jar:/home/jenkins/.m2/repository/org/eclipse/jetty/jetty-webapp/9.3.27.v20190418/jetty-webapp-9.3.27.v20190418.jar:/home/jenkins/.m2/repository/org/json4s/json4s-jackson_2.11/3.5.3/json4s-jackson_2.11-3.5.3.jar:/home/jenkins/.m2/repository/org/javassist/javassist/3.18.1-GA/javassist-3.18.1-GA.jar:/home/jenkins/.m2/repository/org/apache/xbean/xbean-asm6-shaded/4.8/xbean-asm6-shaded-4.8.jar:/home/jenkins/.m2/repository/commons-beanutils/commons-beanutils/1.9.4/commons-beanutils-1.9.4.jar:/home/jenkins/.m2/repository/org/apache/ivy/ivy/2.4.0/ivy-2.4.0.jar:/home/jenkins/workspace/spark-branch-2.4-test-maven-hadoop-2.7/core/target/scala-2.11/test-classes:/home/jenkins/.m2/repository/org/eclipse/jetty/jetty-util/9.3.27.v20190418/jetty-util-9.3.27.v20190418.jar:/home/jenkins/.m2/repository/org/eclipse/jetty/jetty-client/9.3.27.v20190418/jetty-client-9.3.27.v20190418.jar:/home/jenkins/.m2/repository/javax/servlet/javax.servlet-api/3.1.0/javax.servlet-api-3.1.0.jar:/home/jenkins/.m2/repository/org/glassfish/hk2/osgi-resource-locator/1.0.1/osgi-resource-locator-1.0.1.jar:/home/jenkins/.m2/repository/com/fasterxml/jackson/core/jackson-core/2.6.7/jackson-core-2.6.7.jar:/home/jenkins/.m2/repository/org/apache/commons/commons-math3/3.4.1/commons-math3-3.4.1.jar:/home/jenkins/.m2/repository/org/apache/hadoop/hadoop-mapreduce-client-common/2.7.3/hadoop-mapreduce-client-common-2.7.3.jar:/home/jenkins/.m2/repository/org/scala-lang/modules/scala-parser-combinators_2.11/1.1.0/scala-parser-combinators_2.11-1.1.0.jar:/home/jenkins/.m2/repository/io/dropwizard/metrics/metrics-graphite/3.1.5/metrics-graphite-3.1.5.jar:/home/jenkins/.m2/repository/javax/xml/stream/stax-api/1.0-2/stax-api-1.0-2.jar:/home/jenkins/.m2/repository/org/apache/hadoop/hadoop-mapreduce-client-jobclient/2.7.3/hadoop-mapreduce-client-jobclient-2.7.3.jar:/home/jenkins/.m2/repository/org/codehaus/jackson/jackson-xc/1.9.13/jackson-xc-1.9.13.jar:/home/jenkins/.m2/repository/org/eclipse/jetty/jetty-server/9.3.27.v20190418/jetty-server-9.3.27.v20190418.jar:/home/jenkins/.m2/repository/org/glassfish/hk2/hk2-utils/2.4.0-b34/hk2-utils-2.4.0-b34.jar:/home/jenkins/.m2/repository/org/glassfish/hk2/external/aopalliance-repackaged/2.4.0-b34/aopalliance-repackaged-2.4.0-b34.jar:/home/jenkins/.m2/repository/net/sf/py4j/py4j/0.10.7/py4j-0.10.7.jar:/home/jenkins/.m2/repository/org/json4s/json4s-scalap_2.11/3.5.3/json4s-scalap_2.11-3.5.3.jar:/home/jenkins/.m2/repository/org/glassfish/hk2/external/javax.inject/2.4.0-b34/javax.inject-2.4.0-b34.jar:/home/jenkins/.m2/repository/org/glassfish/jersey/containers/jersey-container-servlet-core/2.22.2/jersey-container-servlet-core-2.22.2.jar:/home/jenkins/.m2/repository/oro/oro/2.0.8/oro-2.0.8.jar:/home/jenkins/.m2/repository/org/apache/avro/avro-mapred/1.8.2/avro-mapred-1.8.2-hadoop2.jar:/home/jenkins/.m2/repository/org/eclipse/jetty/jetty-continuation/9.3.27.v20190418/jetty-continuation-9.3.27.v20190418.jar:/home/jenkins/workspace/spark-branch-2.4-test-maven-hadoop-2.7/common/network-common/target/scala-2.11/classes:/home/jenkins/.m2/repository/org/apache/hadoop/hadoop-yarn-common/2.7.3/hadoop-yarn-common-2.7.3.jar:/home/jenkins/.m2/repository/org/eclipse/jetty/jetty-http/9.3.27.v20190418/jetty-http-9.3.27.v20190418.jar:/home/jenkins/.m2/repository/org/scalatest/scalatest_2.11/3.0.3/scalatest_2.11-3.0.3.jar:/home/jenkins/workspace/spark-branch-2.4-test-maven-hadoop-2.7/common/unsafe/target/scala-2.11/classes:/home/jenkins/.m2/repository/org/apache/hadoop/hadoop-yarn-api/2.7.3/hadoop-yarn-api-2.7.3.jar:/home/jenkins/.m2/repository/log4j/log4j/1.2.17/log4j-1.2.17.jar:/home/jenkins/.m2/repository/org/codehaus/janino/commons-compiler/3.0.16/commons-compiler-3.0.16.jar:/home/jenkins/.m2/repository/com/novocode/junit-interface/0.11/junit-interface-0.11.jar:/home/jenkins/.m2/repository/org/apache/hadoop/hadoop-yarn-server-common/2.7.3/hadoop-yarn-server-common-2.7.3.jar:/home/jenkins/.m2/repository/org/apache/httpcomponents/httpcore/4.4.10/httpcore-4.4.10.jar:/home/jenkins/workspace/spark-branch-2.4-test-maven-hadoop-2.7/sql/catalyst/target/scala-2.11/classes:/home/jenkins/.m2/repository/org/apache/curator/curator-framework/2.7.1/curator-framework-2.7.1.jar:/home/jenkins/workspace/spark-branch-2.4-test-maven-hadoop-2.7/common/sketch/target/scala-2.11/classes:/home/jenkins/.m2/repository/org/apache/curator/curator-recipes/2.7.1/curator-recipes-2.7.1.jar:/home/jenkins/.m2/repository/org/eclipse/jetty/jetty-xml/9.3.27.v20190418/jetty-xml-9.3.27.v20190418.jar:/home/jenkins/.m2/repository/io/dropwizard/metrics/metrics-json/3.1.5/metrics-json-3.1.5.jar:/home/jenkins/.m2/repository/org/apache/avro/avro/1.8.2/avro-1.8.2.jar:/home/jenkins/.m2/repository/org/apache/directory/server/apacheds-kerberos-codec/2.0.0-M15/apacheds-kerberos-codec-2.0.0-M15.jar:/home/jenkins/.m2/repository/io/dropwizard/metrics/metrics-core/3.1.5/metrics-core-3.1.5.jar:/home/jenkins/workspace/spark-branch-2.4-test-maven-hadoop-2.7/common/tags/target/scala-2.11/classes:/home/jenkins/.m2/repository/org/apache/arrow/arrow-memory/0.10.0/arrow-memory-0.10.0.jar:/home/jenkins/.m2/repository/org/slf4j/slf4j-api/1.7.16/slf4j-api-1.7.16.jar:/home/jenkins/.m2/repository/org/eclipse/jetty/jetty-io/9.3.27.v20190418/jetty-io-9.3.27.v20190418.jar:/home/jenkins/workspace/spark-branch-2.4-test-maven-hadoop-2.7/launcher/target/scala-2.11/classes:/home/jenkins/.m2/repository/org/mortbay/jetty/jetty-util/6.1.26/jetty-util-6.1.26.jar:/home/jenkins/.m2/repository/com/vlkan/flatbuffers/1.2.0-3f79e055/flatbuffers-1.2.0-3f79e055.jar:/home/jenkins/.m2/repository/org/scala-sbt/test-interface/1.0/test-interface-1.0.jar:/home/jenkins/.m2/repository/org/hamcrest/hamcrest-core/1.3/hamcrest-core-1.3.jar:/home/jenkins/.m2/repository/org/codehaus/jackson/jackson-mapper-asl/1.9.13/jackson-mapper-asl-1.9.13.jar:/home/jenkins/workspace/spark-branch-2.4-test-maven-hadoop-2.7/common/network-shuffle/target/scala-2.11/classes:/home/jenkins/.m2/repository/javax/ws/rs/javax.ws.rs-api/2.0.1/javax.ws.rs-api-2.0.1.jar:/home/jenkins/.m2/repository/javax/servlet/jsp/jsp-api/2.1/jsp-api-2.1.jar:/home/jenkins/workspace/spark-branch-2.4-test-maven-hadoop-2.7/sql/catalyst/target/spark-catalyst_2.11-2.4.8-SNAPSHOT-tests.jar:/home/jenkins/.m2/repository/org/glassfish/jersey/core/jersey-client/2.22.2/jersey-client-2.22.2.jar:/home/jenkins/.m2/repository/io/netty/netty/3.9.9.Final/netty-3.9.9.Final.jar:/home/jenkins/.m2/repository/org/roaringbitmap/shims/0.7.45/shims-0.7.45.jar:/home/jenkins/.m2/repository/org/apache/avro/avro-ipc/1.8.2/avro-ipc-1.8.2.jar:/home/jenkins/.m2/repository/xmlenc/xmlenc/0.52/xmlenc-0.52.jar:/home/jenkins/.m2/repository/com/ning/compress-lzf/1.0.3/compress-lzf-1.0.3.jar:/home/jenkins/.m2/repository/org/apache/hadoop/hadoop-hdfs/2.7.3/hadoop-hdfs-2.7.3.jar:/home/jenkins/.m2/repository/org/apache/directory/api/api-util/1.0.0-M20/api-util-1.0.0-M20.jar:/home/jenkins/workspace/spark-branch-2.4-test-maven-hadoop-2.7/sql/core/target/spark-sql_2.11-2.4.8-SNAPSHOT-tests.jar:/home/jenkins/.m2/repository/com/google/code/gson/gson/2.2.4/gson-2.2.4.jar:/home/jenkins/.m2/repository/org/apache/directory/api/api-asn1-api/1.0.0-M20/api-asn1-api-1.0.0-M20.jar:/home/jenkins/.m2/repository/com/clearspring/analytics/stream/2.7.0/stream-2.7.0.jar:/home/jenkins/.m2/repository/org/apache/parquet/parquet-common/1.10.1/parquet-common-1.10.1.jar:/home/jenkins/.m2/repository/org/apache/arrow/arrow-vector/0.10.0/arrow-vector-0.10.0.jar:/home/jenkins/.m2/repository/com/fasterxml/jackson/core/jackson-annotations/2.6.7/jackson-annotations-2.6.7.jar:/home/jenkins/.m2/repository/org/apache/hadoop/hadoop-common/2.7.3/hadoop-common-2.7.3.jar:/home/jenkins/.m2/repository/org/apache/parquet/parquet-format/2.4.0/parquet-format-2.4.0.jar:/home/jenkins/.m2/repository/commons-configuration/commons-configuration/1.6/commons-configuration-1.6.jar:/home/jenkins/.m2/repository/org/glassfish/jersey/containers/jersey-container-servlet/2.22.2/jersey-container-servlet-2.22.2.jar:/home/jenkins/.m2/repository/commons-digester/commons-digester/1.8/commons-digester-1.8.jar:/home/jenkins/.m2/repository/org/slf4j/jul-to-slf4j/1.7.16/jul-to-slf4j-1.7.16.jar:/home/jenkins/.m2/repository/io/airlift/aircompressor/0.10/aircompressor-0.10.jar:/home/jenkins/.m2/repository/org/apache/directory/server/apacheds-i18n/2.0.0-M15/apacheds-i18n-2.0.0-M15.jar:/home/jenkins/.m2/repository/org/scala-lang/scala-library/2.11.12/scala-library-2.11.12.jar:/home/jenkins/.m2/repository/org/eclipse/jetty/jetty-proxy/9.3.27.v20190418/jetty-proxy-9.3.27.v20190418.jar:/home/jenkins/.m2/repository/org/apache/curator/curator-client/2.7.1/curator-client-2.7.1.jar:/home/jenkins/workspace/spark-branch-2.4-test-maven-hadoop-2.7/sql/core/target/scala-2.11/classes:/home/jenkins/.m2/repository/org/apache/orc/orc-core/1.5.5/orc-core-1.5.5-nohive.jar:/home/jenkins/.m2/repository/com/fasterxml/jackson/core/jackson-databind/2.6.7.3/jackson-databind-2.6.7.3.jar:/home/jenkins/.m2/repository/org/roaringbitmap/RoaringBitmap/0.7.45/RoaringBitmap-0.7.45.jar:/home/jenkins/.m2/repository/org/eclipse/jetty/jetty-jndi/9.3.27.v20190418/jetty-jndi-9.3.27.v20190418.jar:/home/jenkins/.m2/repository/org/apache/arrow/arrow-format/0.10.0/arrow-format-0.10.0.jar:/home/jenkins/.m2/repository/commons-cli/commons-cli/1.2/commons-cli-1.2.jar:/home/jenkins/.m2/repository/xerces/xercesImpl/2.9.1/xercesImpl-2.9.1.jar:/home/jenkins/.m2/repository/javax/annotation/javax.annotation-api/1.2/javax.annotation-api-1.2.jar:/home/jenkins/.m2/repository/org/slf4j/slf4j-log4j12/1.7.16/slf4j-log4j12-1.7.16.jar:/home/jenkins/.m2/repository/org/glassfish/jersey/media/jersey-media-jaxb/2.22.2/jersey-media-jaxb-2.22.2.jar:/home/jenkins/.m2/repository/org/spark-project/spark/unused/1.0.0/unused-1.0.0.jar:/home/jenkins/.m2/repository/com/twitter/chill-java/0.9.3/chill-java-0.9.3.jar:/home/jenkins/.m2/repository/org/eclipse/jetty/jetty-plus/9.3.27.v20190418/jetty-plus-9.3.27.v20190418.jar:/home/jenkins/.m2/repository/io/dropwizard/metrics/metrics-jvm/3.1.5/metrics-jvm-3.1.5.jar:/home/jenkins/.m2/repository/org/apache/hadoop/hadoop-annotations/2.7.3/hadoop-annotations-2.7.3.jar:/home/jenkins/.m2/repository/com/github/luben/zstd-jni/1.3.2-2/zstd-jni-1.3.2-2.jar:/home/jenkins/.m2/repository/org/json4s/json4s-core_2.11/3.5.3/json4s-core_2.11-3.5.3.jar:/home/jenkins/.m2/repository/commons-collections/commons-collections/3.2.2/commons-collections-3.2.2.jar:/home/jenkins/.m2/repository/junit/junit/4.12/junit-4.12.jar:/home/jenkins/.m2/repository/com/carrotsearch/hppc/0.7.2/hppc-0.7.2.jar:/home/jenkins/.m2/repository/org/eclipse/jetty/jetty-servlets/9.3.27.v20190418/jetty-servlets-9.3.27.v20190418.jar:/home/jenkins/.m2/repository/org/glassfish/hk2/hk2-locator/2.4.0-b34/hk2-locator-2.4.0-b34.jar:/home/jenkins/.m2/repository/org/apache/parquet/parquet-jackson/1.10.1/parquet-jackson-1.10.1.jar:/home/jenkins/.m2/repository/org/apache/hadoop/hadoop-mapreduce-client-app/2.7.3/hadoop-mapreduce-client-app-2.7.3.jar:/home/jenkins/.m2/repository/org/apache/httpcomponents/httpclient/4.5.6/httpclient-4.5.6.jar:/home/jenkins/.m2/repository/net/razorvine/pyrolite/4.13/pyrolite-4.13.jar:/home/jenkins/.m2/repository/org/slf4j/jcl-over-slf4j/1.7.16/jcl-over-slf4j-1.7.16.jar:/home/jenkins/.m2/repository/commons-httpclient/commons-httpclient/3.1/commons-httpclient-3.1.jar
[INFO] 
[INFO] --- scala-maven-plugin:3.2.2:testCompile (scala-test-compile-first) @ spark-avro_2.11 ---
[INFO] Using zinc server for incremental compilation
[info] Compiling 5 Scala sources to /home/jenkins/workspace/spark-branch-2.4-test-maven-hadoop-2.7/external/avro/target/scala-2.11/test-classes...
[warn] /home/jenkins/workspace/spark-branch-2.4-test-maven-hadoop-2.7/external/avro/src/test/scala/org/apache/spark/sql/avro/AvroSuite.scala:141: constructor Field in class Field is deprecated: see corresponding Javadoc for more information.
[warn]         Seq(new Field("null", Schema.create(Type.NULL), "doc", null)).asJava
[warn]             ^
[warn] /home/jenkins/workspace/spark-branch-2.4-test-maven-hadoop-2.7/external/avro/src/test/scala/org/apache/spark/sql/avro/AvroSuite.scala:164: constructor Field in class Field is deprecated: see corresponding Javadoc for more information.
[warn]         val fields = Seq(new Field("field1", union, "doc", null)).asJava
[warn]                          ^
[warn] /home/jenkins/workspace/spark-branch-2.4-test-maven-hadoop-2.7/external/avro/src/test/scala/org/apache/spark/sql/avro/AvroSuite.scala:192: constructor Field in class Field is deprecated: see corresponding Javadoc for more information.
[warn]         val fields = Seq(new Field("field1", union, "doc", null)).asJava
[warn]                          ^
[warn] /home/jenkins/workspace/spark-branch-2.4-test-maven-hadoop-2.7/external/avro/src/test/scala/org/apache/spark/sql/avro/AvroSuite.scala:224: constructor Field in class Field is deprecated: see corresponding Javadoc for more information.
[warn]         val fields = Seq(new Field("field1", union, "doc", null)).asJava
[warn]                          ^
[warn] /home/jenkins/workspace/spark-branch-2.4-test-maven-hadoop-2.7/external/avro/src/test/scala/org/apache/spark/sql/avro/AvroSuite.scala:250: constructor Field in class Field is deprecated: see corresponding Javadoc for more information.
[warn]       val fields = Seq(new Field("field1", UnionOfOne, "doc", null)).asJava
[warn]                        ^
[warn] /home/jenkins/workspace/spark-branch-2.4-test-maven-hadoop-2.7/external/avro/src/test/scala/org/apache/spark/sql/avro/AvroSuite.scala:303: constructor Field in class Field is deprecated: see corresponding Javadoc for more information.
[warn]         new Field("field1", complexUnionType, "doc", null),
[warn]         ^
[warn] /home/jenkins/workspace/spark-branch-2.4-test-maven-hadoop-2.7/external/avro/src/test/scala/org/apache/spark/sql/avro/AvroSuite.scala:304: constructor Field in class Field is deprecated: see corresponding Javadoc for more information.
[warn]         new Field("field2", complexUnionType, "doc", null),
[warn]         ^
[warn] /home/jenkins/workspace/spark-branch-2.4-test-maven-hadoop-2.7/external/avro/src/test/scala/org/apache/spark/sql/avro/AvroSuite.scala:305: constructor Field in class Field is deprecated: see corresponding Javadoc for more information.
[warn]         new Field("field3", complexUnionType, "doc", null),
[warn]         ^
[warn] /home/jenkins/workspace/spark-branch-2.4-test-maven-hadoop-2.7/external/avro/src/test/scala/org/apache/spark/sql/avro/AvroSuite.scala:306: constructor Field in class Field is deprecated: see corresponding Javadoc for more information.
[warn]         new Field("field4", complexUnionType, "doc", null)
[warn]         ^
[warn] /home/jenkins/workspace/spark-branch-2.4-test-maven-hadoop-2.7/external/avro/src/test/scala/org/apache/spark/sql/avro/AvroSuite.scala:970: constructor Field in class Field is deprecated: see corresponding Javadoc for more information.
[warn]       val avroField = new Field(name, avroType, "", null)
[warn]                       ^
[warn] 10 warnings found
[info] Compile success at Sep 23, 2020 12:13:27 PM [17.423s]
[INFO] 
[INFO] --- maven-surefire-plugin:2.22.0:test (default-test) @ spark-avro_2.11 ---
[INFO] 
[INFO] -------------------------------------------------------
[INFO]  T E S T S
[INFO] -------------------------------------------------------
[INFO] 
[INFO] Results:
[INFO] 
[INFO] Tests run: 0, Failures: 0, Errors: 0, Skipped: 0
[INFO] 
[INFO] 
[INFO] --- maven-surefire-plugin:2.22.0:test (test) @ spark-avro_2.11 ---
[INFO] Skipping execution of surefire because it has already been run for this configuration
[INFO] 
[INFO] --- scalatest-maven-plugin:1.0:test (test) @ spark-avro_2.11 ---
Discovery starting.
Discovery completed in 366 milliseconds.
Run starting. Expected test count is: 98
AvroCatalystDataConversionSuite:
- single BooleanType with seed 6605941837134034287
- single ByteType with seed 447248485808681224
- single ShortType with seed -3704957398588535071
- single IntegerType with seed 3797802039581007532
- single LongType with seed -1564973087323225948
- single FloatType with seed 8649909582803788593
- single DoubleType with seed 8730950702075207203
- single DecimalType(8,0) with seed 7707896941845622453
- single DecimalType(8,4) with seed 2544186361387121913
- single DecimalType(16,0) with seed -1578430233752692126
- single DecimalType(16,11) with seed -1322894109654670721
- single DecimalType(38,0) with seed 2416184915447030311
- single DecimalType(38,38) with seed 1545253818422392485
- single StringType with seed 1759932135775962537
- single BinaryType with seed 790811570889101317
- flat schema struct<col_0:double,col_1:string,col_2:decimal(38,0),col_3:decimal(8,0),col_4:decimal(38,38)> with seed 2212377850050249852
- flat schema struct<col_0:decimal(38,0),col_1:bigint,col_2:bigint,col_3:decimal(16,0),col_4:int> with seed 8262879001966488885
- flat schema struct<col_0:float,col_1:bigint,col_2:decimal(8,0),col_3:float,col_4:decimal(16,11)> with seed 8400167456622782861
- flat schema struct<col_0:double,col_1:double,col_2:decimal(16,11),col_3:decimal(38,0),col_4:int> with seed -2214414244298707108
- flat schema struct<col_0:decimal(8,4),col_1:decimal(16,11),col_2:decimal(16,11),col_3:bigint,col_4:decimal(8,0)> with seed 973968690518284771
- nested schema struct<col_0:struct<col_0:double,col_1:struct<col_0:array<bigint>>>,col_1:array<binary>,col_2:binary,col_3:array<int>,col_4:decimal(16,11),col_5:struct<col_0:array<string>,col_1:struct<col_0:array<double>>>,col_6:struct<col_0:array<int>>,col_7:array<decimal(8,0)>> with seed -1531833941895468537
- nested schema struct<col_0:struct<col_0:float,col_1:array<decimal(8,0)>,col_2:decimal(16,0),col_3:decimal(38,38),col_4:string,col_5:decimal(38,0),col_6:array<decimal(8,4)>,col_7:bigint>,col_1:bigint,col_2:decimal(16,0)> with seed 6772360572045335174
- nested schema struct<col_0:tinyint,col_1:string,col_2:array<int>,col_3:struct<col_0:decimal(8,0),col_1:struct<col_0:string>,col_2:struct<col_0:double>,col_3:tinyint>,col_4:struct<col_0:array<int>>,col_5:decimal(8,0),col_6:boolean> with seed 9110248843572091965
- nested schema struct<col_0:float,col_1:string,col_2:struct<col_0:tinyint,col_1:decimal(16,0),col_2:array<int>>,col_3:bigint,col_4:decimal(16,11),col_5:array<bigint>,col_6:struct<col_0:decimal(8,0)>,col_7:array<tinyint>> with seed 2602363097799279038
- nested schema struct<col_0:array<decimal(8,0)>,col_1:boolean,col_2:array<decimal(38,0)>,col_3:struct<col_0:struct<col_0:array<bigint>>>,col_4:struct<col_0:decimal(16,11)>,col_5:struct<col_0:decimal(38,38)>,col_6:bigint,col_7:decimal(16,0),col_8:smallint,col_9:array<double>> with seed -694994349268687152
- read int as string
- read string as int
- read float as double
- read double as float
AvroFunctionsSuite:
- roundtrip in to_avro and from_avro - int and string
- roundtrip in to_avro and from_avro - struct
- roundtrip in to_avro and from_avro - array with null
- SPARK-27798: from_avro produces same value when converted to local relation
AvroLogicalTypeSuite:
- Logical type: date
- Logical type: timestamp_millis
- Logical type: timestamp_micros
- Logical type: user specified output schema with different timestamp types
- Read Long type as Timestamp
- Logical type: user specified read schema
- Logical type: Decimal
- Logical type: write Decimal with BYTES type
- Logical type: Decimal with too large precision
AvroSuite:
- resolve avro data source
- reading from multiple paths
- reading and writing partitioned data
- request no fields
- convert formats
- rearrange internal schema
- test NULL avro type
- union(int, long) is read as long
- union(float, double) is read as double
- union(float, double, null) is read as nullable double
- Union of a single type
- SPARK-27858 Union type: More than one non-null type
- Complex Union Type
- Lots of nulls
- Struct field type
- Ignore corrupt Avro file if flag IGNORE_CORRUPT_FILES enabled
- Throws IOException on reading corrupt Avro file if flag IGNORE_CORRUPT_FILES disabled
- Date field type
- Array data types
- write with compression - sql configs
- dsl test
- old avro data source name works
- support of various data types
- sql test
- conversion to avro and back
- conversion to avro and back with namespace
- converting some specific sparkSQL types to avro
- correctly read long as date/timestamp type
- support of globbed paths
- does not coerce null date/timestamp value to 0 epoch.
- support user provided avro schema
- support user provided avro schema with defaults for missing fields
- support user provided avro schema for writing nullable enum type
- support user provided avro schema for writing non-nullable enum type
- support user provided avro schema for writing nullable fixed type
- support user provided avro schema for writing non-nullable fixed type
- throw exception if unable to write with user provided Avro schema
- reading from invalid path throws exception
- SQL test insert overwrite
- test save and load
- test load with non-Avro file
- read avro with user defined schema: read partial columns
- read avro with user defined schema: read non-exist columns
- read avro file partitioned
- Validate namespace in avro file that has nested records with the same name
- saving avro that has nested records with the same name
- check namespace - toAvroType
- check empty namespace - toAvroType
- saving avro that has nested records with the same name inside an array
- saving avro that has nested records with the same name inside a map
- SPARK-24805: do not ignore files without .avro extension by default
- SPARK-24836: checking the ignoreExtension option
- SPARK-24836: ignoreExtension must override hadoop's config
- SPARK-24881: write with compression - avro options
- Detect recursive loop
- SPARK-31327: Write Spark version into Avro file metadata
Run completed in 26 seconds, 367 milliseconds.
Total number of tests run: 98
Suites: completed 5, aborted 0
Tests: succeeded 98, failed 0, canceled 0, ignored 0, pending 0
All tests passed.
[INFO] 
[INFO] -----< org.apache.spark:spark-streaming-kinesis-asl-assembly_2.11 >-----
[INFO] Building Spark Project Kinesis Assembly 2.4.8-SNAPSHOT           [29/30]
[INFO] --------------------------------[ jar ]---------------------------------
[INFO] 
[INFO] --- maven-enforcer-plugin:3.0.0-M1:enforce (enforce-versions) @ spark-streaming-kinesis-asl-assembly_2.11 ---
[INFO] 
[INFO] --- maven-enforcer-plugin:3.0.0-M1:enforce (enforce-no-duplicate-dependencies) @ spark-streaming-kinesis-asl-assembly_2.11 ---
[INFO] 
[INFO] --- scala-maven-plugin:3.2.2:add-source (eclipse-add-source) @ spark-streaming-kinesis-asl-assembly_2.11 ---
[INFO] Add Source directory: /home/jenkins/workspace/spark-branch-2.4-test-maven-hadoop-2.7/external/kinesis-asl-assembly/src/main/scala
[INFO] Add Test Source directory: /home/jenkins/workspace/spark-branch-2.4-test-maven-hadoop-2.7/external/kinesis-asl-assembly/src/test/scala
[INFO] 
[INFO] --- maven-dependency-plugin:3.0.2:build-classpath (default-cli) @ spark-streaming-kinesis-asl-assembly_2.11 ---
[INFO] Dependencies classpath:
/home/jenkins/.m2/repository/joda-time/joda-time/2.9.3/joda-time-2.9.3.jar:/home/jenkins/.m2/repository/org/apache/hadoop/hadoop-yarn-common/2.7.3/hadoop-yarn-common-2.7.3.jar:/home/jenkins/.m2/repository/com/amazonaws/aws-java-sdk-kms/1.11.655/aws-java-sdk-kms-1.11.655.jar:/home/jenkins/.m2/repository/org/apache/hadoop/hadoop-yarn-api/2.7.3/hadoop-yarn-api-2.7.3.jar:/home/jenkins/.m2/repository/org/apache/httpcomponents/httpcore/4.4.10/httpcore-4.4.10.jar:/home/jenkins/.m2/repository/com/fasterxml/jackson/dataformat/jackson-dataformat-cbor/2.6.7/jackson-dataformat-cbor-2.6.7.jar:/home/jenkins/.m2/repository/org/scala-lang/scala-library/2.11.12/scala-library-2.11.12.jar:/home/jenkins/.m2/repository/javax/xml/bind/jaxb-api/2.2.2/jaxb-api-2.2.2.jar:/home/jenkins/.m2/repository/com/thoughtworks/paranamer/paranamer/2.8/paranamer-2.8.jar:/home/jenkins/.m2/repository/com/amazonaws/aws-java-sdk-kinesis/1.11.655/aws-java-sdk-kinesis-1.11.655.jar:/home/jenkins/.m2/repository/org/apache/commons/commons-compress/1.4.1/commons-compress-1.4.1.jar:/home/jenkins/.m2/repository/com/amazonaws/aws-java-sdk-s3/1.11.655/aws-java-sdk-s3-1.11.655.jar:/home/jenkins/.m2/repository/org/apache/hadoop/hadoop-yarn-client/2.7.3/hadoop-yarn-client-2.7.3.jar:/home/jenkins/.m2/repository/com/amazonaws/aws-java-sdk-dynamodb/1.11.655/aws-java-sdk-dynamodb-1.11.655.jar:/home/jenkins/workspace/spark-branch-2.4-test-maven-hadoop-2.7/common/tags/target/scala-2.11/classes:/home/jenkins/.m2/repository/javax/activation/activation/1.1.1/activation-1.1.1.jar:/home/jenkins/.m2/repository/commons-cli/commons-cli/1.2/commons-cli-1.2.jar:/home/jenkins/.m2/repository/commons-codec/commons-codec/1.10/commons-codec-1.10.jar:/home/jenkins/workspace/spark-branch-2.4-test-maven-hadoop-2.7/external/kinesis-asl/target/scala-2.11/classes:/home/jenkins/.m2/repository/com/amazonaws/aws-java-sdk-core/1.11.655/aws-java-sdk-core-1.11.655.jar:/home/jenkins/.m2/repository/org/tukaani/xz/1.5/xz-1.5.jar:/home/jenkins/.m2/repository/com/google/protobuf/protobuf-java/2.6.1/protobuf-java-2.6.1.jar:/home/jenkins/.m2/repository/org/mortbay/jetty/jetty-util/6.1.26/jetty-util-6.1.26.jar:/home/jenkins/.m2/repository/org/spark-project/spark/unused/1.0.0/unused-1.0.0.jar:/home/jenkins/.m2/repository/com/amazonaws/aws-java-sdk-sts/1.11.655/aws-java-sdk-sts-1.11.655.jar:/home/jenkins/.m2/repository/com/amazonaws/aws-java-sdk-cloudwatch/1.11.655/aws-java-sdk-cloudwatch-1.11.655.jar:/home/jenkins/.m2/repository/commons-io/commons-io/2.4/commons-io-2.4.jar:/home/jenkins/.m2/repository/com/fasterxml/jackson/core/jackson-core/2.6.7/jackson-core-2.6.7.jar:/home/jenkins/.m2/repository/org/codehaus/jackson/jackson-mapper-asl/1.9.13/jackson-mapper-asl-1.9.13.jar:/home/jenkins/.m2/repository/org/apache/commons/commons-lang3/3.5/commons-lang3-3.5.jar:/home/jenkins/.m2/repository/org/codehaus/jackson/jackson-jaxrs/1.9.13/jackson-jaxrs-1.9.13.jar:/home/jenkins/.m2/repository/javax/xml/stream/stax-api/1.0-2/stax-api-1.0-2.jar:/home/jenkins/.m2/repository/com/amazonaws/amazon-kinesis-client/1.12.0/amazon-kinesis-client-1.12.0.jar:/home/jenkins/.m2/repository/org/codehaus/jackson/jackson-xc/1.9.13/jackson-xc-1.9.13.jar:/home/jenkins/.m2/repository/commons-logging/commons-logging/1.1.3/commons-logging-1.1.3.jar:/home/jenkins/.m2/repository/org/apache/httpcomponents/httpclient/4.5.6/httpclient-4.5.6.jar:/home/jenkins/.m2/repository/com/amazonaws/jmespath-java/1.11.655/jmespath-java-1.11.655.jar:/home/jenkins/.m2/repository/org/codehaus/jackson/jackson-core-asl/1.9.13/jackson-core-asl-1.9.13.jar:/home/jenkins/.m2/repository/software/amazon/ion/ion-java/1.0.2/ion-java-1.0.2.jar
[INFO] 
[INFO] --- maven-remote-resources-plugin:1.5:process (process-resource-bundles) @ spark-streaming-kinesis-asl-assembly_2.11 ---
[INFO] 
[INFO] --- maven-resources-plugin:2.7:resources (default-resources) @ spark-streaming-kinesis-asl-assembly_2.11 ---
[INFO] Using 'UTF-8' encoding to copy filtered resources.
[INFO] skip non existing resourceDirectory /home/jenkins/workspace/spark-branch-2.4-test-maven-hadoop-2.7/external/kinesis-asl-assembly/src/main/resources
[INFO] Copying 3 resources
[INFO] 
[INFO] --- maven-compiler-plugin:3.7.0:compile (default-compile) @ spark-streaming-kinesis-asl-assembly_2.11 ---
[INFO] Not compiling main sources
[INFO] 
[INFO] --- scala-maven-plugin:3.2.2:compile (scala-compile-first) @ spark-streaming-kinesis-asl-assembly_2.11 ---
[INFO] No sources to compile
[INFO] 
[INFO] --- maven-antrun-plugin:1.8:run (create-tmp-dir) @ spark-streaming-kinesis-asl-assembly_2.11 ---
[INFO] Executing tasks

main:
[INFO] Executed tasks
[INFO] 
[INFO] --- maven-resources-plugin:2.7:testResources (default-testResources) @ spark-streaming-kinesis-asl-assembly_2.11 ---
[INFO] Using 'UTF-8' encoding to copy filtered resources.
[INFO] skip non existing resourceDirectory /home/jenkins/workspace/spark-branch-2.4-test-maven-hadoop-2.7/external/kinesis-asl-assembly/src/test/resources
[INFO] Copying 3 resources
[INFO] 
[INFO] --- maven-compiler-plugin:3.7.0:testCompile (default-testCompile) @ spark-streaming-kinesis-asl-assembly_2.11 ---
[INFO] Not compiling test sources
[INFO] 
[INFO] --- maven-dependency-plugin:3.0.2:build-classpath (generate-test-classpath) @ spark-streaming-kinesis-asl-assembly_2.11 ---
[INFO] Dependencies classpath:
/home/jenkins/.m2/repository/org/eclipse/jetty/jetty-security/9.3.27.v20190418/jetty-security-9.3.27.v20190418.jar:/home/jenkins/.m2/repository/com/fasterxml/jackson/module/jackson-module-scala_2.11/2.6.7.1/jackson-module-scala_2.11-2.6.7.1.jar:/home/jenkins/.m2/repository/org/apache/htrace/htrace-core/3.1.0-incubating/htrace-core-3.1.0-incubating.jar:/home/jenkins/.m2/repository/org/lz4/lz4-java/1.4.0/lz4-java-1.4.0.jar:/home/jenkins/.m2/repository/org/scalactic/scalactic_2.11/3.0.3/scalactic_2.11-3.0.3.jar:/home/jenkins/.m2/repository/com/fasterxml/jackson/module/jackson-module-paranamer/2.7.9/jackson-module-paranamer-2.7.9.jar:/home/jenkins/.m2/repository/org/json4s/json4s-ast_2.11/3.5.3/json4s-ast_2.11-3.5.3.jar:/home/jenkins/.m2/repository/io/netty/netty-all/4.1.47.Final/netty-all-4.1.47.Final.jar:/home/jenkins/.m2/repository/com/thoughtworks/paranamer/paranamer/2.8/paranamer-2.8.jar:/home/jenkins/.m2/repository/xml-apis/xml-apis/1.4.01/xml-apis-1.4.01.jar:/home/jenkins/.m2/repository/org/fusesource/leveldbjni/leveldbjni-all/1.8/leveldbjni-all-1.8.jar:/home/jenkins/.m2/repository/com/amazonaws/aws-java-sdk-core/1.11.655/aws-java-sdk-core-1.11.655.jar:/home/jenkins/workspace/spark-branch-2.4-test-maven-hadoop-2.7/common/kvstore/target/scala-2.11/classes:/home/jenkins/.m2/repository/org/glassfish/jersey/bundles/repackaged/jersey-guava/2.22.2/jersey-guava-2.22.2.jar:/home/jenkins/.m2/repository/org/tukaani/xz/1.5/xz-1.5.jar:/home/jenkins/.m2/repository/com/google/protobuf/protobuf-java/2.6.1/protobuf-java-2.6.1.jar:/home/jenkins/.m2/repository/org/apache/commons/commons-crypto/1.0.0/commons-crypto-1.0.0.jar:/home/jenkins/.m2/repository/com/amazonaws/aws-java-sdk-sts/1.11.655/aws-java-sdk-sts-1.11.655.jar:/home/jenkins/.m2/repository/com/amazonaws/aws-java-sdk-cloudwatch/1.11.655/aws-java-sdk-cloudwatch-1.11.655.jar:/home/jenkins/.m2/repository/commons-io/commons-io/2.4/commons-io-2.4.jar:/home/jenkins/.m2/repository/org/scala-lang/scala-reflect/2.11.12/scala-reflect-2.11.12.jar:/home/jenkins/.m2/repository/org/eclipse/jetty/jetty-servlet/9.3.27.v20190418/jetty-servlet-9.3.27.v20190418.jar:/home/jenkins/.m2/repository/org/apache/commons/commons-lang3/3.5/commons-lang3-3.5.jar:/home/jenkins/.m2/repository/org/codehaus/jackson/jackson-jaxrs/1.9.13/jackson-jaxrs-1.9.13.jar:/home/jenkins/.m2/repository/org/apache/hadoop/hadoop-auth/2.7.3/hadoop-auth-2.7.3.jar:/home/jenkins/.m2/repository/com/esotericsoftware/kryo-shaded/4.0.2/kryo-shaded-4.0.2.jar:/home/jenkins/.m2/repository/com/esotericsoftware/minlog/1.3.0/minlog-1.3.0.jar:/home/jenkins/.m2/repository/org/apache/hadoop/hadoop-client/2.7.3/hadoop-client-2.7.3.jar:/home/jenkins/.m2/repository/org/apache/hadoop/hadoop-mapreduce-client-shuffle/2.7.3/hadoop-mapreduce-client-shuffle-2.7.3.jar:/home/jenkins/.m2/repository/org/codehaus/jackson/jackson-core-asl/1.9.13/jackson-core-asl-1.9.13.jar:/home/jenkins/.m2/repository/javax/validation/validation-api/1.1.0.Final/validation-api-1.1.0.Final.jar:/home/jenkins/workspace/spark-branch-2.4-test-maven-hadoop-2.7/core/target/scala-2.11/classes:/home/jenkins/.m2/repository/org/glassfish/jersey/core/jersey-common/2.22.2/jersey-common-2.22.2.jar:/home/jenkins/.m2/repository/org/objenesis/objenesis/2.5.1/objenesis-2.5.1.jar:/home/jenkins/.m2/repository/org/apache/hadoop/hadoop-mapreduce-client-core/2.7.3/hadoop-mapreduce-client-core-2.7.3.jar:/home/jenkins/.m2/repository/joda-time/joda-time/2.9.3/joda-time-2.9.3.jar:/home/jenkins/.m2/repository/org/scala-lang/modules/scala-xml_2.11/1.0.5/scala-xml_2.11-1.0.5.jar:/home/jenkins/.m2/repository/com/amazonaws/aws-java-sdk-kms/1.11.655/aws-java-sdk-kms-1.11.655.jar:/home/jenkins/.m2/repository/com/google/code/findbugs/jsr305/1.3.9/jsr305-1.3.9.jar:/home/jenkins/.m2/repository/commons-net/commons-net/3.1/commons-net-3.1.jar:/home/jenkins/.m2/repository/javax/xml/bind/jaxb-api/2.2.2/jaxb-api-2.2.2.jar:/home/jenkins/.m2/repository/org/glassfish/hk2/hk2-api/2.4.0-b34/hk2-api-2.4.0-b34.jar:/home/jenkins/.m2/repository/org/xerial/snappy/snappy-java/1.1.7.5/snappy-java-1.1.7.5.jar:/home/jenkins/.m2/repository/org/glassfish/jersey/core/jersey-server/2.22.2/jersey-server-2.22.2.jar:/home/jenkins/.m2/repository/com/twitter/chill_2.11/0.9.3/chill_2.11-0.9.3.jar:/home/jenkins/.m2/repository/commons-lang/commons-lang/2.6/commons-lang-2.6.jar:/home/jenkins/.m2/repository/com/amazonaws/aws-java-sdk-s3/1.11.655/aws-java-sdk-s3-1.11.655.jar:/home/jenkins/.m2/repository/org/apache/hadoop/hadoop-yarn-client/2.7.3/hadoop-yarn-client-2.7.3.jar:/home/jenkins/.m2/repository/com/amazonaws/aws-java-sdk-dynamodb/1.11.655/aws-java-sdk-dynamodb-1.11.655.jar:/home/jenkins/.m2/repository/org/apache/zookeeper/zookeeper/3.4.6/zookeeper-3.4.6.jar:/home/jenkins/.m2/repository/javax/activation/activation/1.1.1/activation-1.1.1.jar:/home/jenkins/.m2/repository/commons-codec/commons-codec/1.10/commons-codec-1.10.jar:/home/jenkins/workspace/spark-branch-2.4-test-maven-hadoop-2.7/external/kinesis-asl/target/scala-2.11/classes:/home/jenkins/.m2/repository/org/eclipse/jetty/jetty-webapp/9.3.27.v20190418/jetty-webapp-9.3.27.v20190418.jar:/home/jenkins/.m2/repository/org/json4s/json4s-jackson_2.11/3.5.3/json4s-jackson_2.11-3.5.3.jar:/home/jenkins/.m2/repository/org/javassist/javassist/3.18.1-GA/javassist-3.18.1-GA.jar:/home/jenkins/.m2/repository/com/google/guava/guava/14.0.1/guava-14.0.1.jar:/home/jenkins/.m2/repository/org/apache/xbean/xbean-asm6-shaded/4.8/xbean-asm6-shaded-4.8.jar:/home/jenkins/.m2/repository/commons-beanutils/commons-beanutils/1.9.4/commons-beanutils-1.9.4.jar:/home/jenkins/.m2/repository/org/apache/ivy/ivy/2.4.0/ivy-2.4.0.jar:/home/jenkins/.m2/repository/org/eclipse/jetty/jetty-util/9.3.27.v20190418/jetty-util-9.3.27.v20190418.jar:/home/jenkins/.m2/repository/org/eclipse/jetty/jetty-client/9.3.27.v20190418/jetty-client-9.3.27.v20190418.jar:/home/jenkins/.m2/repository/javax/servlet/javax.servlet-api/3.1.0/javax.servlet-api-3.1.0.jar:/home/jenkins/.m2/repository/org/glassfish/hk2/osgi-resource-locator/1.0.1/osgi-resource-locator-1.0.1.jar:/home/jenkins/.m2/repository/com/fasterxml/jackson/core/jackson-core/2.6.7/jackson-core-2.6.7.jar:/home/jenkins/.m2/repository/org/apache/commons/commons-math3/3.4.1/commons-math3-3.4.1.jar:/home/jenkins/.m2/repository/org/apache/hadoop/hadoop-mapreduce-client-common/2.7.3/hadoop-mapreduce-client-common-2.7.3.jar:/home/jenkins/.m2/repository/org/scala-lang/modules/scala-parser-combinators_2.11/1.1.0/scala-parser-combinators_2.11-1.1.0.jar:/home/jenkins/.m2/repository/io/dropwizard/metrics/metrics-graphite/3.1.5/metrics-graphite-3.1.5.jar:/home/jenkins/.m2/repository/javax/xml/stream/stax-api/1.0-2/stax-api-1.0-2.jar:/home/jenkins/.m2/repository/org/apache/hadoop/hadoop-mapreduce-client-jobclient/2.7.3/hadoop-mapreduce-client-jobclient-2.7.3.jar:/home/jenkins/.m2/repository/com/amazonaws/amazon-kinesis-client/1.12.0/amazon-kinesis-client-1.12.0.jar:/home/jenkins/.m2/repository/org/codehaus/jackson/jackson-xc/1.9.13/jackson-xc-1.9.13.jar:/home/jenkins/.m2/repository/org/eclipse/jetty/jetty-server/9.3.27.v20190418/jetty-server-9.3.27.v20190418.jar:/home/jenkins/.m2/repository/org/glassfish/hk2/hk2-utils/2.4.0-b34/hk2-utils-2.4.0-b34.jar:/home/jenkins/.m2/repository/org/glassfish/hk2/external/aopalliance-repackaged/2.4.0-b34/aopalliance-repackaged-2.4.0-b34.jar:/home/jenkins/.m2/repository/net/sf/py4j/py4j/0.10.7/py4j-0.10.7.jar:/home/jenkins/.m2/repository/org/json4s/json4s-scalap_2.11/3.5.3/json4s-scalap_2.11-3.5.3.jar:/home/jenkins/.m2/repository/org/glassfish/jersey/containers/jersey-container-servlet-core/2.22.2/jersey-container-servlet-core-2.22.2.jar:/home/jenkins/.m2/repository/org/glassfish/hk2/external/javax.inject/2.4.0-b34/javax.inject-2.4.0-b34.jar:/home/jenkins/.m2/repository/oro/oro/2.0.8/oro-2.0.8.jar:/home/jenkins/.m2/repository/org/apache/avro/avro-mapred/1.8.2/avro-mapred-1.8.2-hadoop2.jar:/home/jenkins/.m2/repository/org/eclipse/jetty/jetty-continuation/9.3.27.v20190418/jetty-continuation-9.3.27.v20190418.jar:/home/jenkins/workspace/spark-branch-2.4-test-maven-hadoop-2.7/common/network-common/target/scala-2.11/classes:/home/jenkins/.m2/repository/org/eclipse/jetty/jetty-http/9.3.27.v20190418/jetty-http-9.3.27.v20190418.jar:/home/jenkins/.m2/repository/org/apache/hadoop/hadoop-yarn-common/2.7.3/hadoop-yarn-common-2.7.3.jar:/home/jenkins/.m2/repository/org/scalatest/scalatest_2.11/3.0.3/scalatest_2.11-3.0.3.jar:/home/jenkins/workspace/spark-branch-2.4-test-maven-hadoop-2.7/common/unsafe/target/scala-2.11/classes:/home/jenkins/.m2/repository/org/apache/hadoop/hadoop-yarn-api/2.7.3/hadoop-yarn-api-2.7.3.jar:/home/jenkins/.m2/repository/log4j/log4j/1.2.17/log4j-1.2.17.jar:/home/jenkins/.m2/repository/com/novocode/junit-interface/0.11/junit-interface-0.11.jar:/home/jenkins/.m2/repository/org/apache/hadoop/hadoop-yarn-server-common/2.7.3/hadoop-yarn-server-common-2.7.3.jar:/home/jenkins/.m2/repository/org/apache/httpcomponents/httpcore/4.4.10/httpcore-4.4.10.jar:/home/jenkins/workspace/spark-branch-2.4-test-maven-hadoop-2.7/streaming/target/scala-2.11/classes:/home/jenkins/.m2/repository/org/apache/curator/curator-framework/2.7.1/curator-framework-2.7.1.jar:/home/jenkins/.m2/repository/org/apache/curator/curator-recipes/2.7.1/curator-recipes-2.7.1.jar:/home/jenkins/.m2/repository/org/eclipse/jetty/jetty-xml/9.3.27.v20190418/jetty-xml-9.3.27.v20190418.jar:/home/jenkins/.m2/repository/io/dropwizard/metrics/metrics-json/3.1.5/metrics-json-3.1.5.jar:/home/jenkins/.m2/repository/com/amazonaws/aws-java-sdk-kinesis/1.11.655/aws-java-sdk-kinesis-1.11.655.jar:/home/jenkins/.m2/repository/org/apache/commons/commons-compress/1.4.1/commons-compress-1.4.1.jar:/home/jenkins/.m2/repository/org/apache/avro/avro/1.8.2/avro-1.8.2.jar:/home/jenkins/.m2/repository/org/apache/directory/server/apacheds-kerberos-codec/2.0.0-M15/apacheds-kerberos-codec-2.0.0-M15.jar:/home/jenkins/.m2/repository/io/dropwizard/metrics/metrics-core/3.1.5/metrics-core-3.1.5.jar:/home/jenkins/workspace/spark-branch-2.4-test-maven-hadoop-2.7/common/tags/target/scala-2.11/classes:/home/jenkins/.m2/repository/org/slf4j/slf4j-api/1.7.16/slf4j-api-1.7.16.jar:/home/jenkins/.m2/repository/org/eclipse/jetty/jetty-io/9.3.27.v20190418/jetty-io-9.3.27.v20190418.jar:/home/jenkins/workspace/spark-branch-2.4-test-maven-hadoop-2.7/launcher/target/scala-2.11/classes:/home/jenkins/.m2/repository/org/mortbay/jetty/jetty-util/6.1.26/jetty-util-6.1.26.jar:/home/jenkins/.m2/repository/org/scala-sbt/test-interface/1.0/test-interface-1.0.jar:/home/jenkins/.m2/repository/org/hamcrest/hamcrest-core/1.3/hamcrest-core-1.3.jar:/home/jenkins/.m2/repository/org/codehaus/jackson/jackson-mapper-asl/1.9.13/jackson-mapper-asl-1.9.13.jar:/home/jenkins/workspace/spark-branch-2.4-test-maven-hadoop-2.7/common/network-shuffle/target/scala-2.11/classes:/home/jenkins/.m2/repository/javax/ws/rs/javax.ws.rs-api/2.0.1/javax.ws.rs-api-2.0.1.jar:/home/jenkins/.m2/repository/javax/servlet/jsp/jsp-api/2.1/jsp-api-2.1.jar:/home/jenkins/.m2/repository/org/glassfish/jersey/core/jersey-client/2.22.2/jersey-client-2.22.2.jar:/home/jenkins/.m2/repository/io/netty/netty/3.9.9.Final/netty-3.9.9.Final.jar:/home/jenkins/.m2/repository/org/roaringbitmap/shims/0.7.45/shims-0.7.45.jar:/home/jenkins/.m2/repository/com/ning/compress-lzf/1.0.3/compress-lzf-1.0.3.jar:/home/jenkins/.m2/repository/xmlenc/xmlenc/0.52/xmlenc-0.52.jar:/home/jenkins/.m2/repository/org/apache/avro/avro-ipc/1.8.2/avro-ipc-1.8.2.jar:/home/jenkins/.m2/repository/org/apache/hadoop/hadoop-hdfs/2.7.3/hadoop-hdfs-2.7.3.jar:/home/jenkins/.m2/repository/org/apache/directory/api/api-util/1.0.0-M20/api-util-1.0.0-M20.jar:/home/jenkins/.m2/repository/com/google/code/gson/gson/2.2.4/gson-2.2.4.jar:/home/jenkins/.m2/repository/com/clearspring/analytics/stream/2.7.0/stream-2.7.0.jar:/home/jenkins/.m2/repository/org/apache/directory/api/api-asn1-api/1.0.0-M20/api-asn1-api-1.0.0-M20.jar:/home/jenkins/.m2/repository/com/fasterxml/jackson/core/jackson-annotations/2.6.7/jackson-annotations-2.6.7.jar:/home/jenkins/.m2/repository/org/apache/hadoop/hadoop-common/2.7.3/hadoop-common-2.7.3.jar:/home/jenkins/.m2/repository/org/glassfish/jersey/containers/jersey-container-servlet/2.22.2/jersey-container-servlet-2.22.2.jar:/home/jenkins/.m2/repository/commons-configuration/commons-configuration/1.6/commons-configuration-1.6.jar:/home/jenkins/.m2/repository/org/slf4j/jul-to-slf4j/1.7.16/jul-to-slf4j-1.7.16.jar:/home/jenkins/.m2/repository/commons-digester/commons-digester/1.8/commons-digester-1.8.jar:/home/jenkins/.m2/repository/com/fasterxml/jackson/dataformat/jackson-dataformat-cbor/2.6.7/jackson-dataformat-cbor-2.6.7.jar:/home/jenkins/.m2/repository/org/scala-lang/scala-library/2.11.12/scala-library-2.11.12.jar:/home/jenkins/.m2/repository/org/apache/directory/server/apacheds-i18n/2.0.0-M15/apacheds-i18n-2.0.0-M15.jar:/home/jenkins/.m2/repository/org/eclipse/jetty/jetty-proxy/9.3.27.v20190418/jetty-proxy-9.3.27.v20190418.jar:/home/jenkins/.m2/repository/org/apache/curator/curator-client/2.7.1/curator-client-2.7.1.jar:/home/jenkins/.m2/repository/org/roaringbitmap/RoaringBitmap/0.7.45/RoaringBitmap-0.7.45.jar:/home/jenkins/.m2/repository/com/fasterxml/jackson/core/jackson-databind/2.6.7.3/jackson-databind-2.6.7.3.jar:/home/jenkins/.m2/repository/org/eclipse/jetty/jetty-jndi/9.3.27.v20190418/jetty-jndi-9.3.27.v20190418.jar:/home/jenkins/.m2/repository/commons-cli/commons-cli/1.2/commons-cli-1.2.jar:/home/jenkins/.m2/repository/xerces/xercesImpl/2.9.1/xercesImpl-2.9.1.jar:/home/jenkins/.m2/repository/javax/annotation/javax.annotation-api/1.2/javax.annotation-api-1.2.jar:/home/jenkins/.m2/repository/org/slf4j/slf4j-log4j12/1.7.16/slf4j-log4j12-1.7.16.jar:/home/jenkins/.m2/repository/org/glassfish/jersey/media/jersey-media-jaxb/2.22.2/jersey-media-jaxb-2.22.2.jar:/home/jenkins/.m2/repository/org/spark-project/spark/unused/1.0.0/unused-1.0.0.jar:/home/jenkins/.m2/repository/com/twitter/chill-java/0.9.3/chill-java-0.9.3.jar:/home/jenkins/.m2/repository/org/eclipse/jetty/jetty-plus/9.3.27.v20190418/jetty-plus-9.3.27.v20190418.jar:/home/jenkins/.m2/repository/io/dropwizard/metrics/metrics-jvm/3.1.5/metrics-jvm-3.1.5.jar:/home/jenkins/.m2/repository/com/github/luben/zstd-jni/1.3.2-2/zstd-jni-1.3.2-2.jar:/home/jenkins/.m2/repository/org/apache/hadoop/hadoop-annotations/2.7.3/hadoop-annotations-2.7.3.jar:/home/jenkins/.m2/repository/org/json4s/json4s-core_2.11/3.5.3/json4s-core_2.11-3.5.3.jar:/home/jenkins/.m2/repository/commons-collections/commons-collections/3.2.2/commons-collections-3.2.2.jar:/home/jenkins/.m2/repository/junit/junit/4.12/junit-4.12.jar:/home/jenkins/.m2/repository/org/eclipse/jetty/jetty-servlets/9.3.27.v20190418/jetty-servlets-9.3.27.v20190418.jar:/home/jenkins/.m2/repository/org/glassfish/hk2/hk2-locator/2.4.0-b34/hk2-locator-2.4.0-b34.jar:/home/jenkins/.m2/repository/org/apache/hadoop/hadoop-mapreduce-client-app/2.7.3/hadoop-mapreduce-client-app-2.7.3.jar:/home/jenkins/.m2/repository/commons-logging/commons-logging/1.1.3/commons-logging-1.1.3.jar:/home/jenkins/.m2/repository/org/apache/httpcomponents/httpclient/4.5.6/httpclient-4.5.6.jar:/home/jenkins/.m2/repository/net/razorvine/pyrolite/4.13/pyrolite-4.13.jar:/home/jenkins/.m2/repository/com/amazonaws/jmespath-java/1.11.655/jmespath-java-1.11.655.jar:/home/jenkins/.m2/repository/software/amazon/ion/ion-java/1.0.2/ion-java-1.0.2.jar:/home/jenkins/.m2/repository/org/slf4j/jcl-over-slf4j/1.7.16/jcl-over-slf4j-1.7.16.jar:/home/jenkins/.m2/repository/commons-httpclient/commons-httpclient/3.1/commons-httpclient-3.1.jar
[INFO] 
[INFO] --- scala-maven-plugin:3.2.2:testCompile (scala-test-compile-first) @ spark-streaming-kinesis-asl-assembly_2.11 ---
[INFO] No sources to compile
[INFO] 
[INFO] --- maven-surefire-plugin:2.22.0:test (default-test) @ spark-streaming-kinesis-asl-assembly_2.11 ---
[INFO] 
[INFO] --- maven-surefire-plugin:2.22.0:test (test) @ spark-streaming-kinesis-asl-assembly_2.11 ---
[INFO] Skipping execution of surefire because it has already been run for this configuration
[INFO] 
[INFO] --- scalatest-maven-plugin:1.0:test (test) @ spark-streaming-kinesis-asl-assembly_2.11 ---
Discovery starting.
Discovery completed in 48 milliseconds.
Run starting. Expected test count is: 0
DiscoverySuite:
Run completed in 113 milliseconds.
Total number of tests run: 0
Suites: completed 1, aborted 0
Tests: succeeded 0, failed 0, canceled 0, ignored 0, pending 0
No tests were executed.
[INFO] ------------------------------------------------------------------------
[INFO] Reactor Summary for Spark Project Parent POM 2.4.8-SNAPSHOT:
[INFO] 
[INFO] Spark Project Parent POM ........................... SUCCESS [  2.714 s]
[INFO] Spark Project Tags ................................. SUCCESS [  2.604 s]
[INFO] Spark Project Sketch ............................... SUCCESS [ 18.616 s]
[INFO] Spark Project Local DB ............................. SUCCESS [  2.705 s]
[INFO] Spark Project Networking ........................... SUCCESS [ 44.172 s]
[INFO] Spark Project Shuffle Streaming Service ............ SUCCESS [  9.847 s]
[INFO] Spark Project Unsafe ............................... SUCCESS [  2.533 s]
[INFO] Spark Project Launcher ............................. SUCCESS [  3.652 s]
[INFO] Spark Project Core ................................. SUCCESS [25:13 min]
[INFO] Spark Project ML Local Library ..................... SUCCESS [  5.294 s]
[INFO] Spark Project GraphX ............................... SUCCESS [02:18 min]
[INFO] Spark Project Streaming ............................ SUCCESS [05:12 min]
[INFO] Spark Project Catalyst ............................. SUCCESS [13:42 min]
[INFO] Spark Project SQL .................................. SUCCESS [41:39 min]
[INFO] Spark Project ML Library ........................... SUCCESS [24:28 min]
[INFO] Spark Project Tools ................................ SUCCESS [  0.767 s]
[INFO] Spark Project Hive ................................. SUCCESS [  01:14 h]
[INFO] Spark Project REPL ................................. SUCCESS [01:50 min]
[INFO] Spark Project YARN Shuffle Service ................. SUCCESS [  2.971 s]
[INFO] Spark Project YARN ................................. SUCCESS [07:16 min]
[INFO] Spark Project Mesos ................................ SUCCESS [ 32.039 s]
[INFO] Spark Project Hive Thrift Server ................... SUCCESS [05:24 min]
[INFO] Spark Project Assembly ............................. SUCCESS [  2.519 s]
[INFO] Spark Integration for Kafka 0.10 ................... SUCCESS [04:59 min]
[INFO] Kafka 0.10+ Source for Structured Streaming ........ FAILURE [12:06 min]
[INFO] Spark Kinesis Integration .......................... SUCCESS [ 23.358 s]
[INFO] Spark Project Examples ............................. SKIPPED
[INFO] Spark Integration for Kafka 0.10 Assembly .......... SUCCESS [  2.254 s]
[INFO] Spark Avro ......................................... SUCCESS [01:01 min]
[INFO] Spark Project Kinesis Assembly ..................... SUCCESS [  2.370 s]
[INFO] ------------------------------------------------------------------------
[INFO] BUILD FAILURE
[INFO] ------------------------------------------------------------------------
[INFO] Total time:  03:42 h
[INFO] Finished at: 2020-09-23T12:13:57-07:00
[INFO] ------------------------------------------------------------------------
[ERROR] Failed to execute goal org.scalatest:scalatest-maven-plugin:1.0:test (test) on project spark-sql-kafka-0-10_2.11: There are test failures -> [Help 1]
[ERROR] 
[ERROR] To see the full stack trace of the errors, re-run Maven with the -e switch.
[ERROR] Re-run Maven using the -X switch to enable full debug logging.
[ERROR] 
[ERROR] For more information about the errors and possible solutions, please read the following articles:
[ERROR] [Help 1] http://cwiki.apache.org/confluence/display/MAVEN/MojoFailureException
[ERROR] 
[ERROR] After correcting the problems, you can resume the build with the command
[ERROR]   mvn <args> -rf :spark-sql-kafka-0-10_2.11
+ retcode2=1
+ [[ 0 -ne 0 ]]
+ [[ 1 -ne 0 ]]
+ [[ 0 -ne 0 ]]
+ [[ 1 -ne 0 ]]
+ echo 'Testing Spark with Maven failed'
Testing Spark with Maven failed
+ exit 1
Build step 'Execute shell' marked build as failure
Archiving artifacts
Recording test results
Finished: FAILURE