FailedConsole Output

GitHub pull request #10593 of commit 22f95c9f801bab3e1436cf0024e64f313444569e automatically merged.
[EnvInject] - Loading node environment variables.
Building remotely on amp-jenkins-staging-worker-02 (ubuntu ubuntu-gpu ubuntu-avx2 staging-02 staging) in workspace /home/jenkins/workspace/Alluxio-Pull-Request-Builder
 > git rev-parse --is-inside-work-tree # timeout=10
Fetching changes from the remote Git repository
 > git config remote.origin.url https://github.com/Alluxio/alluxio.git # timeout=10
Fetching upstream changes from https://github.com/Alluxio/alluxio.git
 > git --version # timeout=10
 > git fetch --tags --progress https://github.com/Alluxio/alluxio.git +refs/pull/*:refs/remotes/origin/pr/* # timeout=15
 > git rev-parse origin/pr/10593/merge^{commit} # timeout=10
 > git branch -a -v --no-abbrev --contains 7bc9f74792610cc39899bd4815b57918c8288cd9 # timeout=10
JENKINS-19022: warning: possible memory leak due to Git plugin usage; see: https://wiki.jenkins-ci.org/display/JENKINS/Remove+Git+Plugin+BuildsByBranch+BuildData
Checking out Revision 7bc9f74792610cc39899bd4815b57918c8288cd9 (origin/pr/10593/merge)
 > git config core.sparsecheckout # timeout=10
 > git checkout -f 7bc9f74792610cc39899bd4815b57918c8288cd9
First time build. Skipping changelog.
[Alluxio-Pull-Request-Builder] $ /bin/sh -xe /tmp/hudson330971705680908306.sh
+ ALLUXIO_DOCKER_IMAGE=alluxio/alluxio-maven:0.0.3 ALLUXIO_DOCKER_NO_TTY=true ALLUXIO_DOCKER_GIT_CLEAN=true ./dev/jenkins/run_docker.sh
Unable to find image 'alluxio/alluxio-maven:0.0.3' locally
0.0.3: Pulling from alluxio/alluxio-maven
55cbf04beb70: Pulling fs layer
1607093a898c: Pulling fs layer
9a8ea045c926: Pulling fs layer
d4eee24d4dac: Pulling fs layer
c58988e753d7: Pulling fs layer
794a04897db9: Pulling fs layer
70fcfa476f73: Pulling fs layer
0539c80a02be: Pulling fs layer
794a04897db9: Waiting
70fcfa476f73: Waiting
54fefc6dcf80: Pulling fs layer
0539c80a02be: Waiting
6db262fda89f: Pulling fs layer
54fefc6dcf80: Waiting
732bb67e37da: Pulling fs layer
859c275fa83e: Pulling fs layer
6db262fda89f: Waiting
1770645250bf: Pulling fs layer
859c275fa83e: Waiting
c58988e753d7: Verifying Checksum
c58988e753d7: Download complete
9a8ea045c926: Verifying Checksum
9a8ea045c926: Download complete
1607093a898c: Download complete
794a04897db9: Download complete
70fcfa476f73: Download complete
54fefc6dcf80: Verifying Checksum
54fefc6dcf80: Download complete
55cbf04beb70: Verifying Checksum
55cbf04beb70: Download complete
d4eee24d4dac: Verifying Checksum
d4eee24d4dac: Download complete
732bb67e37da: Download complete
859c275fa83e: Download complete
0539c80a02be: Verifying Checksum
0539c80a02be: Download complete
6db262fda89f: Verifying Checksum
6db262fda89f: Download complete
55cbf04beb70: Pull complete
1607093a898c: Pull complete
1770645250bf: Verifying Checksum
1770645250bf: Download complete
9a8ea045c926: Pull complete
d4eee24d4dac: Pull complete
c58988e753d7: Pull complete
794a04897db9: Pull complete
70fcfa476f73: Pull complete
0539c80a02be: Pull complete
54fefc6dcf80: Pull complete
6db262fda89f: Pull complete
732bb67e37da: Pull complete
859c275fa83e: Pull complete
1770645250bf: Pull complete
Digest: sha256:b830e0f8aaf9ca7c5d57384831d15b16dcf4fddc94d654db9b8163e8e352a60c
Status: Downloaded newer image for alluxio/alluxio-maven:0.0.3
Removing assembly/target/
Removing core/base/target/
Removing core/client/fs/target/
Removing core/client/hdfs/target/
Removing core/client/target/
Removing core/common/target/
Removing core/server/common/target/
Removing core/server/target/
Removing core/target/
Removing core/transport/target/
Removing examples/target/
Removing integration/checker/target/
Removing integration/fuse/target/
Removing integration/target/
Removing integration/yarn/target/
Removing job/client/target/
Removing job/common/target/
Removing job/target/
Removing lib/
Removing shaded/hadoop/dependency-reduced-pom.xml
Removing shaded/hadoop/target/
Removing shaded/target/
Removing shell/target/
Removing table/base/target/
Removing table/client/target/
Removing table/server/target/
Removing table/shell/target/
Removing table/target/
Removing target/
Removing underfs/cos/target/
Removing underfs/gcs/target/
Removing underfs/hdfs/src/main/java/alluxio/UfsConstants.java
Removing underfs/hdfs/target/
Removing underfs/kodo/target/
Removing underfs/local/target/
Removing underfs/oss/target/
Removing underfs/s3a/target/
Removing underfs/swift/target/
Removing underfs/target/
Removing underfs/wasb/target/
Removing underfs/web/target/
Removing webui/common/build/
Removing webui/common/node_modules/
Removing webui/common/src/components/Footer/Footer.css
Removing webui/common/src/components/Header/Header.css
Removing webui/common/src/components/LineGraph/LineGraph.css
Removing webui/common/src/components/LoadingMessage/LoadingMessage.css
Removing webui/common/src/components/Paginator/Paginator.css
Removing webui/common/src/index.css
Removing webui/master/build/
Removing webui/master/node_modules/
Removing webui/master/src/containers/App/App.css
Removing webui/master/src/containers/pages/Browse/Browse.css
Removing webui/master/src/index.css
Removing webui/node/
Removing webui/node_modules/
Removing webui/worker/build/
Removing webui/worker/node_modules/
Removing webui/worker/src/containers/App/App.css
Removing webui/worker/src/index.css
[INFO] Scanning for projects...
[WARNING] 
[WARNING] Some problems were encountered while building the effective model for org.alluxio:alluxio-shaded-hadoop:jar:2.7.3
[WARNING] 'version' contains an expression but should be a constant. @ org.alluxio:alluxio-shaded-hadoop:${ufs.hadoop.version}, /usr/src/alluxio/shaded/hadoop/pom.xml, line 23, column 12
[WARNING] 'build.plugins.plugin.version' for org.apache.maven.plugins:maven-deploy-plugin is missing. @ org.alluxio:alluxio-shaded-hadoop:${ufs.hadoop.version}, /usr/src/alluxio/shaded/hadoop/pom.xml, line 116, column 15
[WARNING] 
[WARNING] Some problems were encountered while building the effective model for org.alluxio:alluxio-webui:pom:2.2.0-SNAPSHOT
[WARNING] 'build.plugins.plugin.version' for org.apache.maven.plugins:maven-deploy-plugin is missing. @ line 132, column 15
[WARNING] 
[WARNING] It is highly recommended to fix these problems because they threaten the stability of your build.
[WARNING] 
[WARNING] For this reason, future Maven versions might no longer support building such malformed projects.
[WARNING] 
[INFO] ------------------------------------------------------------------------
[INFO] Detecting the operating system and CPU architecture
[INFO] ------------------------------------------------------------------------
[INFO] os.detected.name: linux
[INFO] os.detected.arch: x86_64
[INFO] os.detected.version: 4.4
[INFO] os.detected.version.major: 4
[INFO] os.detected.version.minor: 4
[INFO] os.detected.release: debian
[INFO] os.detected.release.version: 9
[INFO] os.detected.release.like.debian: true
[INFO] os.detected.classifier: linux-x86_64
[INFO] ------------------------------------------------------------------------
[INFO] Reactor Build Order:
[INFO] 
[INFO] Alluxio Parent                                                     [pom]
[INFO] Alluxio Core                                                       [pom]
[INFO] Alluxio Core - Transport                                           [jar]
[INFO] Alluxio Core - Base module                                         [jar]
[INFO] Alluxio Core - Common Utilities                                    [jar]
[INFO] Alluxio Core - Client                                              [pom]
[INFO] Alluxio Core - Client - File System                                [jar]
[INFO] Alluxio Examples                                                   [jar]
[INFO] Alluxio Table                                                      [pom]
[INFO] Alluxio Table - Base Module                                        [jar]
[INFO] Alluxio Table - Client                                             [jar]
[INFO] Alluxio Job Service                                                [pom]
[INFO] Alluxio Job Service - Common Utilities                             [jar]
[INFO] Alluxio Job Service - Client                                       [jar]
[INFO] Alluxio Shell                                                      [jar]
[INFO] Alluxio Table - Shell                                              [jar]
[INFO] Alluxio Assembly                                                   [pom]
[INFO] Alluxio Assembly - Client                                          [jar]
[INFO] Alluxio Core - Server                                              [pom]
[INFO] Alluxio Core - Server - Common Utilities                           [jar]
[INFO] Alluxio Under File System                                          [pom]
[INFO] Alluxio Under File System - Local FS                               [jar]
[INFO] Alluxio Core - Server - Master                                     [jar]
[INFO] Alluxio Core - Server - Proxy                                      [jar]
[INFO] Alluxio Core - Server - Worker                                     [jar]
[INFO] Alluxio Core - Client - HDFS                                       [jar]
[INFO] Alluxio Job Service - Server                                       [jar]
[INFO] Alluxio Log Server                                                 [jar]
[INFO] Alluxio Table - Server                                             [pom]
[INFO] Alluxio Table - Server - Common                                    [jar]
[INFO] Alluxio Table - Server - Master                                    [jar]
[INFO] Alluxio Integration                                                [pom]
[INFO] Alluxio Integration - Mesos                                        [jar]
[INFO] Alluxio Assembly - Server                                          [jar]
[INFO] Alluxio Integration - Checker                                      [jar]
[INFO] Alluxio Integration - FUSE                                         [jar]
[INFO] Alluxio MiniCluster                                                [jar]
[INFO] Alluxio Shaded Libraries                                           [pom]
[INFO] Alluxio Shaded Libraries - Client                                  [jar]
[INFO] Alluxio Shaded Libraries - Hadoop                                  [jar]
[INFO] Alluxio Table - Server - UnderDB                                   [pom]
[INFO] Alluxio Table - Server - UnderDB - Hive                            [jar]
[INFO] Alluxio Tests                                                      [jar]
[INFO] Alluxio Under File System - Tencent Cloud COS                      [jar]
[INFO] Alluxio Under File System - GCS                                    [jar]
[INFO] Alluxio Under File System - HDFS                                   [jar]
[INFO] Alluxio Under File System - Qiniu Kodo                             [jar]
[INFO] Alluxio Under File System - Aliyun OSS                             [jar]
[INFO] Alluxio Under File System - S3                                     [jar]
[INFO] Alluxio Under File System - Swift                                  [jar]
[INFO] Alluxio Under File System - Microsoft Azure Blob Storage           [jar]
[INFO] Alluxio Under File System - Web                                    [jar]
[INFO] Alluxio UI                                                         [pom]
[INFO] Alluxio Integration - YARN                                         [jar]
[INFO] 
[INFO] Using the MultiThreadedBuilder implementation with a thread count of 192
[INFO] 
[INFO] 
[INFO] ---------------------< org.alluxio:alluxio-webui >----------------------
[INFO] ---------------------< org.alluxio:alluxio-parent >---------------------
[INFO] Building Alluxio UI 2.2.0-SNAPSHOT                                [1/54]
[INFO] Building Alluxio Parent 2.2.0-SNAPSHOT                            [2/54]
[INFO] --------------------------------[ pom ]---------------------------------
[INFO] --------------------------------[ pom ]---------------------------------
[WARNING] *****************************************************************
[WARNING] * Your build is requesting parallel execution, but project      *
[WARNING] * contains the following plugin(s) that have goals not marked   *
[WARNING] * as @threadSafe to support parallel building.                  *
[WARNING] * While this /may/ work fine, please look for plugin updates    *
[WARNING] * and/or request plugins be made thread-safe.                   *
[WARNING] * If reporting an issue, report it against the plugin in        *
[WARNING] * question, not against maven-core                              *
[WARNING] *****************************************************************
[WARNING] The following plugins are not marked @threadSafe in Alluxio UI:
[WARNING] com.github.eirslett:frontend-maven-plugin:1.6
[WARNING] Enable debug to see more precisely which goals are not marked @threadSafe.
[WARNING] *****************************************************************
[INFO] 
[INFO] --- maven-clean-plugin:2.5:clean (default-clean) @ alluxio-webui ---
[INFO] 
[INFO] --- exec-maven-plugin:1.4.0:exec (Remove cached node modules and built web applications) @ alluxio-webui ---
[INFO] 
[INFO] --- maven-clean-plugin:3.0.0:clean (default-clean) @ alluxio-parent ---
[INFO] 
[INFO] --- maven-enforcer-plugin:1.4:enforce (enforce-maven) @ alluxio-parent ---
[INFO] 
[INFO] --- frontend-maven-plugin:1.6:install-node-and-npm (install node and npm) @ alluxio-webui ---
[INFO] 
[INFO] --- maven-enforcer-plugin:1.4:enforce (enforce-versions) @ alluxio-parent ---
[INFO] 
[INFO] --- maven-checkstyle-plugin:2.17:check (checkstyle) @ alluxio-parent ---
[INFO] Installing node version v10.11.0
[INFO] Unpacking /home/jenkins/.m2/repository/com/github/eirslett/node/10.11.0/node-10.11.0-linux-x64.tar.gz into /usr/src/alluxio/webui/node/tmp
[INFO] Copying node binary from /usr/src/alluxio/webui/node/tmp/node-v10.11.0-linux-x64/bin/node to /usr/src/alluxio/webui/node/node
[INFO] Starting audit...
Audit done.
[INFO] 
[INFO] --- license-maven-plugin:2.9:check (default) @ alluxio-parent ---
[INFO] Checking licenses...
[INFO] Installed node locally.
[INFO] Installing npm version 6.4.1
[INFO] Unpacking /home/jenkins/.m2/repository/com/github/eirslett/npm/6.4.1/npm-6.4.1.tar.gz into /usr/src/alluxio/webui/node/node_modules
[INFO] Installed npm locally.
[INFO] 
[INFO] --- frontend-maven-plugin:1.6:npm (Install npm dependencies for lerna) @ alluxio-webui ---
[INFO] Running 'npm install --production --no-save --no-package-lock --no-shrinkwrap' in /usr/src/alluxio/webui
[WARNING] Unknown file extension: /usr/src/alluxio/templates/markdown.hbs
[WARNING] Unknown file extension: /usr/src/alluxio/bin/launch-process
[WARNING] Unknown file extension: /usr/src/alluxio/templates/operation.hbs
[WARNING] Unknown file extension: /usr/src/alluxio/templates/strapdown.html.hbs
[WARNING] Unknown file extension: /usr/src/alluxio/dev/scripts/generate-tarballs
[WARNING] Unable to find a comment style definition for some files. You may want to add a custom mapping for the relevant file extensions.
[INFO] 
[INFO] >>> spotbugs-maven-plugin:3.1.12.2:check (default) > :spotbugs @ alluxio-parent >>>
[INFO] 
[INFO] --- spotbugs-maven-plugin:3.1.12.2:spotbugs (spotbugs) @ alluxio-parent ---
[INFO] 
[INFO] <<< spotbugs-maven-plugin:3.1.12.2:check (default) < :spotbugs @ alluxio-parent <<<
[INFO] 
[INFO] 
[INFO] --- spotbugs-maven-plugin:3.1.12.2:check (default) @ alluxio-parent ---
[INFO] 
[INFO] --- exec-maven-plugin:1.4.0:exec (Check that there are no Windows line endings) @ alluxio-parent ---
[INFO] 
[INFO] >>> maven-source-plugin:2.3:jar (attach-sources) > generate-sources @ alluxio-parent >>>
[INFO] 
[INFO] --- maven-enforcer-plugin:1.4:enforce (enforce-maven) @ alluxio-parent ---
[INFO] 
[INFO] --- maven-enforcer-plugin:1.4:enforce (enforce-versions) @ alluxio-parent ---
[INFO] 
[INFO] --- maven-checkstyle-plugin:2.17:check (checkstyle) @ alluxio-parent ---
[INFO] Starting audit...
Audit done.
[INFO] 
[INFO] --- license-maven-plugin:2.9:check (default) @ alluxio-parent ---
[INFO] Checking licenses...
[WARNING] Unknown file extension: /usr/src/alluxio/bin/launch-process
[WARNING] Unknown file extension: /usr/src/alluxio/templates/strapdown.html.hbs
[WARNING] Unknown file extension: /usr/src/alluxio/templates/operation.hbs
[WARNING] Unknown file extension: /usr/src/alluxio/templates/markdown.hbs
[WARNING] Unknown file extension: /usr/src/alluxio/dev/scripts/generate-tarballs
[WARNING] Unable to find a comment style definition for some files. You may want to add a custom mapping for the relevant file extensions.
[INFO] 
[INFO] <<< maven-source-plugin:2.3:jar (attach-sources) < generate-sources @ alluxio-parent <<<
[INFO] 
[INFO] 
[INFO] --- maven-source-plugin:2.3:jar (attach-sources) @ alluxio-parent ---
[INFO] 
[INFO] --- maven-javadoc-plugin:2.9:jar (attach-javadoc) @ alluxio-parent ---
[INFO] Skipping javadoc generation
[INFO] 
[INFO] --- maven-install-plugin:2.4:install (default-install) @ alluxio-parent ---
[INFO] Installing /usr/src/alluxio/pom.xml to /home/jenkins/.m2/repository/org/alluxio/alluxio-parent/2.2.0-SNAPSHOT/alluxio-parent-2.2.0-SNAPSHOT.pom
[INFO] 
[INFO] 
[INFO] ----------------------< org.alluxio:alluxio-core >----------------------
[INFO] ---------------------< org.alluxio:alluxio-table >----------------------
[INFO] Building Alluxio Core 2.2.0-SNAPSHOT                              [3/54]
[INFO] 
[INFO] --------------------------------[ pom ]---------------------------------
[INFO] 
[INFO] Building Alluxio Table 2.2.0-SNAPSHOT                             [4/54]
[INFO] 
[INFO] --------------------< org.alluxio:alluxio-assembly >--------------------
[INFO] ----------------------< org.alluxio:alluxio-job >-----------------------
[INFO] 
[INFO] Building Alluxio Assembly 2.2.0-SNAPSHOT                          [5/54]
[INFO] --------------------------------[ pom ]---------------------------------
[INFO] --------------------< org.alluxio:alluxio-underfs >---------------------
[INFO] 
[INFO] --------------------------------[ pom ]---------------------------------
[INFO] ------------------< org.alluxio:alluxio-integration >-------------------
[INFO] Building Alluxio Job Service 2.2.0-SNAPSHOT                       [6/54]
[INFO] Building Alluxio Integration 2.2.0-SNAPSHOT                       [8/54]
[INFO] ---------------------< org.alluxio:alluxio-shaded >---------------------
[INFO] Building Alluxio Under File System 2.2.0-SNAPSHOT                 [7/54]
[INFO] Building Alluxio Shaded Libraries 2.2.0-SNAPSHOT                  [9/54]
[INFO] --------------------------------[ pom ]---------------------------------
[INFO] --------------------------------[ pom ]---------------------------------
[INFO] --------------------------------[ pom ]---------------------------------
[INFO] --------------------------------[ pom ]---------------------------------
[INFO] 
[INFO] --- maven-clean-plugin:3.0.0:clean (default-clean) @ alluxio-table ---
[INFO] 
[INFO] --- maven-clean-plugin:3.0.0:clean (default-clean) @ alluxio-core ---
[INFO] 
[INFO] 
[INFO] --- maven-enforcer-plugin:1.4:enforce (enforce-maven) @ alluxio-table ---
[INFO] --- maven-enforcer-plugin:1.4:enforce (enforce-maven) @ alluxio-core ---
[INFO] 
[INFO] --- maven-clean-plugin:3.0.0:clean (default-clean) @ alluxio-integration ---
[INFO] 
[INFO] --- maven-clean-plugin:3.0.0:clean (default-clean) @ alluxio-assembly ---
[INFO] 
[INFO] 
[INFO] --- maven-enforcer-plugin:1.4:enforce (enforce-versions) @ alluxio-core ---
[INFO] --- maven-enforcer-plugin:1.4:enforce (enforce-versions) @ alluxio-table ---
[INFO] 
[INFO] 
[INFO] --- maven-enforcer-plugin:1.4:enforce (enforce-maven) @ alluxio-integration ---
[INFO] --- maven-enforcer-plugin:1.4:enforce (enforce-maven) @ alluxio-assembly ---
[INFO] 
[INFO] 
[INFO] --- maven-checkstyle-plugin:2.17:check (checkstyle) @ alluxio-core ---
[INFO] 
[INFO] 
[INFO] --- maven-clean-plugin:3.0.0:clean (default-clean) @ alluxio-underfs ---
[INFO] --- maven-checkstyle-plugin:2.17:check (checkstyle) @ alluxio-table ---
[INFO] 
[INFO] --- maven-enforcer-plugin:1.4:enforce (enforce-versions) @ alluxio-assembly ---
[INFO] 
[INFO] --- maven-enforcer-plugin:1.4:enforce (enforce-versions) @ alluxio-integration ---
[INFO] 
[INFO] --- maven-clean-plugin:3.0.0:clean (default-clean) @ alluxio-shaded ---
[INFO] --- maven-clean-plugin:3.0.0:clean (default-clean) @ alluxio-job ---
[INFO] 
[INFO] --- maven-enforcer-plugin:1.4:enforce (enforce-maven) @ alluxio-shaded ---
[INFO] 
[INFO] --- maven-checkstyle-plugin:2.17:check (checkstyle) @ alluxio-assembly ---
[INFO] 
[INFO] 
[INFO] --- maven-enforcer-plugin:1.4:enforce (enforce-versions) @ alluxio-shaded ---
[INFO] --- maven-enforcer-plugin:1.4:enforce (enforce-maven) @ alluxio-job ---
[INFO] 
[INFO] --- maven-enforcer-plugin:1.4:enforce (enforce-maven) @ alluxio-underfs ---
[INFO] 
[INFO] 
[INFO] 
[INFO] --- maven-checkstyle-plugin:2.17:check (checkstyle) @ alluxio-shaded ---
[INFO] --- maven-enforcer-plugin:1.4:enforce (enforce-versions) @ alluxio-job ---
[INFO] --- maven-checkstyle-plugin:2.17:check (checkstyle) @ alluxio-integration ---
[INFO] 
[INFO] --- maven-enforcer-plugin:1.4:enforce (enforce-versions) @ alluxio-underfs ---
[INFO] 
[INFO] --- maven-checkstyle-plugin:2.17:check (checkstyle) @ alluxio-job ---
[INFO] 
[INFO] --- maven-checkstyle-plugin:2.17:check (checkstyle) @ alluxio-underfs ---
[INFO] Starting audit...
Audit done.
[INFO] 
[INFO] --- license-maven-plugin:2.9:check (default) @ alluxio-core ---
[INFO] Starting audit...
Audit done.
[INFO] 
[INFO] --- license-maven-plugin:2.9:check (default) @ alluxio-shaded ---
[INFO] Starting audit...
Audit done.
[INFO] 
[INFO] --- license-maven-plugin:2.9:check (default) @ alluxio-assembly ---
[INFO] Starting audit...
Audit done.
[INFO] 
[INFO] --- license-maven-plugin:2.9:check (default) @ alluxio-job ---
[INFO] Checking licenses...
[INFO] Checking licenses...
[INFO] Starting audit...
Audit done.
[INFO] 
[INFO] 
[INFO] >>> spotbugs-maven-plugin:3.1.12.2:check (default) > :spotbugs @ alluxio-shaded >>>
[INFO] --- license-maven-plugin:2.9:check (default) @ alluxio-underfs ---
[INFO] Starting audit...
Audit done.
[INFO] 
[INFO] --- license-maven-plugin:2.9:check (default) @ alluxio-table ---
[INFO] 
[INFO] Checking licenses...
[INFO] --- spotbugs-maven-plugin:3.1.12.2:spotbugs (spotbugs) @ alluxio-shaded ---
[INFO] Checking licenses...
[INFO] 
[INFO] <<< spotbugs-maven-plugin:3.1.12.2:check (default) < :spotbugs @ alluxio-shaded <<<
[INFO] 
[INFO] 
[INFO] --- spotbugs-maven-plugin:3.1.12.2:check (default) @ alluxio-shaded ---
[INFO] 
[INFO] >>> spotbugs-maven-plugin:3.1.12.2:check (default) > :spotbugs @ alluxio-assembly >>>
[INFO] 
[INFO] Starting audit...
Audit done.
[INFO] 
[INFO] --- license-maven-plugin:2.9:check (default) @ alluxio-integration ---
[INFO] 
[INFO] --- spotbugs-maven-plugin:3.1.12.2:spotbugs (spotbugs) @ alluxio-assembly ---
[INFO] Checking licenses...
[INFO] >>> maven-source-plugin:2.3:jar (attach-sources) > generate-sources @ alluxio-shaded >>>
[INFO] Checking licenses...
[INFO] 
[INFO] --- maven-enforcer-plugin:1.4:enforce (enforce-maven) @ alluxio-shaded ---
[INFO] 
[INFO] --- maven-enforcer-plugin:1.4:enforce (enforce-versions) @ alluxio-shaded ---
[INFO] 
[INFO] --- maven-checkstyle-plugin:2.17:check (checkstyle) @ alluxio-shaded ---
[INFO] 
[INFO] <<< spotbugs-maven-plugin:3.1.12.2:check (default) < :spotbugs @ alluxio-assembly <<<
[INFO] 
[INFO] Checking licenses...
[INFO] 
[INFO] --- spotbugs-maven-plugin:3.1.12.2:check (default) @ alluxio-assembly ---
[INFO] 
[INFO] >>> maven-source-plugin:2.3:jar (attach-sources) > generate-sources @ alluxio-assembly >>>
[INFO] 
[INFO] --- maven-enforcer-plugin:1.4:enforce (enforce-maven) @ alluxio-assembly ---
[INFO] 
[INFO] --- maven-enforcer-plugin:1.4:enforce (enforce-versions) @ alluxio-assembly ---
[INFO] 
[INFO] --- maven-checkstyle-plugin:2.17:check (checkstyle) @ alluxio-assembly ---
[INFO] 
[INFO] >>> spotbugs-maven-plugin:3.1.12.2:check (default) > :spotbugs @ alluxio-table >>>
[INFO] 
[INFO] --- spotbugs-maven-plugin:3.1.12.2:spotbugs (spotbugs) @ alluxio-table ---
[INFO] 
[INFO] <<< spotbugs-maven-plugin:3.1.12.2:check (default) < :spotbugs @ alluxio-table <<<
[INFO] 
[INFO] 
[INFO] --- spotbugs-maven-plugin:3.1.12.2:check (default) @ alluxio-table ---
[INFO] 
[INFO] >>> spotbugs-maven-plugin:3.1.12.2:check (default) > :spotbugs @ alluxio-underfs >>>
[INFO] 
[INFO] >>> maven-source-plugin:2.3:jar (attach-sources) > generate-sources @ alluxio-table >>>
[INFO] 
[INFO] --- spotbugs-maven-plugin:3.1.12.2:spotbugs (spotbugs) @ alluxio-underfs ---
[INFO] 
[INFO] --- maven-enforcer-plugin:1.4:enforce (enforce-maven) @ alluxio-table ---
[INFO] 
[INFO] --- maven-enforcer-plugin:1.4:enforce (enforce-versions) @ alluxio-table ---
[INFO] 
[INFO] --- maven-checkstyle-plugin:2.17:check (checkstyle) @ alluxio-table ---
[INFO] 
[INFO] <<< spotbugs-maven-plugin:3.1.12.2:check (default) < :spotbugs @ alluxio-underfs <<<
[INFO] 
[INFO] 
[INFO] --- spotbugs-maven-plugin:3.1.12.2:check (default) @ alluxio-underfs ---
[INFO] 
[INFO] >>> spotbugs-maven-plugin:3.1.12.2:check (default) > :spotbugs @ alluxio-job >>>
[INFO] 
[INFO] --- spotbugs-maven-plugin:3.1.12.2:spotbugs (spotbugs) @ alluxio-job ---
[INFO] 
[INFO] >>> maven-source-plugin:2.3:jar (attach-sources) > generate-sources @ alluxio-underfs >>>
[INFO] 
[INFO] --- maven-enforcer-plugin:1.4:enforce (enforce-maven) @ alluxio-underfs ---
[INFO] 
[INFO] <<< spotbugs-maven-plugin:3.1.12.2:check (default) < :spotbugs @ alluxio-job <<<
[INFO] 
[INFO] 
[INFO] --- spotbugs-maven-plugin:3.1.12.2:check (default) @ alluxio-job ---
[INFO] 
[INFO] --- maven-enforcer-plugin:1.4:enforce (enforce-versions) @ alluxio-underfs ---
[INFO] 
[INFO] --- maven-checkstyle-plugin:2.17:check (checkstyle) @ alluxio-underfs ---
[INFO] 
[INFO] >>> maven-source-plugin:2.3:jar (attach-sources) > generate-sources @ alluxio-job >>>
[INFO] 
[INFO] --- maven-enforcer-plugin:1.4:enforce (enforce-maven) @ alluxio-job ---
[INFO] 
[INFO] --- maven-enforcer-plugin:1.4:enforce (enforce-versions) @ alluxio-job ---
[INFO] 
[INFO] --- maven-checkstyle-plugin:2.17:check (checkstyle) @ alluxio-job ---
[WARNING] Unknown file extension: /usr/src/alluxio/integration/kubernetes/helm-chart/alluxio/templates/_helpers.tpl
[WARNING] Unknown file extension: /usr/src/alluxio/integration/kubernetes/helm-chart/alluxio/.helmignore
[WARNING] Unknown file extension: /usr/src/alluxio/integration/kubernetes/alluxio-fuse-client.yaml.template
[WARNING] Unknown file extension: /usr/src/alluxio/integration/kubernetes/multiMaster-embeddedJournal/alluxio-configmap.yaml.template
[WARNING] Unknown file extension: /usr/src/alluxio/integration/kubernetes/multiMaster-embeddedJournal/worker/alluxio-worker-daemonset.yaml.template
[WARNING] Unknown file extension: /usr/src/alluxio/integration/kubernetes/multiMaster-embeddedJournal/master/alluxio-master-statefulset.yaml.template
[WARNING] Unknown file extension: /usr/src/alluxio/integration/kubernetes/multiMaster-embeddedJournal/master/alluxio-master-service.yaml.template
[WARNING] Unknown file extension: /usr/src/alluxio/integration/kubernetes/multiMaster-embeddedJournal/job/alluxio-format-journal-job.yaml.template
[WARNING] Unknown file extension: /usr/src/alluxio/integration/kubernetes/singleMaster-hdfsJournal/job/alluxio-format-journal-job.yaml.template
[WARNING] Unknown file extension: /usr/src/alluxio/integration/kubernetes/singleMaster-hdfsJournal/master/alluxio-master-statefulset.yaml.template
[WARNING] Unknown file extension: /usr/src/alluxio/integration/kubernetes/singleMaster-hdfsJournal/alluxio-configmap.yaml.template
[WARNING] Unknown file extension: /usr/src/alluxio/integration/kubernetes/alluxio-fuse.yaml.template
[WARNING] Unknown file extension: /usr/src/alluxio/integration/kubernetes/singleMaster-hdfsJournal/worker/alluxio-worker-daemonset.yaml.template
[WARNING] Unknown file extension: /usr/src/alluxio/integration/kubernetes/singleMaster-localJournal/job/alluxio-format-journal-job.yaml.template
[WARNING] Unknown file extension: /usr/src/alluxio/integration/kubernetes/singleMaster-hdfsJournal/master/alluxio-master-service.yaml.template
[WARNING] Unknown file extension: /usr/src/alluxio/integration/kubernetes/singleMaster-localJournal/master/alluxio-master-journal-pv.yaml.template
[WARNING] Unknown file extension: /usr/src/alluxio/integration/kubernetes/singleMaster-localJournal/master/alluxio-master-journal-pvc.yaml.template
[WARNING] Unknown file extension: /usr/src/alluxio/integration/kubernetes/singleMaster-localJournal/master/alluxio-master-statefulset.yaml.template
[WARNING] Unknown file extension: /usr/src/alluxio/integration/kubernetes/singleMaster-localJournal/alluxio-configmap.yaml.template
[WARNING] Unknown file extension: /usr/src/alluxio/integration/kubernetes/singleMaster-localJournal/worker/alluxio-worker-daemonset.yaml.template
[WARNING] Unknown file extension: /usr/src/alluxio/integration/kubernetes/singleMaster-localJournal/master/alluxio-master-service.yaml.template
[WARNING] Unknown file extension: /usr/src/alluxio/integration/docker/Dockerfile.fuse
[WARNING] Unknown file extension: /usr/src/alluxio/integration/docker/.dockerignore
[WARNING] Unable to find a comment style definition for some files. You may want to add a custom mapping for the relevant file extensions.
[INFO] 
[INFO] >>> spotbugs-maven-plugin:3.1.12.2:check (default) > :spotbugs @ alluxio-integration >>>
[INFO] 
[INFO] --- spotbugs-maven-plugin:3.1.12.2:spotbugs (spotbugs) @ alluxio-integration ---
[INFO] 
[INFO] <<< spotbugs-maven-plugin:3.1.12.2:check (default) < :spotbugs @ alluxio-integration <<<
[INFO] 
[INFO] 
[INFO] --- spotbugs-maven-plugin:3.1.12.2:check (default) @ alluxio-integration ---
[INFO] 
[INFO] >>> maven-source-plugin:2.3:jar (attach-sources) > generate-sources @ alluxio-integration >>>
[INFO] 
[INFO] --- maven-enforcer-plugin:1.4:enforce (enforce-maven) @ alluxio-integration ---
[INFO] 
[INFO] --- maven-enforcer-plugin:1.4:enforce (enforce-versions) @ alluxio-integration ---
[INFO] 
[INFO] --- maven-checkstyle-plugin:2.17:check (checkstyle) @ alluxio-integration ---
[INFO] Starting audit...
Audit done.
[INFO] 
[INFO] >>> spotbugs-maven-plugin:3.1.12.2:check (default) > :spotbugs @ alluxio-core >>>
[INFO] 
[INFO] --- license-maven-plugin:2.9:check (default) @ alluxio-shaded ---
[INFO] 
[INFO] --- spotbugs-maven-plugin:3.1.12.2:spotbugs (spotbugs) @ alluxio-core ---
[INFO] 
[INFO] <<< spotbugs-maven-plugin:3.1.12.2:check (default) < :spotbugs @ alluxio-core <<<
[INFO] 
[INFO] 
[INFO] --- spotbugs-maven-plugin:3.1.12.2:check (default) @ alluxio-core ---
[INFO] Checking licenses...
[INFO] 
[INFO] >>> maven-source-plugin:2.3:jar (attach-sources) > generate-sources @ alluxio-core >>>
[INFO] 
[INFO] --- maven-enforcer-plugin:1.4:enforce (enforce-maven) @ alluxio-core ---
[INFO] 
[INFO] --- maven-enforcer-plugin:1.4:enforce (enforce-versions) @ alluxio-core ---
[INFO] 
[INFO] <<< maven-source-plugin:2.3:jar (attach-sources) < generate-sources @ alluxio-shaded <<<
[INFO] 
[INFO] 
[INFO] 
[INFO] --- maven-checkstyle-plugin:2.17:check (checkstyle) @ alluxio-core ---
[INFO] --- maven-source-plugin:2.3:jar (attach-sources) @ alluxio-shaded ---
[INFO] 
[INFO] --- maven-javadoc-plugin:2.9:jar (attach-javadoc) @ alluxio-shaded ---
[INFO] Skipping javadoc generation
[INFO] 
[INFO] --- maven-install-plugin:2.4:install (default-install) @ alluxio-shaded ---
[INFO] Installing /usr/src/alluxio/shaded/pom.xml to /home/jenkins/.m2/repository/org/alluxio/alluxio-shaded/2.2.0-SNAPSHOT/alluxio-shaded-2.2.0-SNAPSHOT.pom
[INFO] 
[INFO] -----------------< org.alluxio:alluxio-shaded-hadoop >------------------
[INFO] Building Alluxio Shaded Libraries - Hadoop 2.7.3                 [10/54]
[INFO] --------------------------------[ jar ]---------------------------------
[INFO] Starting audit...
Audit done.
[INFO] 
[INFO] --- license-maven-plugin:2.9:check (default) @ alluxio-underfs ---
[INFO] Starting audit...
Audit done.
[INFO] Checking licenses...
[INFO] 
[INFO] --- license-maven-plugin:2.9:check (default) @ alluxio-assembly ---
[INFO] Starting audit...
Audit done.
[INFO] 
[INFO] --- license-maven-plugin:2.9:check (default) @ alluxio-job ---
[INFO] Starting audit...
Audit done.
[INFO] 
[INFO] --- license-maven-plugin:2.9:check (default) @ alluxio-table ---
[INFO] Checking licenses...
[INFO] 
[INFO] <<< maven-source-plugin:2.3:jar (attach-sources) < generate-sources @ alluxio-assembly <<<
[INFO] 
[INFO] 
[INFO] --- maven-source-plugin:2.3:jar (attach-sources) @ alluxio-assembly ---
[INFO] 
[INFO] --- maven-javadoc-plugin:2.9:jar (attach-javadoc) @ alluxio-assembly ---
[INFO] Checking licenses...
[INFO] Checking licenses...
[INFO] Skipping javadoc generation
[INFO] 
[INFO] --- maven-install-plugin:2.4:install (default-install) @ alluxio-assembly ---
[INFO] Installing /usr/src/alluxio/assembly/pom.xml to /home/jenkins/.m2/repository/org/alluxio/alluxio-assembly/2.2.0-SNAPSHOT/alluxio-assembly-2.2.0-SNAPSHOT.pom
[INFO] 
[INFO] <<< maven-source-plugin:2.3:jar (attach-sources) < generate-sources @ alluxio-underfs <<<
[INFO] 
[INFO] 
[INFO] --- maven-source-plugin:2.3:jar (attach-sources) @ alluxio-underfs ---
[INFO] 
[INFO] --- maven-javadoc-plugin:2.9:jar (attach-javadoc) @ alluxio-underfs ---
[INFO] Skipping javadoc generation
[INFO] 
[INFO] --- maven-install-plugin:2.4:install (default-install) @ alluxio-underfs ---
[INFO] Installing /usr/src/alluxio/underfs/pom.xml to /home/jenkins/.m2/repository/org/alluxio/alluxio-underfs/2.2.0-SNAPSHOT/alluxio-underfs-2.2.0-SNAPSHOT.pom
[INFO] 
[INFO] <<< maven-source-plugin:2.3:jar (attach-sources) < generate-sources @ alluxio-table <<<
[INFO] 
[INFO] 
[INFO] --- maven-source-plugin:2.3:jar (attach-sources) @ alluxio-table ---
[INFO] 
[INFO] --- maven-javadoc-plugin:2.9:jar (attach-javadoc) @ alluxio-table ---
[INFO] Skipping javadoc generation
[INFO] 
[INFO] --- maven-install-plugin:2.4:install (default-install) @ alluxio-table ---
[INFO] Installing /usr/src/alluxio/table/pom.xml to /home/jenkins/.m2/repository/org/alluxio/alluxio-table/2.2.0-SNAPSHOT/alluxio-table-2.2.0-SNAPSHOT.pom
[INFO] 
[INFO] ------------------< org.alluxio:alluxio-table-server >------------------
[INFO] Building Alluxio Table - Server 2.2.0-SNAPSHOT                   [11/54]
[INFO] --------------------------------[ pom ]---------------------------------
[INFO] 
[INFO] --- maven-clean-plugin:3.0.0:clean (default-clean) @ alluxio-table-server ---
[INFO] 
[INFO] --- maven-enforcer-plugin:1.4:enforce (enforce-maven) @ alluxio-table-server ---
[INFO] 
[INFO] <<< maven-source-plugin:2.3:jar (attach-sources) < generate-sources @ alluxio-job <<<
[INFO] 
[INFO] 
[INFO] --- maven-enforcer-plugin:1.4:enforce (enforce-versions) @ alluxio-table-server ---
[INFO] 
[INFO] --- maven-source-plugin:2.3:jar (attach-sources) @ alluxio-job ---
[INFO] 
[INFO] --- maven-checkstyle-plugin:2.17:check (checkstyle) @ alluxio-table-server ---
[INFO] 
[INFO] --- maven-javadoc-plugin:2.9:jar (attach-javadoc) @ alluxio-job ---
[INFO] Skipping javadoc generation
[INFO] 
[INFO] --- maven-install-plugin:2.4:install (default-install) @ alluxio-job ---
[INFO] Installing /usr/src/alluxio/job/pom.xml to /home/jenkins/.m2/repository/org/alluxio/alluxio-job/2.2.0-SNAPSHOT/alluxio-job-2.2.0-SNAPSHOT.pom
[INFO] 
[INFO] --- maven-clean-plugin:3.0.0:clean (default-clean) @ alluxio-shaded-hadoop ---
[INFO] 
[INFO] --- maven-enforcer-plugin:1.4:enforce (enforce-maven) @ alluxio-shaded-hadoop ---
[INFO] 
[INFO] --- maven-enforcer-plugin:1.4:enforce (enforce-versions) @ alluxio-shaded-hadoop ---
[INFO] 
[INFO] --- maven-checkstyle-plugin:2.17:check (checkstyle) @ alluxio-shaded-hadoop ---
[INFO] Starting audit...
Audit done.
[INFO] 
[INFO] --- license-maven-plugin:2.9:check (default) @ alluxio-integration ---
[INFO] Checking licenses...
[WARNING] Unknown file extension: /usr/src/alluxio/integration/kubernetes/helm-chart/alluxio/templates/_helpers.tpl
[WARNING] Unknown file extension: /usr/src/alluxio/integration/kubernetes/helm-chart/alluxio/.helmignore
[WARNING] Unknown file extension: /usr/src/alluxio/integration/kubernetes/alluxio-fuse-client.yaml.template
[WARNING] Unknown file extension: /usr/src/alluxio/integration/kubernetes/multiMaster-embeddedJournal/alluxio-configmap.yaml.template
[WARNING] Unknown file extension: /usr/src/alluxio/integration/kubernetes/multiMaster-embeddedJournal/job/alluxio-format-journal-job.yaml.template
[WARNING] Unknown file extension: /usr/src/alluxio/integration/kubernetes/multiMaster-embeddedJournal/master/alluxio-master-statefulset.yaml.template
[WARNING] Unknown file extension: /usr/src/alluxio/integration/kubernetes/multiMaster-embeddedJournal/worker/alluxio-worker-daemonset.yaml.template
[WARNING] Unknown file extension: /usr/src/alluxio/integration/kubernetes/singleMaster-hdfsJournal/job/alluxio-format-journal-job.yaml.template
[WARNING] Unknown file extension: /usr/src/alluxio/integration/kubernetes/multiMaster-embeddedJournal/master/alluxio-master-service.yaml.template
[WARNING] Unknown file extension: /usr/src/alluxio/integration/kubernetes/singleMaster-localJournal/alluxio-configmap.yaml.template
[WARNING] Unknown file extension: /usr/src/alluxio/integration/kubernetes/singleMaster-hdfsJournal/worker/alluxio-worker-daemonset.yaml.template
[WARNING] Unknown file extension: /usr/src/alluxio/integration/kubernetes/alluxio-fuse.yaml.template
[WARNING] Unknown file extension: /usr/src/alluxio/integration/kubernetes/singleMaster-hdfsJournal/master/alluxio-master-service.yaml.template
[WARNING] Unknown file extension: /usr/src/alluxio/integration/kubernetes/singleMaster-hdfsJournal/master/alluxio-master-statefulset.yaml.template
[WARNING] Unknown file extension: /usr/src/alluxio/integration/kubernetes/singleMaster-hdfsJournal/alluxio-configmap.yaml.template
[WARNING] Unknown file extension: /usr/src/alluxio/integration/kubernetes/singleMaster-localJournal/master/alluxio-master-service.yaml.template
[WARNING] Unknown file extension: /usr/src/alluxio/integration/kubernetes/singleMaster-localJournal/worker/alluxio-worker-daemonset.yaml.template
[WARNING] Unknown file extension: /usr/src/alluxio/integration/kubernetes/singleMaster-localJournal/master/alluxio-master-journal-pv.yaml.template
[WARNING] Unknown file extension: /usr/src/alluxio/integration/kubernetes/singleMaster-localJournal/master/alluxio-master-statefulset.yaml.template
[WARNING] Unknown file extension: /usr/src/alluxio/integration/kubernetes/singleMaster-localJournal/master/alluxio-master-journal-pvc.yaml.template
[WARNING] Unknown file extension: /usr/src/alluxio/integration/kubernetes/singleMaster-localJournal/job/alluxio-format-journal-job.yaml.template
[WARNING] Unknown file extension: /usr/src/alluxio/integration/docker/Dockerfile.fuse
[WARNING] Unknown file extension: /usr/src/alluxio/integration/docker/.dockerignore
[WARNING] Unable to find a comment style definition for some files. You may want to add a custom mapping for the relevant file extensions.
[INFO] 
[INFO] <<< maven-source-plugin:2.3:jar (attach-sources) < generate-sources @ alluxio-integration <<<
[INFO] 
[INFO] 
[INFO] --- maven-source-plugin:2.3:jar (attach-sources) @ alluxio-integration ---
[INFO] 
[INFO] --- maven-javadoc-plugin:2.9:jar (attach-javadoc) @ alluxio-integration ---
[INFO] Skipping javadoc generation
[INFO] 
[INFO] --- maven-install-plugin:2.4:install (default-install) @ alluxio-integration ---
[INFO] Installing /usr/src/alluxio/integration/pom.xml to /home/jenkins/.m2/repository/org/alluxio/alluxio-integration/2.2.0-SNAPSHOT/alluxio-integration-2.2.0-SNAPSHOT.pom
[INFO] Starting audit...
Audit done.
[INFO] 
[INFO] --- license-maven-plugin:2.9:check (default) @ alluxio-core ---
[INFO] Starting audit...
Audit done.
[INFO] 
[INFO] --- license-maven-plugin:2.9:check (default) @ alluxio-table-server ---
[INFO] Checking licenses...
[INFO] Checking licenses...
[INFO] 
[INFO] >>> spotbugs-maven-plugin:3.1.12.2:check (default) > :spotbugs @ alluxio-table-server >>>
[INFO] 
[INFO] --- spotbugs-maven-plugin:3.1.12.2:spotbugs (spotbugs) @ alluxio-table-server ---
[INFO] 
[INFO] <<< spotbugs-maven-plugin:3.1.12.2:check (default) < :spotbugs @ alluxio-table-server <<<
[INFO] 
[INFO] 
[INFO] --- spotbugs-maven-plugin:3.1.12.2:check (default) @ alluxio-table-server ---
[INFO] 
[INFO] >>> maven-source-plugin:2.3:jar (attach-sources) > generate-sources @ alluxio-table-server >>>
[INFO] 
[INFO] --- maven-enforcer-plugin:1.4:enforce (enforce-maven) @ alluxio-table-server ---
[INFO] 
[INFO] --- maven-enforcer-plugin:1.4:enforce (enforce-versions) @ alluxio-table-server ---
[INFO] 
[INFO] --- maven-checkstyle-plugin:2.17:check (checkstyle) @ alluxio-table-server ---
[INFO] Starting audit...
Audit done.
[INFO] 
[INFO] --- license-maven-plugin:2.9:check (default) @ alluxio-shaded-hadoop ---
[INFO] Checking licenses...
[INFO] 
[INFO] --- maven-resources-plugin:2.7:resources (default-resources) @ alluxio-shaded-hadoop ---
[INFO] Using 'UTF-8' encoding to copy filtered resources.
[INFO] skip non existing resourceDirectory /usr/src/alluxio/shaded/hadoop/src/main/resources
[INFO] 
[INFO] --- maven-compiler-plugin:3.2:compile (default-compile) @ alluxio-shaded-hadoop ---
[INFO] No sources to compile
[INFO] 
[INFO] >>> spotbugs-maven-plugin:3.1.12.2:check (default) > :spotbugs @ alluxio-shaded-hadoop >>>
[INFO] 
[INFO] --- spotbugs-maven-plugin:3.1.12.2:spotbugs (spotbugs) @ alluxio-shaded-hadoop ---
[INFO] 
[INFO] <<< spotbugs-maven-plugin:3.1.12.2:check (default) < :spotbugs @ alluxio-shaded-hadoop <<<
[INFO] 
[INFO] 
[INFO] --- spotbugs-maven-plugin:3.1.12.2:check (default) @ alluxio-shaded-hadoop ---
[INFO] 
[INFO] --- maven-resources-plugin:2.7:testResources (default-testResources) @ alluxio-shaded-hadoop ---
[INFO] Using 'UTF-8' encoding to copy filtered resources.
[INFO] skip non existing resourceDirectory /usr/src/alluxio/shaded/hadoop/src/test/resources
[INFO] 
[INFO] --- maven-compiler-plugin:3.2:testCompile (default-testCompile) @ alluxio-shaded-hadoop ---
[INFO] No sources to compile
[INFO] 
[INFO] --- maven-surefire-plugin:2.19.1:test (default-test) @ alluxio-shaded-hadoop ---
[INFO] No tests to run.
[INFO] 
[INFO] --- maven-jar-plugin:2.4:jar (default-jar) @ alluxio-shaded-hadoop ---
[WARNING] JAR will be empty - no content was marked for inclusion!
[INFO] Building jar: /usr/src/alluxio/shaded/hadoop/target/alluxio-shaded-hadoop-2.7.3.jar
[INFO] Starting audit...
Audit done.
[INFO] 
[INFO] --- license-maven-plugin:2.9:check (default) @ alluxio-table-server ---
[INFO] Checking licenses...
[INFO] 
[INFO] >>> maven-source-plugin:2.3:jar (attach-sources) > generate-sources @ alluxio-shaded-hadoop >>>
[INFO] 
[INFO] --- maven-enforcer-plugin:1.4:enforce (enforce-maven) @ alluxio-shaded-hadoop ---
[INFO] 
[INFO] --- maven-enforcer-plugin:1.4:enforce (enforce-versions) @ alluxio-shaded-hadoop ---
[INFO] 
[INFO] --- maven-checkstyle-plugin:2.17:check (checkstyle) @ alluxio-shaded-hadoop ---
[INFO] 
[INFO] <<< maven-source-plugin:2.3:jar (attach-sources) < generate-sources @ alluxio-table-server <<<
[INFO] 
[INFO] 
[INFO] --- maven-source-plugin:2.3:jar (attach-sources) @ alluxio-table-server ---
[INFO] 
[INFO] --- maven-javadoc-plugin:2.9:jar (attach-javadoc) @ alluxio-table-server ---
[INFO] Skipping javadoc generation
[INFO] 
[INFO] --- maven-install-plugin:2.4:install (default-install) @ alluxio-table-server ---
[INFO] Installing /usr/src/alluxio/table/server/pom.xml to /home/jenkins/.m2/repository/org/alluxio/alluxio-table-server/2.2.0-SNAPSHOT/alluxio-table-server-2.2.0-SNAPSHOT.pom
[INFO] 
[INFO] <<< maven-source-plugin:2.3:jar (attach-sources) < generate-sources @ alluxio-core <<<
[INFO] 
[INFO] 
[INFO] --- maven-source-plugin:2.3:jar (attach-sources) @ alluxio-core ---
[INFO] 
[INFO] --- maven-javadoc-plugin:2.9:jar (attach-javadoc) @ alluxio-core ---
[INFO] Skipping javadoc generation
[INFO] 
[INFO] --- maven-install-plugin:2.4:install (default-install) @ alluxio-core ---
[INFO] Installing /usr/src/alluxio/core/pom.xml to /home/jenkins/.m2/repository/org/alluxio/alluxio-core/2.2.0-SNAPSHOT/alluxio-core-2.2.0-SNAPSHOT.pom
[INFO] 
[INFO] -----------------< org.alluxio:alluxio-core-transport >-----------------
[INFO] 
[INFO] 
[INFO] ------------------< org.alluxio:alluxio-core-client >-------------------
[INFO] Building Alluxio Core - Transport 2.2.0-SNAPSHOT                 [12/54]
[INFO] Building Alluxio Core - Client 2.2.0-SNAPSHOT                    [13/54]
[INFO] ------------------< org.alluxio:alluxio-core-server >-------------------
[INFO] --------------------------------[ pom ]---------------------------------
[INFO] --------------------------------[ jar ]---------------------------------
[INFO] Building Alluxio Core - Server 2.2.0-SNAPSHOT                    [14/54]
[INFO] --------------------------------[ pom ]---------------------------------
[INFO] 
[INFO] --- maven-clean-plugin:3.0.0:clean (default-clean) @ alluxio-core-client ---
[INFO] 
[INFO] --- maven-enforcer-plugin:1.4:enforce (enforce-maven) @ alluxio-core-client ---
[INFO] 
[INFO] --- maven-enforcer-plugin:1.4:enforce (enforce-versions) @ alluxio-core-client ---
[INFO] 
[INFO] --- maven-checkstyle-plugin:2.17:check (checkstyle) @ alluxio-core-client ---
[INFO] 
[INFO] --- maven-clean-plugin:3.0.0:clean (default-clean) @ alluxio-core-server ---
[INFO] 
[INFO] --- maven-enforcer-plugin:1.4:enforce (enforce-maven) @ alluxio-core-server ---
[INFO] 
[INFO] --- maven-enforcer-plugin:1.4:enforce (enforce-versions) @ alluxio-core-server ---
[INFO] 
[INFO] --- maven-checkstyle-plugin:2.17:check (checkstyle) @ alluxio-core-server ---
Downloading from cloudera-repo: https://repository.cloudera.com/artifactory/cloudera-repos/io/netty/netty-codec-http2/maven-metadata.xml
Downloading from mapr-repo: http://repository.mapr.com/maven/io/netty/netty-codec-http2/maven-metadata.xml
Downloading from central: https://repo1.maven.org/maven2/io/netty/netty-codec-http2/maven-metadata.xml
Downloading from apache-repo: https://repository.apache.org/content/repositories/releases/io/netty/netty-codec-http2/maven-metadata.xml
[INFO] Starting audit...
Audit done.
[INFO] 
[INFO] --- license-maven-plugin:2.9:check (default) @ alluxio-shaded-hadoop ---
[INFO] Checking licenses...
[INFO] 
[INFO] <<< maven-source-plugin:2.3:jar (attach-sources) < generate-sources @ alluxio-shaded-hadoop <<<
[INFO] 
[INFO] 
[INFO] --- maven-source-plugin:2.3:jar (attach-sources) @ alluxio-shaded-hadoop ---
[INFO] No sources in project. Archive not created.
[INFO] 
[INFO] --- maven-javadoc-plugin:2.9:jar (attach-javadoc) @ alluxio-shaded-hadoop ---
[INFO] Skipping javadoc generation
[INFO] 
[INFO] --- maven-shade-plugin:3.2.1:shade (shade-alluxio) @ alluxio-shaded-hadoop ---
[INFO] Starting audit...
Audit done.
[INFO] 
[INFO] --- license-maven-plugin:2.9:check (default) @ alluxio-core-client ---
Downloading from spring-releases: http://repo.spring.io/libs-release/io/netty/netty-codec-http2/maven-metadata.xml
[INFO] Starting audit...
Audit done.
[INFO] 
[INFO] --- license-maven-plugin:2.9:check (default) @ alluxio-core-server ---
Progress (1): 2.2/2.4 kB
Progress (1): 2.4 kB    
                    
Downloaded from central: https://repo1.maven.org/maven2/io/netty/netty-codec-http2/maven-metadata.xml (2.4 kB at 6.6 kB/s)
Downloading from HDPReleases: http://repo.hortonworks.com/content/repositories/releases/io/netty/netty-codec-http2/maven-metadata.xml
[INFO] Checking licenses...
[INFO] Checking licenses...
[INFO] Including com.google.guava:guava:jar:14.0.1 in the shaded jar.
[INFO] Including org.apache.hadoop:hadoop-common:jar:2.7.3 in the shaded jar.
[INFO] Including org.apache.hadoop:hadoop-annotations:jar:2.7.3 in the shaded jar.
[INFO] Excluding commons-cli:commons-cli:jar:1.3.1 from the shaded jar.
[INFO] Excluding org.apache.commons:commons-math3:jar:3.1.1 from the shaded jar.
[INFO] Excluding xmlenc:xmlenc:jar:0.52 from the shaded jar.
[INFO] Including commons-httpclient:commons-httpclient:jar:3.1 in the shaded jar.
[INFO] Excluding commons-codec:commons-codec:jar:1.10 from the shaded jar.
[INFO] Excluding commons-io:commons-io:jar:2.4 from the shaded jar.
[INFO] Excluding commons-net:commons-net:jar:3.1 from the shaded jar.
[INFO] Excluding commons-collections:commons-collections:jar:3.2.2 from the shaded jar.
[INFO] Excluding javax.servlet:servlet-api:jar:2.5 from the shaded jar.
[INFO] Excluding org.mortbay.jetty:jetty:jar:6.1.26 from the shaded jar.
[INFO] Excluding org.mortbay.jetty:jetty-util:jar:6.1.26 from the shaded jar.
[INFO] Excluding javax.servlet.jsp:jsp-api:jar:2.1 from the shaded jar.
[INFO] Excluding com.sun.jersey:jersey-core:jar:1.9 from the shaded jar.
[INFO] Excluding com.sun.jersey:jersey-json:jar:1.9 from the shaded jar.
[INFO] Excluding org.codehaus.jettison:jettison:jar:1.1 from the shaded jar.
[INFO] Excluding com.sun.xml.bind:jaxb-impl:jar:2.2.3-1 from the shaded jar.
[INFO] Excluding javax.xml.bind:jaxb-api:jar:2.2.2 from the shaded jar.
[INFO] Excluding javax.xml.stream:stax-api:jar:1.0-2 from the shaded jar.
[INFO] Excluding javax.activation:activation:jar:1.1 from the shaded jar.
[INFO] Including org.codehaus.jackson:jackson-jaxrs:jar:1.8.3 in the shaded jar.
[INFO] Including org.codehaus.jackson:jackson-xc:jar:1.8.3 in the shaded jar.
[INFO] Excluding com.sun.jersey:jersey-server:jar:1.9 from the shaded jar.
[INFO] Including asm:asm:jar:3.1 in the shaded jar.
[INFO] Excluding commons-logging:commons-logging:jar:1.1.1 from the shaded jar.
[INFO] Including net.java.dev.jets3t:jets3t:jar:0.8.1 in the shaded jar.
[INFO] Excluding com.jamesmurty.utils:java-xmlbuilder:jar:0.4 from the shaded jar.
[INFO] Excluding commons-lang:commons-lang:jar:2.6 from the shaded jar.
[INFO] Excluding commons-configuration:commons-configuration:jar:1.6 from the shaded jar.
[INFO] Excluding commons-digester:commons-digester:jar:1.8 from the shaded jar.
[INFO] Excluding commons-beanutils:commons-beanutils:jar:1.7.0 from the shaded jar.
[INFO] Excluding commons-beanutils:commons-beanutils-core:jar:1.8.0 from the shaded jar.
[INFO] Including org.codehaus.jackson:jackson-core-asl:jar:1.9.13 in the shaded jar.
[INFO] Including org.codehaus.jackson:jackson-mapper-asl:jar:1.9.13 in the shaded jar.
[INFO] Excluding org.apache.avro:avro:jar:1.7.4 from the shaded jar.
[INFO] Excluding com.thoughtworks.paranamer:paranamer:jar:2.3 from the shaded jar.
[INFO] Excluding org.xerial.snappy:snappy-java:jar:1.0.4.1 from the shaded jar.
[INFO] Including com.google.protobuf:protobuf-java:jar:3.5.1 in the shaded jar.
[INFO] Excluding com.google.code.gson:gson:jar:2.2.4 from the shaded jar.
[INFO] Including org.apache.hadoop:hadoop-auth:jar:2.7.3 in the shaded jar.
[INFO] Including org.apache.httpcomponents:httpclient:jar:4.5.3 in the shaded jar.
[INFO] Including org.apache.httpcomponents:httpcore:jar:4.4.6 in the shaded jar.
[INFO] Excluding org.apache.directory.server:apacheds-kerberos-codec:jar:2.0.0-M15 from the shaded jar.
[INFO] Excluding org.apache.directory.server:apacheds-i18n:jar:2.0.0-M15 from the shaded jar.
[INFO] Excluding org.apache.directory.api:api-asn1-api:jar:1.0.0-M20 from the shaded jar.
[INFO] Excluding org.apache.directory.api:api-util:jar:1.0.0-M20 from the shaded jar.
[INFO] Including org.apache.curator:curator-framework:jar:4.2.0 in the shaded jar.
[INFO] Excluding com.jcraft:jsch:jar:0.1.42 from the shaded jar.
[INFO] Including org.apache.curator:curator-client:jar:4.2.0 in the shaded jar.
[INFO] Including org.apache.curator:curator-recipes:jar:4.2.0 in the shaded jar.
[INFO] Including com.google.code.findbugs:jsr305:jar:3.0.0 in the shaded jar.
[INFO] Excluding org.apache.htrace:htrace-core:jar:3.1.0-incubating from the shaded jar.
[INFO] Excluding org.apache.zookeeper:zookeeper:jar:3.5.5 from the shaded jar.
[INFO] Excluding org.apache.zookeeper:zookeeper-jute:jar:3.5.5 from the shaded jar.
[INFO] Excluding org.apache.yetus:audience-annotations:jar:0.5.0 from the shaded jar.
[INFO] Excluding org.apache.commons:commons-compress:jar:1.16.1 from the shaded jar.
[INFO] Including org.apache.hadoop:hadoop-hdfs:jar:2.7.3 in the shaded jar.
[INFO] Excluding commons-daemon:commons-daemon:jar:1.0.13 from the shaded jar.
[INFO] Including io.netty:netty:jar:3.6.2.Final in the shaded jar.
[INFO] Including io.netty:netty-all:jar:4.1.30.Final in the shaded jar.
[INFO] Excluding xerces:xercesImpl:jar:2.9.1 from the shaded jar.
[INFO] Excluding xml-apis:xml-apis:jar:1.3.04 from the shaded jar.
[INFO] Excluding org.fusesource.leveldbjni:leveldbjni-all:jar:1.8 from the shaded jar.
[INFO] Excluding org.objenesis:objenesis:jar:2.1 from the shaded jar.
Downloading from alluxio.artifacts: http://alluxio.artifacts.s3-website-us-east-1.amazonaws.com/release/io/netty/netty-codec-http2/maven-metadata.xml
[INFO] 
[INFO] >>> spotbugs-maven-plugin:3.1.12.2:check (default) > :spotbugs @ alluxio-core-client >>>
[INFO] 
[INFO] --- spotbugs-maven-plugin:3.1.12.2:spotbugs (spotbugs) @ alluxio-core-client ---
[INFO] 
[INFO] <<< spotbugs-maven-plugin:3.1.12.2:check (default) < :spotbugs @ alluxio-core-client <<<
[INFO] 
[INFO] 
[INFO] --- spotbugs-maven-plugin:3.1.12.2:check (default) @ alluxio-core-client ---
[INFO] 
[INFO] >>> maven-source-plugin:2.3:jar (attach-sources) > generate-sources @ alluxio-core-client >>>
[INFO] 
[INFO] --- maven-enforcer-plugin:1.4:enforce (enforce-maven) @ alluxio-core-client ---
[INFO] 
[INFO] --- maven-enforcer-plugin:1.4:enforce (enforce-versions) @ alluxio-core-client ---
[INFO] 
[INFO] --- maven-checkstyle-plugin:2.17:check (checkstyle) @ alluxio-core-client ---
Downloading from sonatype-nexus-snapshots: https://oss.sonatype.org/content/repositories/snapshots/io/netty/netty-codec-http2/maven-metadata.xml
Progress (1): 2.5 kB
                    
Downloaded from spring-releases: http://repo.spring.io/libs-release/io/netty/netty-codec-http2/maven-metadata.xml (2.5 kB at 7.2 kB/s)
[INFO] 
[INFO] >>> spotbugs-maven-plugin:3.1.12.2:check (default) > :spotbugs @ alluxio-core-server >>>
[INFO] 
[INFO] --- spotbugs-maven-plugin:3.1.12.2:spotbugs (spotbugs) @ alluxio-core-server ---
[INFO] 
[INFO] <<< spotbugs-maven-plugin:3.1.12.2:check (default) < :spotbugs @ alluxio-core-server <<<
[INFO] 
[INFO] 
[INFO] --- spotbugs-maven-plugin:3.1.12.2:check (default) @ alluxio-core-server ---
[INFO] 
[INFO] >>> maven-source-plugin:2.3:jar (attach-sources) > generate-sources @ alluxio-core-server >>>
[INFO] 
[INFO] --- maven-enforcer-plugin:1.4:enforce (enforce-maven) @ alluxio-core-server ---
[INFO] 
[INFO] --- maven-enforcer-plugin:1.4:enforce (enforce-versions) @ alluxio-core-server ---
[INFO] 
[INFO] --- maven-checkstyle-plugin:2.17:check (checkstyle) @ alluxio-core-server ---
Progress (1): 2.0 kB
                    
[INFO] Starting audit...
Audit done.
[INFO] 
[INFO] --- license-maven-plugin:2.9:check (default) @ alluxio-core-client ---
[INFO] Checking licenses...
[INFO] 
[INFO] <<< maven-source-plugin:2.3:jar (attach-sources) < generate-sources @ alluxio-core-client <<<
[INFO] 
[INFO] 
[INFO] --- maven-source-plugin:2.3:jar (attach-sources) @ alluxio-core-client ---
[INFO] 
[INFO] --- maven-javadoc-plugin:2.9:jar (attach-javadoc) @ alluxio-core-client ---
[INFO] Skipping javadoc generation
[INFO] 
[INFO] --- maven-install-plugin:2.4:install (default-install) @ alluxio-core-client ---
[INFO] Installing /usr/src/alluxio/core/client/pom.xml to /home/jenkins/.m2/repository/org/alluxio/alluxio-core-client/2.2.0-SNAPSHOT/alluxio-core-client-2.2.0-SNAPSHOT.pom
Downloaded from sonatype-nexus-snapshots: https://oss.sonatype.org/content/repositories/snapshots/io/netty/netty-codec-http2/maven-metadata.xml (2.0 kB at 3.6 kB/s)
[INFO] Starting audit...
Audit done.
[INFO] 
[INFO] --- license-maven-plugin:2.9:check (default) @ alluxio-core-server ---
[INFO] Checking licenses...
[INFO] 
[INFO] --- maven-clean-plugin:3.0.0:clean (default-clean) @ alluxio-core-transport ---
[INFO] 
[INFO] --- maven-enforcer-plugin:1.4:enforce (enforce-maven) @ alluxio-core-transport ---
[INFO] 
[INFO] <<< maven-source-plugin:2.3:jar (attach-sources) < generate-sources @ alluxio-core-server <<<
[INFO] 
[INFO] 
[INFO] --- maven-source-plugin:2.3:jar (attach-sources) @ alluxio-core-server ---
[INFO] 
[INFO] --- maven-javadoc-plugin:2.9:jar (attach-javadoc) @ alluxio-core-server ---
[INFO] Skipping javadoc generation
[INFO] 
[INFO] --- maven-install-plugin:2.4:install (default-install) @ alluxio-core-server ---
[INFO] Installing /usr/src/alluxio/core/server/pom.xml to /home/jenkins/.m2/repository/org/alluxio/alluxio-core-server/2.2.0-SNAPSHOT/alluxio-core-server-2.2.0-SNAPSHOT.pom
[INFO] 
[INFO] --- maven-enforcer-plugin:1.4:enforce (enforce-versions) @ alluxio-core-transport ---
[INFO] 
[INFO] --- maven-checkstyle-plugin:2.17:check (checkstyle) @ alluxio-core-transport ---
[INFO] 
[INFO] --- license-maven-plugin:2.9:check (default) @ alluxio-core-transport ---
[INFO] Checking licenses...
[INFO] 
[INFO] --- protobuf-maven-plugin:0.5.0:compile (default) @ alluxio-core-transport ---
[INFO] Skipping mojo execution
[INFO] 
[INFO] --- protobuf-maven-plugin:0.5.0:compile-custom (default) @ alluxio-core-transport ---
[INFO] Skipping mojo execution
[INFO] 
[INFO] --- maven-resources-plugin:2.7:resources (default-resources) @ alluxio-core-transport ---
[INFO] Using 'UTF-8' encoding to copy filtered resources.
[INFO] skip non existing resourceDirectory /usr/src/alluxio/core/transport/src/main/resources
[INFO] 
[INFO] --- maven-compiler-plugin:3.2:compile (default-compile) @ alluxio-core-transport ---
[INFO] Changes detected - recompiling the module!
[INFO] Compiling 678 source files to /usr/src/alluxio/core/transport/target/classes
[INFO] 
[INFO] > husky@3.1.0 install /usr/src/alluxio/webui/node_modules/husky
[INFO] > node husky install
[INFO] 
[INFO] husky > Setting up git hooks
[INFO] ENOENT: no such file or directory, mkdir 'webui/node_modules/husky/.git/hooks'
[INFO] husky > Failed to install
[INFO] 
[INFO] > husky@3.1.0 postinstall /usr/src/alluxio/webui/node_modules/husky
[INFO] > opencollective-postinstall || exit 0
[INFO] 
[INFO] Thank you for using husky!
[INFO] If you rely on this package, please consider supporting our open collective:
[INFO] > https://opencollective.com/husky/donate
[INFO] 
[INFO] added 703 packages from 372 contributors and audited 42334 packages in 16.697s
[INFO] found 0 vulnerabilities
[INFO] 
[INFO] 
[INFO] --- exec-maven-plugin:1.4.0:exec (Install npm dependencies for packages) @ alluxio-webui ---
lerna notice cli v3.13.4
lerna info Bootstrapping 3 packages
lerna info Installing external dependencies
lerna info hoist Installing hoisted dependencies into root
lerna info hoist Pruning hoisted dependencies
lerna info hoist Finished pruning hoisted dependencies
[INFO] /usr/src/alluxio/core/transport/src/main/java/alluxio/grpc/FileSystemMasterCommonPOptions.java: Some input files use or override a deprecated API.
[INFO] /usr/src/alluxio/core/transport/src/main/java/alluxio/grpc/FileSystemMasterCommonPOptions.java: Recompile with -Xlint:deprecation for details.
[INFO] 
[INFO] >>> spotbugs-maven-plugin:3.1.12.2:check (default) > :spotbugs @ alluxio-core-transport >>>
[INFO] 
[INFO] --- spotbugs-maven-plugin:3.1.12.2:spotbugs (spotbugs) @ alluxio-core-transport ---
[INFO] Replacing original artifact with shaded artifact.
[INFO] Replacing /usr/src/alluxio/shaded/hadoop/target/alluxio-shaded-hadoop-2.7.3.jar with /usr/src/alluxio/shaded/hadoop/target/alluxio-shaded-hadoop-2.7.3-shaded.jar
[INFO] Dependency-reduced POM written at: /usr/src/alluxio/shaded/hadoop/dependency-reduced-pom.xml
[INFO] 
[INFO] --- maven-install-plugin:2.4:install (default-install) @ alluxio-shaded-hadoop ---
[INFO] Installing /usr/src/alluxio/shaded/hadoop/target/alluxio-shaded-hadoop-2.7.3.jar to /home/jenkins/.m2/repository/org/alluxio/alluxio-shaded-hadoop/2.7.3/alluxio-shaded-hadoop-2.7.3.jar
[INFO] Installing /usr/src/alluxio/shaded/hadoop/dependency-reduced-pom.xml to /home/jenkins/.m2/repository/org/alluxio/alluxio-shaded-hadoop/2.7.3/alluxio-shaded-hadoop-2.7.3.pom
[INFO] 
[INFO] <<< spotbugs-maven-plugin:3.1.12.2:check (default) < :spotbugs @ alluxio-core-transport <<<
[INFO] 
[INFO] 
[INFO] --- spotbugs-maven-plugin:3.1.12.2:check (default) @ alluxio-core-transport ---
[INFO] 
[INFO] --- maven-resources-plugin:2.7:testResources (default-testResources) @ alluxio-core-transport ---
[INFO] Using 'UTF-8' encoding to copy filtered resources.
[INFO] skip non existing resourceDirectory /usr/src/alluxio/core/transport/src/test/resources
[INFO] 
[INFO] --- maven-compiler-plugin:3.2:testCompile (default-testCompile) @ alluxio-core-transport ---
[INFO] No sources to compile
[INFO] 
[INFO] --- maven-surefire-plugin:2.19.1:test (default-test) @ alluxio-core-transport ---
[INFO] No tests to run.
[INFO] 
[INFO] --- maven-jar-plugin:2.4:jar (default-jar) @ alluxio-core-transport ---
[INFO] Building jar: /usr/src/alluxio/core/transport/target/alluxio-core-transport-2.2.0-SNAPSHOT.jar
[INFO] 
[INFO] >>> maven-source-plugin:2.3:jar (attach-sources) > generate-sources @ alluxio-core-transport >>>
[INFO] 
[INFO] --- maven-enforcer-plugin:1.4:enforce (enforce-maven) @ alluxio-core-transport ---
[INFO] 
[INFO] --- maven-enforcer-plugin:1.4:enforce (enforce-versions) @ alluxio-core-transport ---
[INFO] 
[INFO] --- maven-checkstyle-plugin:2.17:check (checkstyle) @ alluxio-core-transport ---
[INFO] 
[INFO] --- license-maven-plugin:2.9:check (default) @ alluxio-core-transport ---
[INFO] Checking licenses...
[INFO] 
[INFO] --- protobuf-maven-plugin:0.5.0:compile (default) @ alluxio-core-transport ---
[INFO] Skipping mojo execution
[INFO] 
[INFO] --- protobuf-maven-plugin:0.5.0:compile-custom (default) @ alluxio-core-transport ---
[INFO] Skipping mojo execution
[INFO] 
[INFO] <<< maven-source-plugin:2.3:jar (attach-sources) < generate-sources @ alluxio-core-transport <<<
[INFO] 
[INFO] 
[INFO] --- maven-source-plugin:2.3:jar (attach-sources) @ alluxio-core-transport ---
[INFO] Building jar: /usr/src/alluxio/core/transport/target/alluxio-core-transport-2.2.0-SNAPSHOT-sources.jar
[INFO] 
[INFO] --- maven-javadoc-plugin:2.9:jar (attach-javadoc) @ alluxio-core-transport ---
[INFO] Skipping javadoc generation
[INFO] 
[INFO] --- maven-install-plugin:2.4:install (default-install) @ alluxio-core-transport ---
[INFO] Installing /usr/src/alluxio/core/transport/target/alluxio-core-transport-2.2.0-SNAPSHOT.jar to /home/jenkins/.m2/repository/org/alluxio/alluxio-core-transport/2.2.0-SNAPSHOT/alluxio-core-transport-2.2.0-SNAPSHOT.jar
[INFO] Installing /usr/src/alluxio/core/transport/pom.xml to /home/jenkins/.m2/repository/org/alluxio/alluxio-core-transport/2.2.0-SNAPSHOT/alluxio-core-transport-2.2.0-SNAPSHOT.pom
[INFO] Installing /usr/src/alluxio/core/transport/target/alluxio-core-transport-2.2.0-SNAPSHOT-sources.jar to /home/jenkins/.m2/repository/org/alluxio/alluxio-core-transport/2.2.0-SNAPSHOT/alluxio-core-transport-2.2.0-SNAPSHOT-sources.jar
[INFO] 
[INFO] 
[INFO] -------------------< org.alluxio:alluxio-core-base >--------------------
[INFO] Building Alluxio Core - Base module 2.2.0-SNAPSHOT               [15/54]
[INFO] -------------------< org.alluxio:alluxio-table-base >-------------------
[INFO] --------------------------------[ jar ]---------------------------------
[INFO] Building Alluxio Table - Base Module 2.2.0-SNAPSHOT              [16/54]
[INFO] --------------------------------[ jar ]---------------------------------
[INFO] 
[INFO] --- maven-clean-plugin:3.0.0:clean (default-clean) @ alluxio-table-base ---
[INFO] 
[INFO] --- maven-enforcer-plugin:1.4:enforce (enforce-maven) @ alluxio-table-base ---
[INFO] 
[INFO] --- maven-enforcer-plugin:1.4:enforce (enforce-versions) @ alluxio-table-base ---
[INFO] 
[INFO] --- maven-checkstyle-plugin:2.17:check (checkstyle) @ alluxio-table-base ---
[INFO] 
[INFO] --- maven-clean-plugin:3.0.0:clean (default-clean) @ alluxio-core-base ---
[INFO] 
[INFO] --- maven-enforcer-plugin:1.4:enforce (enforce-maven) @ alluxio-core-base ---
[INFO] 
[INFO] --- maven-enforcer-plugin:1.4:enforce (enforce-versions) @ alluxio-core-base ---
[INFO] 
[INFO] --- maven-checkstyle-plugin:2.17:check (checkstyle) @ alluxio-core-base ---
[INFO] Starting audit...
Audit done.
[INFO] 
[INFO] --- license-maven-plugin:2.9:check (default) @ alluxio-table-base ---
[INFO] Checking licenses...
[INFO] 
[INFO] --- maven-resources-plugin:2.7:resources (default-resources) @ alluxio-table-base ---
[INFO] Using 'UTF-8' encoding to copy filtered resources.
[INFO] skip non existing resourceDirectory /usr/src/alluxio/table/base/src/main/resources
[INFO] 
[INFO] --- maven-compiler-plugin:3.2:compile (default-compile) @ alluxio-table-base ---
[INFO] Changes detected - recompiling the module!
[INFO] Compiling 1 source file to /usr/src/alluxio/table/base/target/classes
[INFO] 
[INFO] >>> spotbugs-maven-plugin:3.1.12.2:check (default) > :spotbugs @ alluxio-table-base >>>
[INFO] 
[INFO] --- spotbugs-maven-plugin:3.1.12.2:spotbugs (spotbugs) @ alluxio-table-base ---
[INFO] Fork Value is true
[INFO] Starting audit...
Audit done.
[INFO] 
[INFO] --- license-maven-plugin:2.9:check (default) @ alluxio-core-base ---
[INFO] Checking licenses...
[INFO] 
[INFO] --- maven-resources-plugin:2.7:resources (default-resources) @ alluxio-core-base ---
[INFO] Using 'UTF-8' encoding to copy filtered resources.
[INFO] skip non existing resourceDirectory /usr/src/alluxio/core/base/src/main/resources
[INFO] 
[INFO] --- maven-compiler-plugin:3.2:compile (default-compile) @ alluxio-core-base ---
[INFO] Changes detected - recompiling the module!
[INFO] Compiling 96 source files to /usr/src/alluxio/core/base/target/classes
[INFO] /usr/src/alluxio/core/base/src/main/java/alluxio/collections/ConcurrentIdentityHashMap.java: Some input files use unchecked or unsafe operations.
[INFO] /usr/src/alluxio/core/base/src/main/java/alluxio/collections/ConcurrentIdentityHashMap.java: Recompile with -Xlint:unchecked for details.
[INFO] 
[INFO] >>> spotbugs-maven-plugin:3.1.12.2:check (default) > :spotbugs @ alluxio-core-base >>>
[INFO] 
[INFO] --- spotbugs-maven-plugin:3.1.12.2:spotbugs (spotbugs) @ alluxio-core-base ---
[INFO] Fork Value is true
[INFO] Done SpotBugs Analysis....
[INFO] 
[INFO] <<< spotbugs-maven-plugin:3.1.12.2:check (default) < :spotbugs @ alluxio-table-base <<<
[INFO] 
[INFO] 
[INFO] --- spotbugs-maven-plugin:3.1.12.2:check (default) @ alluxio-table-base ---
[INFO] BugInstance size is 0
[INFO] Error size is 0
[INFO] No errors/warnings found
[INFO] 
[INFO] --- maven-resources-plugin:2.7:testResources (default-testResources) @ alluxio-table-base ---
[INFO] Using 'UTF-8' encoding to copy filtered resources.
[INFO] skip non existing resourceDirectory /usr/src/alluxio/table/base/src/test/resources
[INFO] 
[INFO] --- maven-compiler-plugin:3.2:testCompile (default-testCompile) @ alluxio-table-base ---
[INFO] No sources to compile
[INFO] 
[INFO] --- maven-surefire-plugin:2.19.1:test (default-test) @ alluxio-table-base ---
[INFO] No tests to run.
[INFO] 
[INFO] --- maven-jar-plugin:2.4:jar (default-jar) @ alluxio-table-base ---
[INFO] Building jar: /usr/src/alluxio/table/base/target/alluxio-table-base-2.2.0-SNAPSHOT.jar
[INFO] 
[INFO] >>> maven-source-plugin:2.3:jar (attach-sources) > generate-sources @ alluxio-table-base >>>
[INFO] 
[INFO] --- maven-enforcer-plugin:1.4:enforce (enforce-maven) @ alluxio-table-base ---
[INFO] 
[INFO] --- maven-enforcer-plugin:1.4:enforce (enforce-versions) @ alluxio-table-base ---
[INFO] 
[INFO] --- maven-checkstyle-plugin:2.17:check (checkstyle) @ alluxio-table-base ---
[INFO] Starting audit...
Audit done.
[INFO] 
[INFO] --- license-maven-plugin:2.9:check (default) @ alluxio-table-base ---
[INFO] Checking licenses...
[INFO] 
[INFO] <<< maven-source-plugin:2.3:jar (attach-sources) < generate-sources @ alluxio-table-base <<<
[INFO] 
[INFO] 
[INFO] --- maven-source-plugin:2.3:jar (attach-sources) @ alluxio-table-base ---
[INFO] Building jar: /usr/src/alluxio/table/base/target/alluxio-table-base-2.2.0-SNAPSHOT-sources.jar
[INFO] 
[INFO] --- maven-javadoc-plugin:2.9:jar (attach-javadoc) @ alluxio-table-base ---
[INFO] Skipping javadoc generation
[INFO] 
[INFO] --- maven-install-plugin:2.4:install (default-install) @ alluxio-table-base ---
[INFO] Installing /usr/src/alluxio/table/base/target/alluxio-table-base-2.2.0-SNAPSHOT.jar to /home/jenkins/.m2/repository/org/alluxio/alluxio-table-base/2.2.0-SNAPSHOT/alluxio-table-base-2.2.0-SNAPSHOT.jar
[INFO] Installing /usr/src/alluxio/table/base/pom.xml to /home/jenkins/.m2/repository/org/alluxio/alluxio-table-base/2.2.0-SNAPSHOT/alluxio-table-base-2.2.0-SNAPSHOT.pom
[INFO] Installing /usr/src/alluxio/table/base/target/alluxio-table-base-2.2.0-SNAPSHOT-sources.jar to /home/jenkins/.m2/repository/org/alluxio/alluxio-table-base/2.2.0-SNAPSHOT/alluxio-table-base-2.2.0-SNAPSHOT-sources.jar
[INFO] Done SpotBugs Analysis....
[INFO] 
[INFO] <<< spotbugs-maven-plugin:3.1.12.2:check (default) < :spotbugs @ alluxio-core-base <<<
[INFO] 
[INFO] 
[INFO] --- spotbugs-maven-plugin:3.1.12.2:check (default) @ alluxio-core-base ---
[INFO] BugInstance size is 0
[INFO] Error size is 0
[INFO] No errors/warnings found
[INFO] 
[INFO] --- maven-resources-plugin:2.7:testResources (default-testResources) @ alluxio-core-base ---
[INFO] Using 'UTF-8' encoding to copy filtered resources.
[INFO] skip non existing resourceDirectory /usr/src/alluxio/core/base/src/test/resources
[INFO] 
[INFO] --- maven-compiler-plugin:3.2:testCompile (default-testCompile) @ alluxio-core-base ---
[INFO] Changes detected - recompiling the module!
[INFO] Compiling 6 source files to /usr/src/alluxio/core/base/target/test-classes
[INFO] /usr/src/alluxio/core/base/src/test/java/alluxio/collections/IndexedSetConcurrencyTest.java: Some input files use unchecked or unsafe operations.
[INFO] /usr/src/alluxio/core/base/src/test/java/alluxio/collections/IndexedSetConcurrencyTest.java: Recompile with -Xlint:unchecked for details.
[INFO] 
[INFO] --- maven-surefire-plugin:2.19.1:test (default-test) @ alluxio-core-base ---

-------------------------------------------------------
 T E S T S
-------------------------------------------------------
Running alluxio.collections.DirectedAcyclicGraphTest
Running alluxio.collections.IndexedSetTest
Running alluxio.collections.IndexedSetConcurrencyTest
Running alluxio.collections.ConcurrentIdentityHashMapTest
Tests run: 2, Failures: 0, Errors: 0, Skipped: 0, Time elapsed: 0.083 sec - in alluxio.collections.DirectedAcyclicGraphTest
Tests run: 13, Failures: 0, Errors: 0, Skipped: 0, Time elapsed: 0.113 sec - in alluxio.collections.IndexedSetTest
Tests run: 7, Failures: 0, Errors: 0, Skipped: 0, Time elapsed: 0.156 sec - in alluxio.collections.ConcurrentIdentityHashMapTest
Running alluxio.collections.PairTest
Running alluxio.collections.PrefixListTest
Tests run: 1, Failures: 0, Errors: 0, Skipped: 0, Time elapsed: 0.072 sec - in alluxio.collections.PairTest
Tests run: 4, Failures: 0, Errors: 0, Skipped: 0, Time elapsed: 0.09 sec - in alluxio.collections.PrefixListTest
lerna info hoist Finished bootstrapping root
lerna info Symlinking packages and binaries
lerna success Bootstrapped 3 packages
[INFO] 
[INFO] --- exec-maven-plugin:1.4.0:exec (Build all packages) @ alluxio-webui ---
lerna notice cli v3.13.0
lerna info Executing command in 3 packages: "npm run build --production  --no-save --no-package-lock --no-shrinkwrap"
Tests run: 4, Failures: 0, Errors: 0, Skipped: 0, Time elapsed: 31.637 sec - in alluxio.collections.IndexedSetConcurrencyTest

Results :

Tests run: 31, Failures: 0, Errors: 0, Skipped: 0

[INFO] 
[INFO] --- maven-jar-plugin:2.4:jar (default-jar) @ alluxio-core-base ---
[INFO] Building jar: /usr/src/alluxio/core/base/target/alluxio-core-base-2.2.0-SNAPSHOT.jar
[INFO] 
[INFO] >>> maven-source-plugin:2.3:jar (attach-sources) > generate-sources @ alluxio-core-base >>>
[INFO] 
[INFO] --- maven-enforcer-plugin:1.4:enforce (enforce-maven) @ alluxio-core-base ---
[INFO] 
[INFO] --- maven-enforcer-plugin:1.4:enforce (enforce-versions) @ alluxio-core-base ---
[INFO] 
[INFO] --- maven-checkstyle-plugin:2.17:check (checkstyle) @ alluxio-core-base ---
[INFO] Starting audit...
Audit done.
[INFO] 
[INFO] --- license-maven-plugin:2.9:check (default) @ alluxio-core-base ---
[INFO] Checking licenses...
[INFO] 
[INFO] <<< maven-source-plugin:2.3:jar (attach-sources) < generate-sources @ alluxio-core-base <<<
[INFO] 
[INFO] 
[INFO] --- maven-source-plugin:2.3:jar (attach-sources) @ alluxio-core-base ---
[INFO] Building jar: /usr/src/alluxio/core/base/target/alluxio-core-base-2.2.0-SNAPSHOT-sources.jar
[INFO] 
[INFO] --- maven-javadoc-plugin:2.9:jar (attach-javadoc) @ alluxio-core-base ---
[INFO] Skipping javadoc generation
[INFO] 
[INFO] --- maven-install-plugin:2.4:install (default-install) @ alluxio-core-base ---
[INFO] Installing /usr/src/alluxio/core/base/target/alluxio-core-base-2.2.0-SNAPSHOT.jar to /home/jenkins/.m2/repository/org/alluxio/alluxio-core-base/2.2.0-SNAPSHOT/alluxio-core-base-2.2.0-SNAPSHOT.jar
[INFO] Installing /usr/src/alluxio/core/base/pom.xml to /home/jenkins/.m2/repository/org/alluxio/alluxio-core-base/2.2.0-SNAPSHOT/alluxio-core-base-2.2.0-SNAPSHOT.pom
[INFO] Installing /usr/src/alluxio/core/base/target/alluxio-core-base-2.2.0-SNAPSHOT-sources.jar to /home/jenkins/.m2/repository/org/alluxio/alluxio-core-base/2.2.0-SNAPSHOT/alluxio-core-base-2.2.0-SNAPSHOT-sources.jar
[INFO] 
[INFO] ------------------< org.alluxio:alluxio-core-common >-------------------
[INFO] Building Alluxio Core - Common Utilities 2.2.0-SNAPSHOT          [17/54]
[INFO] --------------------------------[ jar ]---------------------------------
[INFO] 
[INFO] --- maven-clean-plugin:3.0.0:clean (default-clean) @ alluxio-core-common ---
[INFO] 
[INFO] --- maven-enforcer-plugin:1.4:enforce (enforce-maven) @ alluxio-core-common ---
[INFO] 
[INFO] --- maven-enforcer-plugin:1.4:enforce (enforce-versions) @ alluxio-core-common ---
[INFO] 
[INFO] --- maven-checkstyle-plugin:2.17:check (checkstyle) @ alluxio-core-common ---
[INFO] Starting audit...
Audit done.
[INFO] 
[INFO] --- license-maven-plugin:2.9:check (default) @ alluxio-core-common ---
[INFO] Checking licenses...
[INFO] 
[INFO] --- buildnumber-maven-plugin:1.4:create-metadata (default) @ alluxio-core-common ---
[INFO] Executing: /bin/sh -c cd '/usr/src/alluxio/core/common' && 'git' 'rev-parse' '--verify' 'HEAD'
[INFO] Working directory: /usr/src/alluxio/core/common
[INFO] 
[INFO] --- properties-maven-plugin:1.0.0:read-project-properties (default) @ alluxio-core-common ---
[INFO] 
[INFO] --- templating-maven-plugin:1.0.0:filter-sources (filter-src) @ alluxio-core-common ---
[INFO] Coping files with filtering to temporary directory.
[INFO] Using 'UTF-8' encoding to copy filtered resources.
[INFO] Copying 1 resource
[INFO] Copied 1 files to output directory: /usr/src/alluxio/core/common/target/generated-sources/java-templates
[INFO] Source directory: /usr/src/alluxio/core/common/target/generated-sources/java-templates added.
[INFO] 
[INFO] --- maven-resources-plugin:2.7:resources (default-resources) @ alluxio-core-common ---
[INFO] Using 'UTF-8' encoding to copy filtered resources.
[INFO] skip non existing resourceDirectory /usr/src/alluxio/core/common/src/main/resources
[INFO] 
[INFO] --- maven-compiler-plugin:3.2:compile (default-compile) @ alluxio-core-common ---
[INFO] Changes detected - recompiling the module!
[INFO] Compiling 286 source files to /usr/src/alluxio/core/common/target/classes
[WARNING] /usr/src/alluxio/core/common/src/main/java/alluxio/concurrent/jsr/UnsafeAccess.java:[8,16] sun.misc.Unsafe is internal proprietary API and may be removed in a future release
[WARNING] /usr/src/alluxio/core/common/src/main/java/alluxio/concurrent/jsr/ForkJoinPool.java:[559,32] sun.misc.Unsafe is internal proprietary API and may be removed in a future release
[WARNING] /usr/src/alluxio/core/common/src/main/java/alluxio/concurrent/jsr/ForkJoinPool.java:[2523,34] sun.misc.Unsafe is internal proprietary API and may be removed in a future release
[WARNING] /usr/src/alluxio/core/common/src/main/java/alluxio/concurrent/jsr/ForkJoinTask.java:[205,32] sun.misc.Unsafe is internal proprietary API and may be removed in a future release
[WARNING] /usr/src/alluxio/core/common/src/main/java/alluxio/concurrent/jsr/CountedCompleter.java:[388,32] sun.misc.Unsafe is internal proprietary API and may be removed in a future release
[WARNING] /usr/src/alluxio/core/common/src/main/java/alluxio/concurrent/jsr/CompletableFuture.java:[213,32] sun.misc.Unsafe is internal proprietary API and may be removed in a future release
[WARNING] /usr/src/alluxio/core/common/src/main/java/alluxio/concurrent/jsr/TLRandom.java:[31,32] sun.misc.Unsafe is internal proprietary API and may be removed in a future release
[WARNING] /usr/src/alluxio/core/common/src/main/java/alluxio/concurrent/jsr/UnsafeAccess.java:[12,16] sun.misc.Unsafe is internal proprietary API and may be removed in a future release
[WARNING] /usr/src/alluxio/core/common/src/main/java/alluxio/concurrent/jsr/UnsafeAccess.java:[15,21] sun.misc.Unsafe is internal proprietary API and may be removed in a future release
[WARNING] /usr/src/alluxio/core/common/src/main/java/alluxio/concurrent/jsr/UnsafeAccess.java:[17,17] sun.misc.Unsafe is internal proprietary API and may be removed in a future release
[INFO] /usr/src/alluxio/core/common/src/main/java/alluxio/underfs/UnderFileSystemWithLogging.java: Some input files use or override a deprecated API.
[INFO] /usr/src/alluxio/core/common/src/main/java/alluxio/underfs/UnderFileSystemWithLogging.java: Recompile with -Xlint:deprecation for details.
[INFO] /usr/src/alluxio/core/common/src/main/java/alluxio/util/JvmPauseMonitor.java: Some input files use unchecked or unsafe operations.
[INFO] /usr/src/alluxio/core/common/src/main/java/alluxio/util/JvmPauseMonitor.java: Recompile with -Xlint:unchecked for details.
[INFO] 
[INFO] >>> spotbugs-maven-plugin:3.1.12.2:check (default) > :spotbugs @ alluxio-core-common >>>
[INFO] 
[INFO] --- spotbugs-maven-plugin:3.1.12.2:spotbugs (spotbugs) @ alluxio-core-common ---
[INFO] Fork Value is true
lerna info run Ran npm script 'build' in '@alluxio/common-ui' in 26.8s:

> @alluxio/common-ui@1.0.0 build /usr/src/alluxio/webui/common
> NODE_ENV=production && npm-run-all --parallel build-css build-js


> @alluxio/common-ui@1.0.0 build-css /usr/src/alluxio/webui/common
> node-sass-chokidar --importer=../node_modules/node-sass-tilde-importer --include-path ./src --include-path ./node_modules src/ -o src/


> @alluxio/common-ui@1.0.0 build-js /usr/src/alluxio/webui/common
> react-scripts build --production

Rendering Complete, saving .css file...
Wrote CSS to /usr/src/alluxio/webui/common/src/components/Footer/Footer.css
Rendering Complete, saving .css file...
Wrote CSS to /usr/src/alluxio/webui/common/src/components/Header/Header.css
Rendering Complete, saving .css file...
Wrote CSS to /usr/src/alluxio/webui/common/src/components/LineGraph/LineGraph.css
Rendering Complete, saving .css file...
Wrote CSS to /usr/src/alluxio/webui/common/src/components/LoadingMessage/LoadingMessage.css
Rendering Complete, saving .css file...
Wrote CSS to /usr/src/alluxio/webui/common/src/components/Paginator/Paginator.css
Rendering Complete, saving .css file...
Wrote CSS to /usr/src/alluxio/webui/common/src/index.css
Creating an optimized production build...
Compiled successfully.

File sizes after gzip:

  67.26 KB  build/static/js/2.2c9207d4.chunk.js
  23.15 KB  build/static/css/main.1c9b4118.chunk.css
  1.78 KB   build/static/css/2.9273f0ca.chunk.css
  764 B     build/static/js/runtime~main.42ac5946.js
  550 B     build/static/js/main.45ace75a.chunk.js

The project was built assuming it is hosted at the server root.
You can control this with the homepage field in your package.json.
For example, add this to build it for GitHub Pages:

  "homepage" : "http://myname.github.io/myapp",

The build folder is ready to be deployed.
You may serve it with a static server:

  npm install -g serve
  serve -s build

Find out more about deployment here:

  https://bit.ly/CRA-deploy

[INFO] Done SpotBugs Analysis....
[INFO] 
[INFO] <<< spotbugs-maven-plugin:3.1.12.2:check (default) < :spotbugs @ alluxio-core-common <<<
[INFO] 
[INFO] 
[INFO] --- spotbugs-maven-plugin:3.1.12.2:check (default) @ alluxio-core-common ---
[INFO] BugInstance size is 0
[INFO] Error size is 0
[INFO] No errors/warnings found
[INFO] 
[INFO] --- maven-resources-plugin:2.7:testResources (default-testResources) @ alluxio-core-common ---
[INFO] Using 'UTF-8' encoding to copy filtered resources.
[INFO] Copying 1 resource
[INFO] 
[INFO] --- maven-compiler-plugin:3.2:testCompile (default-testCompile) @ alluxio-core-common ---
[INFO] Changes detected - recompiling the module!
[INFO] Compiling 140 source files to /usr/src/alluxio/core/common/target/test-classes
[INFO] /usr/src/alluxio/core/common/src/test/java/alluxio/conf/InstancedConfigurationTest.java: Some input files use or override a deprecated API.
[INFO] /usr/src/alluxio/core/common/src/test/java/alluxio/conf/InstancedConfigurationTest.java: Recompile with -Xlint:deprecation for details.
[INFO] /usr/src/alluxio/core/common/src/test/java/alluxio/util/io/PathUtilsTest.java: Some input files use unchecked or unsafe operations.
[INFO] /usr/src/alluxio/core/common/src/test/java/alluxio/util/io/PathUtilsTest.java: Recompile with -Xlint:unchecked for details.
[INFO] 
[INFO] --- maven-surefire-plugin:2.19.1:test (default-test) @ alluxio-core-common ---

-------------------------------------------------------
 T E S T S
-------------------------------------------------------
Running alluxio.AlluxioURITest
Running alluxio.AbstractClientTest
Running alluxio.AuthenticatedUserRuleTest
Running alluxio.AuthenticatedClientUserResourceTest
Tests run: 44, Failures: 0, Errors: 0, Skipped: 3, Time elapsed: 0.3 sec - in alluxio.AlluxioURITest
Tests run: 1, Failures: 0, Errors: 0, Skipped: 0, Time elapsed: 0.313 sec - in alluxio.AuthenticatedClientUserResourceTest
Tests run: 2, Failures: 0, Errors: 0, Skipped: 0, Time elapsed: 0.331 sec - in alluxio.AuthenticatedUserRuleTest
Tests run: 5, Failures: 0, Errors: 0, Skipped: 0, Time elapsed: 0.58 sec - in alluxio.AbstractClientTest
Running alluxio.ConfigurationRuleTest
Running alluxio.SystemOutRuleTest
Running alluxio.SystemErrRuleTest
Tests run: 1, Failures: 0, Errors: 0, Skipped: 0, Time elapsed: 0.139 sec - in alluxio.SystemOutRuleTest
Tests run: 1, Failures: 0, Errors: 0, Skipped: 0, Time elapsed: 0.126 sec - in alluxio.SystemErrRuleTest
Running alluxio.TestLoggerRuleTest
Tests run: 2, Failures: 0, Errors: 0, Skipped: 0, Time elapsed: 0.327 sec - in alluxio.ConfigurationRuleTest
Tests run: 2, Failures: 0, Errors: 0, Skipped: 0, Time elapsed: 0.139 sec - in alluxio.TestLoggerRuleTest
Running alluxio.UnderFileSystemFactoryRegistryRuleTest
Running alluxio.cli.AbstractShellTest
Running alluxio.cli.CommandTest
Running alluxio.client.file.URIStatusTest
Tests run: 2, Failures: 0, Errors: 0, Skipped: 0, Time elapsed: 0.121 sec - in alluxio.cli.CommandTest
Tests run: 3, Failures: 0, Errors: 0, Skipped: 0, Time elapsed: 0.303 sec - in alluxio.client.file.URIStatusTest
Tests run: 1, Failures: 0, Errors: 0, Skipped: 0, Time elapsed: 0.463 sec - in alluxio.UnderFileSystemFactoryRegistryRuleTest
Tests run: 4, Failures: 0, Errors: 0, Skipped: 0, Time elapsed: 0.561 sec - in alluxio.cli.AbstractShellTest
Running alluxio.collections.LockPoolTest
Tests run: 3, Failures: 0, Errors: 0, Skipped: 0, Time elapsed: 0.23 sec - in alluxio.collections.LockPoolTest
Running alluxio.conf.AlluxioPropertiesTest
Running alluxio.concurrent.CountingLatchTest
Running alluxio.conf.InstancedConfigurationTest
Tests run: 11, Failures: 0, Errors: 0, Skipped: 0, Time elapsed: 0.364 sec - in alluxio.conf.AlluxioPropertiesTest
Running alluxio.conf.PropertyKeyTest
Tests run: 24, Failures: 0, Errors: 0, Skipped: 0, Time elapsed: 0.336 sec - in alluxio.conf.PropertyKeyTest
Running alluxio.conf.SourceTest
Tests run: 96, Failures: 0, Errors: 0, Skipped: 0, Time elapsed: 0.847 sec - in alluxio.conf.InstancedConfigurationTest
Tests run: 2, Failures: 0, Errors: 0, Skipped: 0, Time elapsed: 0.092 sec - in alluxio.conf.SourceTest
Running alluxio.conf.path.PrefixPathMatcherTest
Running alluxio.conf.path.TrieNodeTest
Running alluxio.grpc.GrpcManagedChannelPoolTest
Tests run: 4, Failures: 0, Errors: 0, Skipped: 0, Time elapsed: 0.167 sec - in alluxio.conf.path.PrefixPathMatcherTest
Tests run: 6, Failures: 0, Errors: 0, Skipped: 0, Time elapsed: 0.15 sec - in alluxio.conf.path.TrieNodeTest
Running alluxio.grpc.ReadResponseMarshallerTest
Running alluxio.heartbeat.HeartbeatContextTest
Tests run: 2, Failures: 0, Errors: 0, Skipped: 0, Time elapsed: 0.097 sec - in alluxio.heartbeat.HeartbeatContextTest
Tests run: 4, Failures: 0, Errors: 0, Skipped: 0, Time elapsed: 0.272 sec - in alluxio.grpc.ReadResponseMarshallerTest
Tests run: 5, Failures: 0, Errors: 0, Skipped: 0, Time elapsed: 1.067 sec - in alluxio.grpc.GrpcManagedChannelPoolTest
Running alluxio.heartbeat.HeartbeatThreadTest
Running alluxio.heartbeat.SleepingTimerTest
Running alluxio.master.MasterInquireClientTest
Tests run: 3, Failures: 0, Errors: 0, Skipped: 0, Time elapsed: 0.243 sec - in alluxio.heartbeat.SleepingTimerTest
Tests run: 3, Failures: 0, Errors: 0, Skipped: 0, Time elapsed: 0.335 sec - in alluxio.master.MasterInquireClientTest
Running alluxio.master.PollingMasterInquireClientTest
Running alluxio.master.PortReservationRuleTest
Tests run: 2, Failures: 0, Errors: 0, Skipped: 0, Time elapsed: 1.167 sec - in alluxio.heartbeat.HeartbeatThreadTest
Tests run: 2, Failures: 0, Errors: 0, Skipped: 0, Time elapsed: 0.15 sec - in alluxio.master.PortReservationRuleTest
Running alluxio.master.ZkMasterInquireClientTest
Running alluxio.master.block.BlockIdTest
Tests run: 1, Failures: 0, Errors: 0, Skipped: 0, Time elapsed: 0.973 sec - in alluxio.master.PollingMasterInquireClientTest
Tests run: 5, Failures: 0, Errors: 0, Skipped: 0, Time elapsed: 0.073 sec - in alluxio.master.block.BlockIdTest
Tests run: 8, Failures: 0, Errors: 0, Skipped: 0, Time elapsed: 5.16 sec - in alluxio.concurrent.CountingLatchTest
Running alluxio.metrics.MetricTest
Running alluxio.metrics.MetricsConfigTest
Running alluxio.metrics.MetricsSystemTest
Tests run: 2, Failures: 0, Errors: 0, Skipped: 0, Time elapsed: 0.167 sec - in alluxio.metrics.MetricsConfigTest
Tests run: 3, Failures: 0, Errors: 0, Skipped: 0, Time elapsed: 0.329 sec - in alluxio.metrics.MetricTest
Tests run: 4, Failures: 0, Errors: 0, Skipped: 0, Time elapsed: 0.509 sec - in alluxio.metrics.MetricsSystemTest
Running alluxio.network.TieredIdentityFactoryTest
Running alluxio.refresh.TimeoutRefreshTest
Running alluxio.resource.DynamicResourcePoolTest
Tests run: 10, Failures: 0, Errors: 0, Skipped: 0, Time elapsed: 0.474 sec - in alluxio.network.TieredIdentityFactoryTest
Tests run: 1, Failures: 0, Errors: 0, Skipped: 0, Time elapsed: 0.859 sec - in alluxio.refresh.TimeoutRefreshTest
Running alluxio.resource.LockResourceTest
Tests run: 2, Failures: 0, Errors: 0, Skipped: 0, Time elapsed: 0.094 sec - in alluxio.resource.LockResourceTest
Running alluxio.resource.ResourcePoolTest
Running alluxio.retry.CountingRetryTest
Tests run: 1, Failures: 0, Errors: 0, Skipped: 0, Time elapsed: 0.071 sec - in alluxio.retry.CountingRetryTest
Running alluxio.retry.ExponentialBackoffRetryTest
Tests run: 1, Failures: 0, Errors: 0, Skipped: 0, Time elapsed: 0.097 sec - in alluxio.retry.ExponentialBackoffRetryTest
Running alluxio.retry.ExponentialTimeBoundedRetryTest
Tests run: 1, Failures: 0, Errors: 0, Skipped: 0, Time elapsed: 0.266 sec - in alluxio.retry.ExponentialTimeBoundedRetryTest
Running alluxio.retry.RetryUtilsTest
Tests run: 2, Failures: 0, Errors: 0, Skipped: 0, Time elapsed: 0.233 sec - in alluxio.retry.RetryUtilsTest
Running alluxio.retry.TimeoutRetryTest
Tests run: 1, Failures: 0, Errors: 0, Skipped: 0, Time elapsed: 0.207 sec - in alluxio.retry.TimeoutRetryTest
Running alluxio.security.UserTest
Tests run: 2, Failures: 0, Errors: 0, Skipped: 0, Time elapsed: 0.069 sec - in alluxio.security.UserTest
Running alluxio.security.authentication.CustomAuthenticationProviderTest
Tests run: 3, Failures: 0, Errors: 0, Skipped: 0, Time elapsed: 5.168 sec - in alluxio.resource.ResourcePoolTest
Tests run: 3, Failures: 0, Errors: 0, Skipped: 0, Time elapsed: 0.188 sec - in alluxio.security.authentication.CustomAuthenticationProviderTest
Running alluxio.security.authentication.GrpcSecurityTest
Running alluxio.security.authentication.PlainSaslClientCallbackHandlerTest
Tests run: 5, Failures: 0, Errors: 0, Skipped: 0, Time elapsed: 0.106 sec - in alluxio.security.authentication.PlainSaslClientCallbackHandlerTest
Running alluxio.security.authentication.PlainSaslServerCallbackHandlerTest
Tests run: 7, Failures: 0, Errors: 0, Skipped: 0, Time elapsed: 8.244 sec - in alluxio.resource.DynamicResourcePoolTest
Tests run: 3, Failures: 0, Errors: 0, Skipped: 0, Time elapsed: 0.39 sec - in alluxio.security.authentication.PlainSaslServerCallbackHandlerTest
Running alluxio.security.authentication.PlainSaslServerProviderTest
Running alluxio.security.authentication.PlainSaslServerTest
Tests run: 9, Failures: 0, Errors: 0, Skipped: 0, Time elapsed: 1.97 sec - in alluxio.security.authentication.GrpcSecurityTest
Tests run: 2, Failures: 0, Errors: 0, Skipped: 0, Time elapsed: 0.136 sec - in alluxio.security.authentication.PlainSaslServerProviderTest
Tests run: 5, Failures: 0, Errors: 0, Skipped: 0, Time elapsed: 0.091 sec - in alluxio.security.authentication.PlainSaslServerTest
Running alluxio.security.authentication.SaslHandlersTest
Running alluxio.security.authentication.SimpleAuthenticationProviderTest
Running alluxio.security.authorization.AccessControlListTest
Tests run: 1, Failures: 0, Errors: 0, Skipped: 0, Time elapsed: 0.091 sec - in alluxio.security.authentication.SimpleAuthenticationProviderTest
Tests run: 8, Failures: 0, Errors: 0, Skipped: 0, Time elapsed: 0.131 sec - in alluxio.security.authorization.AccessControlListTest
Tests run: 5, Failures: 0, Errors: 0, Skipped: 0, Time elapsed: 0.436 sec - in alluxio.security.authentication.SaslHandlersTest
Running alluxio.security.authorization.AclActionsTest
Tests run: 5, Failures: 0, Errors: 0, Skipped: 0, Time elapsed: 0.085 sec - in alluxio.security.authorization.AclActionsTest
Running alluxio.security.authorization.AclEntryTest
Tests run: 8, Failures: 0, Errors: 0, Skipped: 0, Time elapsed: 0.151 sec - in alluxio.security.authorization.AclEntryTest
Running alluxio.security.authorization.ModeBitsTest
Tests run: 6, Failures: 0, Errors: 0, Skipped: 0, Time elapsed: 0.069 sec - in alluxio.security.authorization.ModeBitsTest
Running alluxio.security.authorization.ModeParserTest
Tests run: 11, Failures: 0, Errors: 0, Skipped: 0, Time elapsed: 0.115 sec - in alluxio.security.authorization.ModeParserTest
Running alluxio.security.authorization.ModeTest
Running alluxio.security.group.GroupMappingServiceTest
Tests run: 14, Failures: 0, Errors: 0, Skipped: 0, Time elapsed: 0.397 sec - in alluxio.security.authorization.ModeTest
Tests run: 1, Failures: 0, Errors: 0, Skipped: 0, Time elapsed: 0.37 sec - in alluxio.security.group.GroupMappingServiceTest
Running alluxio.security.group.IdentityUserGroupsMappingTest
Tests run: 1, Failures: 0, Errors: 0, Skipped: 0, Time elapsed: 0.071 sec - in alluxio.security.group.IdentityUserGroupsMappingTest
Running alluxio.security.group.ShellBasedUnixGroupsMappingTest
Running alluxio.security.login.LoginModuleTest
Tests run: 2, Failures: 0, Errors: 0, Skipped: 0, Time elapsed: 0.095 sec - in alluxio.security.login.LoginModuleTest
Running alluxio.security.user.UserStateTest
Tests run: 8, Failures: 0, Errors: 0, Skipped: 0, Time elapsed: 0.397 sec - in alluxio.security.user.UserStateTest
Running alluxio.test.util.CommonTestUtilsTest
Tests run: 1, Failures: 0, Errors: 0, Skipped: 0, Time elapsed: 1.239 sec - in alluxio.security.group.ShellBasedUnixGroupsMappingTest
Running alluxio.time.ExponentialTimerTest
Running alluxio.time.ManualSleeperTest
Tests run: 2, Failures: 0, Errors: 0, Skipped: 0, Time elapsed: 0.141 sec - in alluxio.time.ManualSleeperTest
Tests run: 5, Failures: 0, Errors: 0, Skipped: 0, Time elapsed: 1.792 sec - in alluxio.test.util.CommonTestUtilsTest
Running alluxio.underfs.FingerprintTest
Tests run: 2, Failures: 0, Errors: 0, Skipped: 0, Time elapsed: 1.72 sec - in alluxio.time.ExponentialTimerTest
Tests run: 6, Failures: 0, Errors: 0, Skipped: 0, Time elapsed: 0.313 sec - in alluxio.underfs.FingerprintTest
Running alluxio.underfs.UfsDirectoryStatusTest
Tests run: 2, Failures: 0, Errors: 0, Skipped: 0, Time elapsed: 0.066 sec - in alluxio.underfs.UfsDirectoryStatusTest
Running alluxio.underfs.UnderFileSystemConfigurationTest
Running alluxio.underfs.UfsFileStatusTest
Tests run: 2, Failures: 0, Errors: 0, Skipped: 0, Time elapsed: 0.146 sec - in alluxio.underfs.UfsFileStatusTest
Running alluxio.underfs.UnderFileSystemTest
Tests run: 6, Failures: 0, Errors: 0, Skipped: 0, Time elapsed: 0.43 sec - in alluxio.underfs.UnderFileSystemConfigurationTest
Tests run: 2, Failures: 0, Errors: 0, Skipped: 1, Time elapsed: 0.362 sec - in alluxio.underfs.UnderFileSystemTest
Running alluxio.underfs.options.CreateOptionsTest
Running alluxio.underfs.options.DeleteOptionsTest
Tests run: 4, Failures: 0, Errors: 0, Skipped: 0, Time elapsed: 0.328 sec - in alluxio.underfs.options.CreateOptionsTest
Running alluxio.underfs.options.FileLocationOptionsTest
Running alluxio.underfs.options.ListOptionsTest
Tests run: 3, Failures: 0, Errors: 0, Skipped: 0, Time elapsed: 0.703 sec - in alluxio.underfs.options.DeleteOptionsTest
Tests run: 3, Failures: 0, Errors: 0, Skipped: 0, Time elapsed: 0.669 sec - in alluxio.underfs.options.FileLocationOptionsTest
Running alluxio.underfs.options.MkdirsOptionsTest
Tests run: 3, Failures: 0, Errors: 0, Skipped: 0, Time elapsed: 0.72 sec - in alluxio.underfs.options.ListOptionsTest
Running alluxio.underfs.options.OpenOptionsTest
Tests run: 4, Failures: 0, Errors: 0, Skipped: 0, Time elapsed: 0.347 sec - in alluxio.underfs.options.MkdirsOptionsTest
Running alluxio.uri.AuthorityTest
Tests run: 5, Failures: 0, Errors: 0, Skipped: 0, Time elapsed: 0.145 sec - in alluxio.uri.AuthorityTest
Tests run: 3, Failures: 0, Errors: 0, Skipped: 0, Time elapsed: 0.651 sec - in alluxio.underfs.options.OpenOptionsTest
Running alluxio.util.CommonUtilsTest
Running alluxio.util.ConfigurationUtilsTest
Running alluxio.util.ExceptionUtilsTest
Tests run: 2, Failures: 0, Errors: 0, Skipped: 0, Time elapsed: 0.158 sec - in alluxio.util.ExceptionUtilsTest
Tests run: 10, Failures: 0, Errors: 0, Skipped: 0, Time elapsed: 0.4 sec - in alluxio.util.ConfigurationUtilsTest
Running alluxio.util.FormatUtilsTest
Running alluxio.util.HFSUtilsTest
Tests run: 8, Failures: 0, Errors: 0, Skipped: 0, Time elapsed: 0.071 sec - in alluxio.util.HFSUtilsTest
Tests run: 9, Failures: 0, Errors: 0, Skipped: 0, Time elapsed: 0.619 sec - in alluxio.util.FormatUtilsTest
Tests run: 22, Failures: 0, Errors: 0, Skipped: 0, Time elapsed: 2.181 sec - in alluxio.util.CommonUtilsTest
Running alluxio.util.IdUtilsTest
Tests run: 3, Failures: 0, Errors: 0, Skipped: 0, Time elapsed: 0.159 sec - in alluxio.util.IdUtilsTest
Running alluxio.util.JvmPauseMonitorTest
Tests run: 1, Failures: 0, Errors: 0, Skipped: 1, Time elapsed: 0.07 sec - in alluxio.util.JvmPauseMonitorTest
Running alluxio.util.SecurityUtilsTest
Running alluxio.util.ShellUtilsTest
Tests run: 2, Failures: 0, Errors: 0, Skipped: 0, Time elapsed: 0.383 sec - in alluxio.util.SecurityUtilsTest
Tests run: 8, Failures: 0, Errors: 0, Skipped: 0, Time elapsed: 0.297 sec - in alluxio.util.ShellUtilsTest
Running alluxio.util.UnderFileSystemUtilsTest
Tests run: 1, Failures: 0, Errors: 0, Skipped: 0, Time elapsed: 0.172 sec - in alluxio.util.UnderFileSystemUtilsTest
Running alluxio.util.WaitForOptionsTest
Running alluxio.util.executor.ControllableSchedulerTest
Tests run: 3, Failures: 0, Errors: 0, Skipped: 0, Time elapsed: 0.14 sec - in alluxio.util.WaitForOptionsTest
Running alluxio.util.io.BufferUtilsTest
Running alluxio.util.io.ByteIOUtilsTest
Tests run: 4, Failures: 0, Errors: 0, Skipped: 0, Time elapsed: 0.087 sec - in alluxio.util.io.ByteIOUtilsTest
Running alluxio.util.io.FileUtilsTest
Tests run: 11, Failures: 0, Errors: 0, Skipped: 0, Time elapsed: 1.444 sec - in alluxio.util.io.BufferUtilsTest
Tests run: 15, Failures: 0, Errors: 0, Skipped: 0, Time elapsed: 0.482 sec - in alluxio.util.io.FileUtilsTest
Running alluxio.util.io.PathUtilsTest
Running alluxio.util.logging.SamplingLoggerTest
Tests run: 17, Failures: 0, Errors: 0, Skipped: 0, Time elapsed: 0.27 sec - in alluxio.util.io.PathUtilsTest
Tests run: 3, Failures: 0, Errors: 0, Skipped: 0, Time elapsed: 0.466 sec - in alluxio.util.logging.SamplingLoggerTest
Running alluxio.util.network.GetMasterWorkerAddressTest
Tests run: 1, Failures: 0, Errors: 0, Skipped: 0, Time elapsed: 0.337 sec - in alluxio.util.network.GetMasterWorkerAddressTest
Running alluxio.util.network.NetworkAddressUtilsTest
Tests run: 4, Failures: 0, Errors: 0, Skipped: 0, Time elapsed: 3.966 sec - in alluxio.util.executor.ControllableSchedulerTest
Tests run: 13, Failures: 0, Errors: 0, Skipped: 0, Time elapsed: 0.398 sec - in alluxio.util.network.NetworkAddressUtilsTest
Running alluxio.wire.AlluxioMasterInfoTest
Running alluxio.wire.AlluxioProxyInfoTest
Running alluxio.wire.AlluxioWorkerInfoTest
Tests run: 2, Failures: 0, Errors: 0, Skipped: 0, Time elapsed: 1.371 sec - in alluxio.wire.AlluxioMasterInfoTest
Tests run: 2, Failures: 0, Errors: 0, Skipped: 0, Time elapsed: 1.114 sec - in alluxio.wire.AlluxioProxyInfoTest
Tests run: 2, Failures: 0, Errors: 0, Skipped: 0, Time elapsed: 1.326 sec - in alluxio.wire.AlluxioWorkerInfoTest
Running alluxio.wire.BlockInfoTest
Running alluxio.wire.BlockLocationTest
Running alluxio.wire.BlockMasterInfoTest
Tests run: 2, Failures: 0, Errors: 0, Skipped: 0, Time elapsed: 0.573 sec - in alluxio.wire.BlockInfoTest
Tests run: 2, Failures: 0, Errors: 0, Skipped: 0, Time elapsed: 0.52 sec - in alluxio.wire.BlockLocationTest
Tests run: 2, Failures: 0, Errors: 0, Skipped: 0, Time elapsed: 0.516 sec - in alluxio.wire.BlockMasterInfoTest
Running alluxio.wire.CapacityTest
Running alluxio.wire.FileBlockInfoTest
Running alluxio.wire.FileInfoTest
Tests run: 2, Failures: 0, Errors: 0, Skipped: 0, Time elapsed: 0.627 sec - in alluxio.wire.FileBlockInfoTest
lerna info run Ran npm script 'build' in '@alluxio/worker-ui' in 50.3s:

> @alluxio/worker-ui@1.0.0 build /usr/src/alluxio/webui/worker
> NODE_ENV=production && npm-run-all --parallel build-css build-js


> @alluxio/worker-ui@1.0.0 build-js /usr/src/alluxio/webui/worker
> react-app-rewired build --scripts-version react-scripts


> @alluxio/worker-ui@1.0.0 build-css /usr/src/alluxio/webui/worker
> node-sass-chokidar --importer=../node_modules/node-sass-tilde-importer --include-path ./src --include-path ./node_modules src/ -o src/

Rendering Complete, saving .css file...
Wrote CSS to /usr/src/alluxio/webui/worker/src/containers/App/App.css
Rendering Complete, saving .css file...
Wrote CSS to /usr/src/alluxio/webui/worker/src/index.css
Creating an optimized production build...
Compiled successfully.

File sizes after gzip:

  210.99 KB  build/static/js/2.e85a50ea.chunk.js
  23.6 KB    build/static/css/main.6f9c9259.chunk.css
  8.53 KB    build/static/js/main.8f19e390.chunk.js
  1.78 KB    build/static/css/2.b2d26109.chunk.css
  764 B      build/static/js/runtime~main.42ac5946.js

The project was built assuming it is hosted at the server root.
You can control this with the homepage field in your package.json.
For example, add this to build it for GitHub Pages:

  "homepage" : "http://myname.github.io/myapp",

The build folder is ready to be deployed.
You may serve it with a static server:

  npm install -g serve
  serve -s build

Find out more about deployment here:

  https://bit.ly/CRA-deploy

Tests run: 2, Failures: 0, Errors: 0, Skipped: 0, Time elapsed: 1.212 sec - in alluxio.wire.CapacityTest
Tests run: 3, Failures: 0, Errors: 0, Skipped: 0, Time elapsed: 0.825 sec - in alluxio.wire.FileInfoTest
Running alluxio.wire.InconsistentPropertyTest
Tests run: 2, Failures: 0, Errors: 0, Skipped: 0, Time elapsed: 0.165 sec - in alluxio.wire.InconsistentPropertyTest
Running alluxio.wire.MountPointInfoTest
Running alluxio.wire.TieredIdentityTest
lerna info run Ran npm script 'build' in '@alluxio/master-ui' in 51.3s:

> @alluxio/master-ui@1.0.0 build /usr/src/alluxio/webui/master
> NODE_ENV=production && npm-run-all --parallel build-css build-js


> @alluxio/master-ui@1.0.0 build-css /usr/src/alluxio/webui/master
> node-sass-chokidar --importer=../node_modules/node-sass-tilde-importer --include-path ./src --include-path ./node_modules src/ -o src/


> @alluxio/master-ui@1.0.0 build-js /usr/src/alluxio/webui/master
> react-app-rewired build --production --scripts-version react-scripts

Rendering Complete, saving .css file...
Wrote CSS to /usr/src/alluxio/webui/master/src/containers/App/App.css
Rendering Complete, saving .css file...
Wrote CSS to /usr/src/alluxio/webui/master/src/containers/pages/Browse/Browse.css
Rendering Complete, saving .css file...
Wrote CSS to /usr/src/alluxio/webui/master/src/index.css
Creating an optimized production build...
Compiled successfully.

File sizes after gzip:

  211.46 KB  build/static/js/2.1bb403aa.chunk.js
  23.64 KB   build/static/css/main.9fad3275.chunk.css
  11.96 KB   build/static/js/main.8b9583c8.chunk.js
  1.78 KB    build/static/css/2.b2d26109.chunk.css
  764 B      build/static/js/runtime~main.42ac5946.js

The project was built assuming it is hosted at the server root.
You can control this with the homepage field in your package.json.
For example, add this to build it for GitHub Pages:

  "homepage" : "http://myname.github.io/myapp",

The build folder is ready to be deployed.
You may serve it with a static server:

  npm install -g serve
  serve -s build

Find out more about deployment here:

  https://bit.ly/CRA-deploy

lerna success run Ran npm script 'build' in 3 packages in 78.1s:
lerna success - @alluxio/common-ui
lerna success - @alluxio/master-ui
lerna success - @alluxio/worker-ui
[INFO] 
[INFO] --- exec-maven-plugin:1.4.0:exec (Test all packages) @ alluxio-webui ---
Running alluxio.wire.WorkerInfoTest
Tests run: 1, Failures: 0, Errors: 0, Skipped: 0, Time elapsed: 0.451 sec - in alluxio.wire.MountPointInfoTest
Tests run: 5, Failures: 0, Errors: 0, Skipped: 0, Time elapsed: 0.722 sec - in alluxio.wire.TieredIdentityTest
lerna notice cli v3.13.0
lerna info Executing command in 3 packages: "npm run test-ci --production  --no-save --no-package-lock --no-shrinkwrap"
Tests run: 3, Failures: 0, Errors: 0, Skipped: 0, Time elapsed: 0.781 sec - in alluxio.wire.WorkerInfoTest
Running alluxio.wire.WorkerNetAddressTest
Tests run: 4, Failures: 0, Errors: 0, Skipped: 0, Time elapsed: 35.851 sec - in alluxio.master.ZkMasterInquireClientTest
Running alluxio.worker.block.io.LocalFileBlockReaderTest
Tests run: 5, Failures: 0, Errors: 0, Skipped: 0, Time elapsed: 0.219 sec - in alluxio.worker.block.io.LocalFileBlockReaderTest
Tests run: 2, Failures: 0, Errors: 0, Skipped: 0, Time elapsed: 0.554 sec - in alluxio.wire.WorkerNetAddressTest
Running alluxio.worker.block.io.LocalFileBlockWriterTest
Tests run: 3, Failures: 0, Errors: 0, Skipped: 0, Time elapsed: 0.27 sec - in alluxio.worker.block.io.LocalFileBlockWriterTest

Results :

Tests run: 620, Failures: 0, Errors: 0, Skipped: 5

[INFO] 
[INFO] --- maven-jar-plugin:2.4:jar (default-jar) @ alluxio-core-common ---
[INFO] Building jar: /usr/src/alluxio/core/common/target/alluxio-core-common-2.2.0-SNAPSHOT.jar
[INFO] 
[INFO] >>> maven-source-plugin:2.3:jar (attach-sources) > generate-sources @ alluxio-core-common >>>
[INFO] 
[INFO] --- maven-enforcer-plugin:1.4:enforce (enforce-maven) @ alluxio-core-common ---
[INFO] 
[INFO] --- maven-enforcer-plugin:1.4:enforce (enforce-versions) @ alluxio-core-common ---
[INFO] 
[INFO] --- maven-checkstyle-plugin:2.17:check (checkstyle) @ alluxio-core-common ---
[INFO] Starting audit...
Audit done.
[INFO] 
[INFO] --- license-maven-plugin:2.9:check (default) @ alluxio-core-common ---
[INFO] Checking licenses...
[INFO] 
[INFO] --- buildnumber-maven-plugin:1.4:create-metadata (default) @ alluxio-core-common ---
[INFO] Executing: /bin/sh -c cd '/usr/src/alluxio/core/common' && 'git' 'rev-parse' '--verify' 'HEAD'
[INFO] Working directory: /usr/src/alluxio/core/common
[INFO] 
[INFO] --- properties-maven-plugin:1.0.0:read-project-properties (default) @ alluxio-core-common ---
[INFO] 
[INFO] --- templating-maven-plugin:1.0.0:filter-sources (filter-src) @ alluxio-core-common ---
[INFO] Coping files with filtering to temporary directory.
[INFO] Using 'UTF-8' encoding to copy filtered resources.
[INFO] Copying 1 resource
[INFO] No files needs to be copied to output directory. Up to date: /usr/src/alluxio/core/common/target/generated-sources/java-templates
[INFO] Source directory: /usr/src/alluxio/core/common/target/generated-sources/java-templates added.
[INFO] 
[INFO] <<< maven-source-plugin:2.3:jar (attach-sources) < generate-sources @ alluxio-core-common <<<
[INFO] 
[INFO] 
[INFO] --- maven-source-plugin:2.3:jar (attach-sources) @ alluxio-core-common ---
[INFO] Building jar: /usr/src/alluxio/core/common/target/alluxio-core-common-2.2.0-SNAPSHOT-sources.jar
[INFO] 
[INFO] --- maven-javadoc-plugin:2.9:jar (attach-javadoc) @ alluxio-core-common ---
[INFO] Skipping javadoc generation
[INFO] 
[INFO] --- maven-jar-plugin:2.4:test-jar (default) @ alluxio-core-common ---
[INFO] Building jar: /usr/src/alluxio/core/common/target/alluxio-core-common-2.2.0-SNAPSHOT-tests.jar
[INFO] 
[INFO] --- maven-install-plugin:2.4:install (default-install) @ alluxio-core-common ---
[INFO] Installing /usr/src/alluxio/core/common/target/alluxio-core-common-2.2.0-SNAPSHOT.jar to /home/jenkins/.m2/repository/org/alluxio/alluxio-core-common/2.2.0-SNAPSHOT/alluxio-core-common-2.2.0-SNAPSHOT.jar
[INFO] Installing /usr/src/alluxio/core/common/pom.xml to /home/jenkins/.m2/repository/org/alluxio/alluxio-core-common/2.2.0-SNAPSHOT/alluxio-core-common-2.2.0-SNAPSHOT.pom
[INFO] Installing /usr/src/alluxio/core/common/target/alluxio-core-common-2.2.0-SNAPSHOT-sources.jar to /home/jenkins/.m2/repository/org/alluxio/alluxio-core-common/2.2.0-SNAPSHOT/alluxio-core-common-2.2.0-SNAPSHOT-sources.jar
[INFO] Installing /usr/src/alluxio/core/common/target/alluxio-core-common-2.2.0-SNAPSHOT-tests.jar to /home/jenkins/.m2/repository/org/alluxio/alluxio-core-common/2.2.0-SNAPSHOT/alluxio-core-common-2.2.0-SNAPSHOT-tests.jar
[INFO] 
[INFO] -----------------< org.alluxio:alluxio-core-client-fs >-----------------
[INFO] Building Alluxio Core - Client - File System 2.2.0-SNAPSHOT      [18/54]
[INFO] --------------------------------[ jar ]---------------------------------
[INFO] 
[INFO] ------------------< org.alluxio:alluxio-table-client >------------------
[INFO] 
[INFO] Building Alluxio Table - Client 2.2.0-SNAPSHOT                   [19/54]
[INFO] 
[INFO] -------------------< org.alluxio:alluxio-job-common >-------------------
[INFO] ---------------< org.alluxio:alluxio-core-server-common >---------------
[INFO] --------------------------------[ jar ]---------------------------------
[INFO] 
[INFO] 
[INFO] Building Alluxio Core - Server - Common Utilities 2.2.0-SNAPSHOT [21/54]
[INFO] Building Alluxio Job Service - Common Utilities 2.2.0-SNAPSHOT   [20/54]
[INFO] --------------------------------[ jar ]---------------------------------
[INFO] 
[INFO] 
[INFO] -----------------< org.alluxio:alluxio-underfs-local >------------------
[INFO] --------------------< org.alluxio:alluxio-checker >---------------------
[INFO] 
[INFO] 
[INFO] ------------------< org.alluxio:alluxio-underfs-cos >-------------------
[INFO] 
[INFO] Building Alluxio Under File System - Local FS 2.2.0-SNAPSHOT     [22/54]
[INFO] 
[INFO] ------------------< org.alluxio:alluxio-underfs-gcs >-------------------
[INFO] ------------------< org.alluxio:alluxio-underfs-hdfs >------------------
[INFO] --------------------------------[ jar ]---------------------------------
[INFO] Building Alluxio Under File System - HDFS 2.2.0-SNAPSHOT         [26/54]
[INFO] Building Alluxio Under File System - GCS 2.2.0-SNAPSHOT          [25/54]
[INFO] ------------------< org.alluxio:alluxio-underfs-kodo >------------------
[INFO] --------------------------------[ jar ]---------------------------------
[INFO] ------------------< org.alluxio:alluxio-underfs-web >-------------------
[INFO] Building Alluxio Under File System - Web 2.2.0-SNAPSHOT          [28/54]
[INFO] --------------------------------[ jar ]---------------------------------
[INFO] 
[INFO] Building Alluxio Under File System - Tencent Cloud COS 2.2.0-SNAPSHOT [24/54]
[INFO] 
[INFO] 
[INFO] ------------------< org.alluxio:alluxio-underfs-oss >-------------------
[INFO] Building Alluxio Integration - Checker 2.2.0-SNAPSHOT            [23/54]
[INFO] Building Alluxio Under File System - Aliyun OSS 2.2.0-SNAPSHOT   [29/54]
[INFO] --------------------------------[ jar ]---------------------------------
[INFO] -----------------< org.alluxio:alluxio-underfs-swift >------------------
[INFO] ------------------< org.alluxio:alluxio-underfs-s3a >-------------------
[INFO] --------------------------------[ jar ]---------------------------------
[INFO] ----------------< org.alluxio:alluxio-integration-yarn >----------------
[INFO] Building Alluxio Under File System - Qiniu Kodo 2.2.0-SNAPSHOT   [27/54]
[INFO] --------------------------------[ jar ]---------------------------------
[INFO] --------------------------------[ jar ]---------------------------------
[INFO] --------------------------------[ jar ]---------------------------------
[INFO] Building Alluxio Integration - YARN 2.2.0-SNAPSHOT               [32/54]
[INFO] Building Alluxio Under File System - S3 2.2.0-SNAPSHOT           [31/54]
[INFO] Building Alluxio Under File System - Swift 2.2.0-SNAPSHOT        [30/54]
[INFO] --------------------------------[ jar ]---------------------------------
[INFO] --------------------------------[ jar ]---------------------------------
[INFO] --------------------------------[ jar ]---------------------------------
[INFO] --------------------------------[ jar ]---------------------------------
[INFO] 
[INFO] --- maven-clean-plugin:3.0.0:clean (default-clean) @ alluxio-table-client ---
[INFO] 
[INFO] --- maven-clean-plugin:3.0.0:clean (default-clean) @ alluxio-job-common ---
[INFO] 
[INFO] --- maven-clean-plugin:3.0.0:clean (default-clean) @ alluxio-core-client-fs ---
[INFO] 
[INFO] --- maven-enforcer-plugin:1.4:enforce (enforce-maven) @ alluxio-core-client-fs ---
[INFO] 
[INFO] 
[INFO] --- maven-enforcer-plugin:1.4:enforce (enforce-maven) @ alluxio-job-common ---
[INFO] --- maven-enforcer-plugin:1.4:enforce (enforce-maven) @ alluxio-table-client ---
[INFO] 
[INFO] --- maven-enforcer-plugin:1.4:enforce (enforce-versions) @ alluxio-job-common ---
[INFO] 
[INFO] 
[INFO] 
[INFO] --- maven-enforcer-plugin:1.4:enforce (enforce-versions) @ alluxio-core-client-fs ---
[INFO] 
[INFO] --- maven-checkstyle-plugin:2.17:check (checkstyle) @ alluxio-core-client-fs ---
[INFO] 
[INFO] --- maven-checkstyle-plugin:2.17:check (checkstyle) @ alluxio-job-common ---
[INFO] --- maven-enforcer-plugin:1.4:enforce (enforce-versions) @ alluxio-table-client ---
[INFO] --- maven-clean-plugin:3.0.0:clean (default-clean) @ alluxio-underfs-local ---
[INFO] 
[INFO] --- maven-checkstyle-plugin:2.17:check (checkstyle) @ alluxio-table-client ---
[INFO] 
[INFO] --- maven-enforcer-plugin:1.4:enforce (enforce-maven) @ alluxio-underfs-local ---
[INFO] 
[INFO] --- maven-enforcer-plugin:1.4:enforce (enforce-versions) @ alluxio-underfs-local ---
[INFO] 
[INFO] --- maven-checkstyle-plugin:2.17:check (checkstyle) @ alluxio-underfs-local ---
[INFO] 
[INFO] --- maven-clean-plugin:3.0.0:clean (default-clean) @ alluxio-underfs-web ---
[INFO] 
[INFO] --- maven-enforcer-plugin:1.4:enforce (enforce-maven) @ alluxio-underfs-web ---
[INFO] 
[INFO] --- maven-enforcer-plugin:1.4:enforce (enforce-versions) @ alluxio-underfs-web ---
[INFO] 
[INFO] --- maven-checkstyle-plugin:2.17:check (checkstyle) @ alluxio-underfs-web ---
[INFO] 
[INFO] --- maven-clean-plugin:3.0.0:clean (default-clean) @ alluxio-underfs-cos ---
[INFO] 
[INFO] --- maven-enforcer-plugin:1.4:enforce (enforce-maven) @ alluxio-underfs-cos ---
[INFO] 
[INFO] --- maven-enforcer-plugin:1.4:enforce (enforce-versions) @ alluxio-underfs-cos ---
[INFO] 
[INFO] --- maven-checkstyle-plugin:2.17:check (checkstyle) @ alluxio-underfs-cos ---
[INFO] 
[INFO] --- maven-clean-plugin:3.0.0:clean (default-clean) @ alluxio-underfs-gcs ---
[INFO] 
[INFO] --- maven-enforcer-plugin:1.4:enforce (enforce-maven) @ alluxio-underfs-gcs ---
[INFO] 
[INFO] --- maven-enforcer-plugin:1.4:enforce (enforce-versions) @ alluxio-underfs-gcs ---
[INFO] 
[INFO] --- maven-checkstyle-plugin:2.17:check (checkstyle) @ alluxio-underfs-gcs ---
[INFO] 
[INFO] --- maven-clean-plugin:3.0.0:clean (default-clean) @ alluxio-underfs-swift ---
[INFO] 
[INFO] --- maven-clean-plugin:3.0.0:clean (default-clean) @ alluxio-underfs-oss ---
[INFO] 
[INFO] --- maven-enforcer-plugin:1.4:enforce (enforce-maven) @ alluxio-underfs-swift ---
[INFO] 
[INFO] --- maven-enforcer-plugin:1.4:enforce (enforce-maven) @ alluxio-underfs-oss ---
[INFO] 
[INFO] --- maven-enforcer-plugin:1.4:enforce (enforce-versions) @ alluxio-underfs-swift ---
[INFO] 
[INFO] 
[INFO] --- maven-enforcer-plugin:1.4:enforce (enforce-versions) @ alluxio-underfs-oss ---
[INFO] 
[INFO] --- maven-clean-plugin:3.0.0:clean (default-clean) @ alluxio-underfs-kodo ---
[INFO] --- maven-checkstyle-plugin:2.17:check (checkstyle) @ alluxio-underfs-swift ---
[INFO] 
[INFO] --- maven-checkstyle-plugin:2.17:check (checkstyle) @ alluxio-underfs-oss ---
[INFO] 
[INFO] --- maven-enforcer-plugin:1.4:enforce (enforce-maven) @ alluxio-underfs-kodo ---
[INFO] 
[INFO] --- maven-enforcer-plugin:1.4:enforce (enforce-versions) @ alluxio-underfs-kodo ---
[INFO] 
[INFO] --- maven-checkstyle-plugin:2.17:check (checkstyle) @ alluxio-underfs-kodo ---
[INFO] 
[INFO] --- maven-clean-plugin:3.0.0:clean (default-clean) @ alluxio-underfs-s3a ---
[INFO] 
[INFO] --- maven-enforcer-plugin:1.4:enforce (enforce-maven) @ alluxio-underfs-s3a ---
[INFO] 
[INFO] --- maven-enforcer-plugin:1.4:enforce (enforce-versions) @ alluxio-underfs-s3a ---
[INFO] 
[INFO] --- maven-checkstyle-plugin:2.17:check (checkstyle) @ alluxio-underfs-s3a ---
[INFO] 
[INFO] --- maven-clean-plugin:3.0.0:clean (default-clean) @ alluxio-underfs-hdfs ---
[INFO] 
[INFO] --- maven-enforcer-plugin:1.4:enforce (enforce-maven) @ alluxio-underfs-hdfs ---
[INFO] 
[INFO] --- maven-enforcer-plugin:1.4:enforce (enforce-versions) @ alluxio-underfs-hdfs ---
[INFO] 
[INFO] --- maven-checkstyle-plugin:2.17:check (checkstyle) @ alluxio-underfs-hdfs ---
[INFO] 
[INFO] --- maven-clean-plugin:3.0.0:clean (default-clean) @ alluxio-integration-yarn ---
[INFO] 
[INFO] --- maven-enforcer-plugin:1.4:enforce (enforce-maven) @ alluxio-integration-yarn ---
[INFO] 
[INFO] --- maven-enforcer-plugin:1.4:enforce (enforce-versions) @ alluxio-integration-yarn ---
[INFO] 
[INFO] --- maven-checkstyle-plugin:2.17:check (checkstyle) @ alluxio-integration-yarn ---
[INFO] 
[INFO] --- maven-clean-plugin:3.0.0:clean (default-clean) @ alluxio-core-server-common ---
[INFO] 
[INFO] --- maven-enforcer-plugin:1.4:enforce (enforce-maven) @ alluxio-core-server-common ---
[INFO] 
[INFO] --- maven-enforcer-plugin:1.4:enforce (enforce-versions) @ alluxio-core-server-common ---
[INFO] 
[INFO] --- maven-checkstyle-plugin:2.17:check (checkstyle) @ alluxio-core-server-common ---
[INFO] 
[INFO] --- maven-clean-plugin:3.0.0:clean (default-clean) @ alluxio-checker ---
[INFO] 
[INFO] --- maven-enforcer-plugin:1.4:enforce (enforce-maven) @ alluxio-checker ---
[INFO] 
[INFO] --- maven-enforcer-plugin:1.4:enforce (enforce-versions) @ alluxio-checker ---
[INFO] 
[INFO] --- maven-checkstyle-plugin:2.17:check (checkstyle) @ alluxio-checker ---
[INFO] Starting audit...
Audit done.
[INFO] 
[INFO] --- license-maven-plugin:2.9:check (default) @ alluxio-table-client ---
[INFO] Checking licenses...
[INFO] 
[INFO] --- maven-resources-plugin:2.7:resources (default-resources) @ alluxio-table-client ---
[INFO] Using 'UTF-8' encoding to copy filtered resources.
[INFO] skip non existing resourceDirectory /usr/src/alluxio/table/client/src/main/resources
[INFO] 
[INFO] --- maven-compiler-plugin:3.2:compile (default-compile) @ alluxio-table-client ---
[INFO] Changes detected - recompiling the module!
[INFO] Compiling 2 source files to /usr/src/alluxio/table/client/target/classes
[INFO] Starting audit...
Audit done.
[INFO] 
[INFO] --- license-maven-plugin:2.9:check (default) @ alluxio-underfs-cos ---
[INFO] Starting audit...
Audit done.
[INFO] 
[INFO] --- license-maven-plugin:2.9:check (default) @ alluxio-underfs-gcs ---
[INFO] Checking licenses...
[INFO] Checking licenses...
[INFO] 
[INFO] --- maven-resources-plugin:2.7:resources (default-resources) @ alluxio-underfs-cos ---
[INFO] Using 'UTF-8' encoding to copy filtered resources.
[INFO] Copying 1 resource
[INFO] 
[INFO] --- maven-resources-plugin:2.7:resources (default-resources) @ alluxio-underfs-gcs ---
[INFO] 
[INFO] --- maven-compiler-plugin:3.2:compile (default-compile) @ alluxio-underfs-cos ---
[INFO] Using 'UTF-8' encoding to copy filtered resources.
[INFO] Copying 1 resource
[INFO] 
[INFO] --- maven-compiler-plugin:3.2:compile (default-compile) @ alluxio-underfs-gcs ---
[INFO] Changes detected - recompiling the module!
[INFO] Compiling 4 source files to /usr/src/alluxio/underfs/cos/target/classes
[INFO] Changes detected - recompiling the module!
[INFO] Compiling 5 source files to /usr/src/alluxio/underfs/gcs/target/classes
[INFO] Starting audit...
Audit done.
[INFO] 
[INFO] --- license-maven-plugin:2.9:check (default) @ alluxio-underfs-local ---
[INFO] Checking licenses...
[INFO] 
[INFO] --- maven-resources-plugin:2.7:resources (default-resources) @ alluxio-underfs-local ---
[INFO] Using 'UTF-8' encoding to copy filtered resources.
[INFO] Copying 1 resource
[INFO] 
[INFO] --- maven-compiler-plugin:3.2:compile (default-compile) @ alluxio-underfs-local ---
[INFO] Changes detected - recompiling the module!
[INFO] 
[INFO] >>> spotbugs-maven-plugin:3.1.12.2:check (default) > :spotbugs @ alluxio-table-client >>>
[INFO] Compiling 2 source files to /usr/src/alluxio/underfs/local/target/classes
[INFO] 
[INFO] --- spotbugs-maven-plugin:3.1.12.2:spotbugs (spotbugs) @ alluxio-table-client ---
[INFO] Starting audit...
Audit done.
[INFO] 
[INFO] --- license-maven-plugin:2.9:check (default) @ alluxio-underfs-web ---
[INFO] Fork Value is true
[INFO] Checking licenses...
[INFO] 
[INFO] --- maven-resources-plugin:2.7:resources (default-resources) @ alluxio-underfs-web ---
[INFO] /usr/src/alluxio/underfs/cos/src/main/java/alluxio/underfs/cos/COSUnderFileSystemFactory.java: /usr/src/alluxio/underfs/cos/src/main/java/alluxio/underfs/cos/COSUnderFileSystemFactory.java uses or overrides a deprecated API.
[INFO] Using 'UTF-8' encoding to copy filtered resources.
[INFO] /usr/src/alluxio/underfs/cos/src/main/java/alluxio/underfs/cos/COSUnderFileSystemFactory.java: Recompile with -Xlint:deprecation for details.
[INFO] Copying 1 resource
[INFO] 
[INFO] >>> spotbugs-maven-plugin:3.1.12.2:check (default) > :spotbugs @ alluxio-underfs-cos >>>
[INFO] 
[INFO] --- spotbugs-maven-plugin:3.1.12.2:spotbugs (spotbugs) @ alluxio-underfs-cos ---
[INFO] /usr/src/alluxio/underfs/gcs/src/main/java/alluxio/underfs/gcs/GCSUnderFileSystemFactory.java: /usr/src/alluxio/underfs/gcs/src/main/java/alluxio/underfs/gcs/GCSUnderFileSystemFactory.java uses or overrides a deprecated API.
[INFO] /usr/src/alluxio/underfs/gcs/src/main/java/alluxio/underfs/gcs/GCSUnderFileSystemFactory.java: Recompile with -Xlint:deprecation for details.
[INFO] 
[INFO] >>> spotbugs-maven-plugin:3.1.12.2:check (default) > :spotbugs @ alluxio-underfs-gcs >>>
[INFO] 
[INFO] --- maven-compiler-plugin:3.2:compile (default-compile) @ alluxio-underfs-web ---
[INFO] 
[INFO] --- spotbugs-maven-plugin:3.1.12.2:spotbugs (spotbugs) @ alluxio-underfs-gcs ---
[INFO] Fork Value is true
[INFO] Fork Value is true
[INFO] Changes detected - recompiling the module!
[INFO] Starting audit...
Audit done.
[INFO] 
[INFO] --- license-maven-plugin:2.9:check (default) @ alluxio-underfs-kodo ---
[INFO] Compiling 2 source files to /usr/src/alluxio/underfs/web/target/classes
[INFO] Checking licenses...
[INFO] 
[INFO] --- maven-resources-plugin:2.7:resources (default-resources) @ alluxio-underfs-kodo ---
[INFO] Using 'UTF-8' encoding to copy filtered resources.
[INFO] Copying 1 resource
[INFO] 
[INFO] --- maven-compiler-plugin:3.2:compile (default-compile) @ alluxio-underfs-kodo ---
[INFO] /usr/src/alluxio/underfs/local/src/main/java/alluxio/underfs/local/LocalUnderFileSystem.java: /usr/src/alluxio/underfs/local/src/main/java/alluxio/underfs/local/LocalUnderFileSystem.java uses or overrides a deprecated API.
[INFO] /usr/src/alluxio/underfs/local/src/main/java/alluxio/underfs/local/LocalUnderFileSystem.java: Recompile with -Xlint:deprecation for details.
[INFO] 
[INFO] >>> spotbugs-maven-plugin:3.1.12.2:check (default) > :spotbugs @ alluxio-underfs-local >>>
[INFO] 
[INFO] --- spotbugs-maven-plugin:3.1.12.2:spotbugs (spotbugs) @ alluxio-underfs-local ---
[INFO] Changes detected - recompiling the module!
[INFO] Starting audit...
Audit done.
[INFO] 
[INFO] --- license-maven-plugin:2.9:check (default) @ alluxio-underfs-swift ---
[INFO] Checking licenses...
[INFO] Fork Value is true
[INFO] Starting audit...
Audit done.
[INFO] 
[INFO] --- license-maven-plugin:2.9:check (default) @ alluxio-underfs-hdfs ---
[INFO] 
[INFO] --- maven-resources-plugin:2.7:resources (default-resources) @ alluxio-underfs-swift ---
[INFO] Using 'UTF-8' encoding to copy filtered resources.
[INFO] Copying 1 resource
[INFO] Compiling 5 source files to /usr/src/alluxio/underfs/kodo/target/classes
[INFO] Checking licenses...
[INFO] Starting audit...
Audit done.
[INFO] 
[INFO] --- license-maven-plugin:2.9:check (default) @ alluxio-underfs-oss ---
[INFO] Checking licenses...
[INFO] 
[INFO] --- maven-compiler-plugin:3.2:compile (default-compile) @ alluxio-underfs-swift ---
[INFO] 
[INFO] --- templating-maven-plugin:1.0.0:filter-sources (filter-src) @ alluxio-underfs-hdfs ---
[INFO] Coping files with filtering to temporary directory.
[INFO] Using 'UTF-8' encoding to copy filtered resources.
[INFO] Copying 1 resource
[INFO] Changes detected - recompiling the module!
[INFO] 
[INFO] --- maven-resources-plugin:2.7:resources (default-resources) @ alluxio-underfs-oss ---
[INFO] Copied 1 files to output directory: /usr/src/alluxio/underfs/hdfs/src/main/java
[INFO] Source directory: /usr/src/alluxio/underfs/hdfs/src/main/java added.
[INFO] 
[INFO] --- jcp:6.1.2:preprocess (preprocessSources) @ alluxio-underfs-hdfs ---
[INFO] Using 'UTF-8' encoding to copy filtered resources.
[INFO] Copying 1 resource
[INFO] Compiling 9 source files to /usr/src/alluxio/underfs/swift/target/classes
[INFO] Starting audit...
Audit done.
[INFO] 
[INFO] --- license-maven-plugin:2.9:check (default) @ alluxio-integration-yarn ---
[INFO] 
[INFO] --- maven-compiler-plugin:3.2:compile (default-compile) @ alluxio-underfs-oss ---
[INFO] Starting audit...
Audit done.
[INFO] 
[INFO] --- license-maven-plugin:2.9:check (default) @ alluxio-underfs-s3a ---
[INFO] /usr/src/alluxio/underfs/web/src/main/java/alluxio/underfs/web/WebUnderFileSystem.java: /usr/src/alluxio/underfs/web/src/main/java/alluxio/underfs/web/WebUnderFileSystem.java uses or overrides a deprecated API.
[INFO] /usr/src/alluxio/underfs/web/src/main/java/alluxio/underfs/web/WebUnderFileSystem.java: Recompile with -Xlint:deprecation for details.
[INFO] 
[INFO] >>> spotbugs-maven-plugin:3.1.12.2:check (default) > :spotbugs @ alluxio-underfs-web >>>
[INFO] 
[INFO] --- spotbugs-maven-plugin:3.1.12.2:spotbugs (spotbugs) @ alluxio-underfs-web ---
[INFO] Checking licenses...
[INFO] Starting audit...
Audit done.
[INFO] 
[INFO] --- license-maven-plugin:2.9:check (default) @ alluxio-checker ---
[INFO] Starting audit...
Audit done.
[INFO] 
[INFO] --- license-maven-plugin:2.9:check (default) @ alluxio-job-common ---
[INFO] Checking licenses...
[INFO] Checking licenses...
[INFO] Checking licenses...
[INFO] 
[INFO] --- maven-resources-plugin:2.7:resources (default-resources) @ alluxio-underfs-s3a ---
[INFO] Using 'UTF-8' encoding to copy filtered resources.
[INFO] 
[INFO] --- maven-resources-plugin:2.7:resources (default-resources) @ alluxio-checker ---
[INFO] Using 'UTF-8' encoding to copy filtered resources.
[INFO] Copying 1 resource
[INFO] Changes detected - recompiling the module!
[INFO] Copying 1 resource
[INFO] Fork Value is true
[INFO] Preprocess sources : /usr/src/alluxio/underfs/hdfs/src/main/java
[INFO] Preprocess destination : /usr/src/alluxio/underfs/hdfs/target/generated-sources/preprocessed
[INFO] 
[INFO] --- maven-compiler-plugin:3.2:compile (default-compile) @ alluxio-checker ---
[INFO] 
[INFO] --- maven-resources-plugin:2.7:resources (default-resources) @ alluxio-integration-yarn ---
[INFO] Using 'UTF-8' encoding to copy filtered resources.
[INFO] skip non existing resourceDirectory /usr/src/alluxio/integration/yarn/src/main/resources
[INFO] 
[INFO] --- maven-compiler-plugin:3.2:compile (default-compile) @ alluxio-integration-yarn ---
[INFO] Changes detected - recompiling the module!
[INFO] 
[INFO] --- maven-compiler-plugin:3.2:compile (default-compile) @ alluxio-underfs-s3a ---
[INFO] Changes detected - recompiling the module!
[INFO] Changes detected - recompiling the module!
[INFO] 
[INFO] --- maven-resources-plugin:2.7:resources (default-resources) @ alluxio-job-common ---
[INFO] Using 'UTF-8' encoding to copy filtered resources.
[INFO] skip non existing resourceDirectory /usr/src/alluxio/job/common/src/main/resources
[INFO] 
[INFO] --- maven-compiler-plugin:3.2:compile (default-compile) @ alluxio-job-common ---
[INFO] Compiling 4 source files to /usr/src/alluxio/underfs/oss/target/classes
[INFO] Compiling 4 source files to /usr/src/alluxio/integration/checker/target/classes
[INFO] Compiling 5 source files to /usr/src/alluxio/integration/yarn/target/classes
[INFO] Compiling 6 source files to /usr/src/alluxio/underfs/s3a/target/classes
[INFO] 
[INFO] >>> spotbugs-maven-plugin:3.1.12.2:check (default) > :spotbugs @ alluxio-underfs-kodo >>>
[INFO] 
[INFO] --- spotbugs-maven-plugin:3.1.12.2:spotbugs (spotbugs) @ alluxio-underfs-kodo ---
[INFO] Fork Value is true
[INFO] Changes detected - recompiling the module!
[INFO] Compiling 31 source files to /usr/src/alluxio/job/common/target/classes
[INFO] -----------------------------------------------------------------
[INFO] Completed, preprocessed 12 files, copied 0 files, elapsed time 274ms
[INFO] A Compile source root has been removed from the root list [/usr/src/alluxio/underfs/hdfs/src/main/java]
[INFO] The New compile source root has been added into the list [/usr/src/alluxio/underfs/hdfs/target/generated-sources/preprocessed]
[INFO] 
[INFO] --- maven-resources-plugin:2.7:resources (default-resources) @ alluxio-underfs-hdfs ---
[INFO] Using 'UTF-8' encoding to copy filtered resources.
[INFO] Copying 1 resource
[INFO] 
[INFO] --- maven-compiler-plugin:3.2:compile (default-compile) @ alluxio-underfs-hdfs ---
[INFO] Changes detected - recompiling the module!
[INFO] Compiling 10 source files to /usr/src/alluxio/underfs/hdfs/target/classes
[INFO] /usr/src/alluxio/underfs/oss/src/main/java/alluxio/underfs/oss/OSSUnderFileSystemFactory.java: /usr/src/alluxio/underfs/oss/src/main/java/alluxio/underfs/oss/OSSUnderFileSystemFactory.java uses or overrides a deprecated API.
[INFO] /usr/src/alluxio/underfs/oss/src/main/java/alluxio/underfs/oss/OSSUnderFileSystemFactory.java: Recompile with -Xlint:deprecation for details.
[INFO] 
[INFO] >>> spotbugs-maven-plugin:3.1.12.2:check (default) > :spotbugs @ alluxio-underfs-oss >>>
[INFO] 
[INFO] --- spotbugs-maven-plugin:3.1.12.2:spotbugs (spotbugs) @ alluxio-underfs-oss ---
[INFO] Fork Value is true
[INFO] /usr/src/alluxio/underfs/swift/src/main/java/alluxio/underfs/swift/SwiftUnderFileSystemFactory.java: /usr/src/alluxio/underfs/swift/src/main/java/alluxio/underfs/swift/SwiftUnderFileSystemFactory.java uses or overrides a deprecated API.
[INFO] /usr/src/alluxio/underfs/swift/src/main/java/alluxio/underfs/swift/SwiftUnderFileSystemFactory.java: Recompile with -Xlint:deprecation for details.
[INFO] 
[INFO] >>> spotbugs-maven-plugin:3.1.12.2:check (default) > :spotbugs @ alluxio-underfs-swift >>>
[INFO] 
[INFO] --- spotbugs-maven-plugin:3.1.12.2:spotbugs (spotbugs) @ alluxio-underfs-swift ---
[INFO] Fork Value is true
[INFO] /usr/src/alluxio/underfs/s3a/src/main/java/alluxio/underfs/s3a/S3AUnderFileSystem.java: Some input files use or override a deprecated API.
[INFO] /usr/src/alluxio/underfs/s3a/src/main/java/alluxio/underfs/s3a/S3AUnderFileSystem.java: Recompile with -Xlint:deprecation for details.
[INFO] /usr/src/alluxio/underfs/s3a/src/main/java/alluxio/underfs/s3a/S3ALowLevelOutputStream.java: /usr/src/alluxio/underfs/s3a/src/main/java/alluxio/underfs/s3a/S3ALowLevelOutputStream.java uses unchecked or unsafe operations.
[INFO] /usr/src/alluxio/underfs/s3a/src/main/java/alluxio/underfs/s3a/S3ALowLevelOutputStream.java: Recompile with -Xlint:unchecked for details.
[INFO] 
[INFO] >>> spotbugs-maven-plugin:3.1.12.2:check (default) > :spotbugs @ alluxio-underfs-s3a >>>
[INFO] 
[INFO] --- spotbugs-maven-plugin:3.1.12.2:spotbugs (spotbugs) @ alluxio-underfs-s3a ---
[INFO] Fork Value is true
[INFO] /usr/src/alluxio/integration/yarn/src/main/java/alluxio/yarn/ApplicationMaster.java: Some input files use or override a deprecated API.
[INFO] /usr/src/alluxio/integration/yarn/src/main/java/alluxio/yarn/ApplicationMaster.java: Recompile with -Xlint:deprecation for details.
[INFO] /usr/src/alluxio/integration/yarn/src/main/java/alluxio/yarn/ApplicationMaster.java: /usr/src/alluxio/integration/yarn/src/main/java/alluxio/yarn/ApplicationMaster.java uses unchecked or unsafe operations.
[INFO] /usr/src/alluxio/integration/yarn/src/main/java/alluxio/yarn/ApplicationMaster.java: Recompile with -Xlint:unchecked for details.
[INFO] 
[INFO] >>> spotbugs-maven-plugin:3.1.12.2:check (default) > :spotbugs @ alluxio-integration-yarn >>>
[INFO] 
[INFO] --- spotbugs-maven-plugin:3.1.12.2:spotbugs (spotbugs) @ alluxio-integration-yarn ---
[INFO] Fork Value is true
[INFO] 
[INFO] >>> spotbugs-maven-plugin:3.1.12.2:check (default) > :spotbugs @ alluxio-job-common >>>
[INFO] 
[INFO] --- spotbugs-maven-plugin:3.1.12.2:spotbugs (spotbugs) @ alluxio-job-common ---
[INFO] Fork Value is true
[INFO] /usr/src/alluxio/underfs/hdfs/target/generated-sources/preprocessed/alluxio/underfs/hdfs/HdfsUnderFileSystem.java: /usr/src/alluxio/underfs/hdfs/target/generated-sources/preprocessed/alluxio/underfs/hdfs/HdfsUnderFileSystem.java uses or overrides a deprecated API.
[INFO] /usr/src/alluxio/underfs/hdfs/target/generated-sources/preprocessed/alluxio/underfs/hdfs/HdfsUnderFileSystem.java: Recompile with -Xlint:deprecation for details.
[INFO] 
[INFO] >>> spotbugs-maven-plugin:3.1.12.2:check (default) > :spotbugs @ alluxio-underfs-hdfs >>>
[INFO] Starting audit...
/usr/src/alluxio/core/client/fs/src/main/java/alluxio/client/file/BaseFileSystem.java:633: error: Avoid using finalizer method.
/usr/src/alluxio/core/client/fs/src/main/java/alluxio/client/file/CachingFileSystem.java:126: error: Avoid using finalizer method.
Audit done.
[INFO] ------------------------------------------------------------------------
[INFO] Reactor Summary:
[INFO] 
[INFO] Alluxio Parent 2.2.0-SNAPSHOT ...................... SUCCESS [ 12.125 s]
[INFO] Alluxio Core ....................................... SUCCESS [  2.380 s]
[INFO] Alluxio Core - Transport ........................... SUCCESS [ 22.656 s]
[INFO] Alluxio Core - Base module ......................... SUCCESS [ 44.374 s]
[INFO] Alluxio Core - Common Utilities .................... SUCCESS [01:13 min]
[INFO] Alluxio Core - Client .............................. SUCCESS [  1.378 s]
[INFO] Alluxio Core - Client - File System ................ FAILURE [  3.635 s]
[INFO] Alluxio Examples ................................... SKIPPED
[INFO] Alluxio Table ...................................... SUCCESS [  0.967 s]
[INFO] Alluxio Table - Base Module ........................ SUCCESS [  5.424 s]
[INFO] Alluxio Table - Client ............................. SKIPPED
[INFO] Alluxio Job Service ................................ SUCCESS [  0.987 s]
[INFO] Alluxio Job Service - Common Utilities ............. SKIPPED
[INFO] Alluxio Job Service - Client ....................... SKIPPED
[INFO] Alluxio Shell ...................................... SKIPPED
[INFO] Alluxio Table - Shell .............................. SKIPPED
[INFO] Alluxio Assembly ................................... SUCCESS [  0.925 s]
[INFO] Alluxio Assembly - Client .......................... SKIPPED
[INFO] Alluxio Core - Server .............................. SUCCESS [  1.627 s]
[INFO] Alluxio Core - Server - Common Utilities ........... SKIPPED
[INFO] Alluxio Under File System .......................... SUCCESS [  0.952 s]
[INFO] Alluxio Under File System - Local FS ............... SKIPPED
[INFO] Alluxio Core - Server - Master ..................... SKIPPED
[INFO] Alluxio Core - Server - Proxy ...................... SKIPPED
[INFO] Alluxio Core - Server - Worker ..................... SKIPPED
[INFO] Alluxio Core - Client - HDFS ....................... SKIPPED
[INFO] Alluxio Job Service - Server ....................... SKIPPED
[INFO] Alluxio Log Server ................................. SKIPPED
[INFO] Alluxio Table - Server ............................. SUCCESS [  1.302 s]
[INFO] Alluxio Table - Server - Common .................... SKIPPED
[INFO] Alluxio Table - Server - Master .................... SKIPPED
[INFO] Alluxio Integration ................................ SUCCESS [  1.699 s]
[INFO] Alluxio Integration - Mesos ........................ SKIPPED
[INFO] Alluxio Assembly - Server .......................... SKIPPED
[INFO] Alluxio Integration - Checker ...................... SKIPPED
[INFO] Alluxio Integration - FUSE ......................... SKIPPED
[INFO] Alluxio MiniCluster ................................ SKIPPED
[INFO] Alluxio Shaded Libraries ........................... SUCCESS [  0.874 s]
[INFO] Alluxio Shaded Libraries - Client .................. SKIPPED
[INFO] Alluxio Shaded Libraries - Hadoop 2.7.3 ............ SUCCESS [ 20.263 s]
[INFO] Alluxio Table - Server - UnderDB ................... SKIPPED
[INFO] Alluxio Table - Server - UnderDB - Hive ............ SKIPPED
[INFO] Alluxio Tests ...................................... SKIPPED
[INFO] Alluxio Under File System - Tencent Cloud COS ...... SKIPPED
[INFO] Alluxio Under File System - GCS .................... SKIPPED
[INFO] Alluxio Under File System - HDFS ................... SKIPPED
[INFO] Alluxio Under File System - Qiniu Kodo ............. SKIPPED
[INFO] Alluxio Under File System - Aliyun OSS ............. SKIPPED
[INFO] Alluxio Under File System - S3 ..................... SKIPPED
[INFO] Alluxio Under File System - Swift .................. SKIPPED
[INFO] Alluxio Under File System - Microsoft Azure Blob Storage SKIPPED
[INFO] Alluxio Under File System - Web .................... SKIPPED
[INFO] Alluxio UI ......................................... SKIPPED
[INFO] Alluxio Integration - YARN 2.2.0-SNAPSHOT .......... SKIPPED
[INFO] ------------------------------------------------------------------------
[INFO] BUILD FAILURE
[INFO] ------------------------------------------------------------------------
[INFO] Total time: 02:39 min (Wall Clock)
[INFO] Finished at: 2019-12-09T02:56:41Z
[INFO] ------------------------------------------------------------------------
[INFO] 
[INFO] --- spotbugs-maven-plugin:3.1.12.2:spotbugs (spotbugs) @ alluxio-underfs-hdfs ---
[ERROR] Failed to execute goal org.apache.maven.plugins:maven-checkstyle-plugin:2.17:check (checkstyle) on project alluxio-core-client-fs: Failed during checkstyle execution: There are 2 errors reported by Checkstyle 6.11.2 with /usr/src/alluxio/build/checkstyle/alluxio_checks.xml ruleset. -> [Help 1]
[ERROR] 
[ERROR] To see the full stack trace of the errors, re-run Maven with the -e switch.
[ERROR] Re-run Maven using the -X switch to enable full debug logging.
[ERROR] 
[ERROR] For more information about the errors and possible solutions, please read the following articles:
[ERROR] [Help 1] http://cwiki.apache.org/confluence/display/MAVEN/MojoExecutionException
[ERROR] 
[ERROR] After correcting the problems, you can resume the build with the command
[ERROR]   mvn <goals> -rf :alluxio-core-client-fs
Build step 'Execute shell' marked build as failure
Archiving artifacts
Test FAILed.
Refer to this link for build results (access rights to CI server needed): 
https://amplab.cs.berkeley.edu/jenkins//job/Alluxio-Pull-Request-Builder/7211/
Test FAILed.
Finished: FAILURE