FailedConsole Output

Skipping 8,401 KB.. Full Log
ache/hadoop/hadoop-mapreduce-client-app/2.7.3/hadoop-mapreduce-client-app-2.7.3.jar:/home/jenkins/.m2/repository/org/apache/httpcomponents/httpclient/4.5.6/httpclient-4.5.6.jar:/home/jenkins/.m2/repository/net/razorvine/pyrolite/4.13/pyrolite-4.13.jar:/home/jenkins/.m2/repository/org/slf4j/jcl-over-slf4j/1.7.16/jcl-over-slf4j-1.7.16.jar:/home/jenkins/.m2/repository/commons-httpclient/commons-httpclient/3.1/commons-httpclient-3.1.jar
[INFO] 
[INFO] --- scala-maven-plugin:3.2.2:testCompile (scala-test-compile-first) @ spark-sql-kafka-0-10_2.11 ---
[INFO] Using zinc server for incremental compilation
[info] Compiling 14 Scala sources to /home/jenkins/workspace/spark-branch-2.4-test-maven-hadoop-2.7/external/kafka-0-10-sql/target/scala-2.11/test-classes...
[warn] /home/jenkins/workspace/spark-branch-2.4-test-maven-hadoop-2.7/external/kafka-0-10-sql/src/test/scala/org/apache/spark/sql/kafka010/KafkaContinuousTest.scala:76: reflective access of structural type member value activeTaskIdCount should be enabled
[warn] by making the implicit value scala.language.reflectiveCalls visible.
[warn] This can be achieved by adding the import clause 'import scala.language.reflectiveCalls'
[warn] or by setting the compiler option -language:reflectiveCalls.
[warn] See the Scaladoc for value scala.language.reflectiveCalls for a discussion
[warn] why the feature should be explicitly enabled.
[warn]       assert(tasksEndedListener.activeTaskIdCount.get() == 0)
[warn]                                 ^
[warn] /home/jenkins/workspace/spark-branch-2.4-test-maven-hadoop-2.7/external/kafka-0-10-sql/src/test/scala/org/apache/spark/sql/kafka010/KafkaTestUtils.scala:66: class ZkUtils in package utils is deprecated: This is an internal class that is no longer used by Kafka and will be removed in a future release. Please use org.apache.kafka.clients.admin.AdminClient instead.
[warn]   private var zkUtils: ZkUtils = _
[warn]                        ^
[warn] /home/jenkins/workspace/spark-branch-2.4-test-maven-hadoop-2.7/external/kafka-0-10-sql/src/test/scala/org/apache/spark/sql/kafka010/KafkaTestUtils.scala:95: class ZkUtils in package utils is deprecated: This is an internal class that is no longer used by Kafka and will be removed in a future release. Please use org.apache.kafka.clients.admin.AdminClient instead.
[warn]   def zookeeperClient: ZkUtils = {
[warn]                        ^
[warn] /home/jenkins/workspace/spark-branch-2.4-test-maven-hadoop-2.7/external/kafka-0-10-sql/src/test/scala/org/apache/spark/sql/kafka010/KafkaTestUtils.scala:107: object ZkUtils in package utils is deprecated: This is an internal class that is no longer used by Kafka and will be removed in a future release. Please use org.apache.kafka.clients.admin.AdminClient instead.
[warn]     zkUtils = ZkUtils(s"$zkHost:$zkPort", zkSessionTimeout, zkConnectionTimeout, false)
[warn]               ^
[warn] /home/jenkins/workspace/spark-branch-2.4-test-maven-hadoop-2.7/external/kafka-0-10-sql/src/test/scala/org/apache/spark/sql/kafka010/KafkaTestUtils.scala:198: method createTopic in object AdminUtils is deprecated: This method is deprecated and will be replaced by kafka.zk.AdminZkClient.
[warn]         AdminUtils.createTopic(zkUtils, topic, partitions, 1)
[warn]                    ^
[warn] /home/jenkins/workspace/spark-branch-2.4-test-maven-hadoop-2.7/external/kafka-0-10-sql/src/test/scala/org/apache/spark/sql/kafka010/KafkaTestUtils.scala:225: method deleteTopic in object AdminUtils is deprecated: This method is deprecated and will be replaced by kafka.zk.AdminZkClient.
[warn]     AdminUtils.deleteTopic(zkUtils, topic)
[warn]                ^
[warn] /home/jenkins/workspace/spark-branch-2.4-test-maven-hadoop-2.7/external/kafka-0-10-sql/src/test/scala/org/apache/spark/sql/kafka010/KafkaTestUtils.scala:290: method poll in class KafkaConsumer is deprecated: see corresponding Javadoc for more information.
[warn]     kc.poll(0)
[warn]        ^
[warn] /home/jenkins/workspace/spark-branch-2.4-test-maven-hadoop-2.7/external/kafka-0-10-sql/src/test/scala/org/apache/spark/sql/kafka010/KafkaTestUtils.scala:304: method poll in class KafkaConsumer is deprecated: see corresponding Javadoc for more information.
[warn]     kc.poll(0)
[warn]        ^
[warn] /home/jenkins/workspace/spark-branch-2.4-test-maven-hadoop-2.7/external/kafka-0-10-sql/src/test/scala/org/apache/spark/sql/kafka010/KafkaTestUtils.scala:383: object ZkUtils in package utils is deprecated: This is an internal class that is no longer used by Kafka and will be removed in a future release. Please use org.apache.kafka.clients.admin.AdminClient instead.
[warn]       !zkUtils.pathExists(getDeleteTopicPath(topic)),
[warn]                           ^
[warn] /home/jenkins/workspace/spark-branch-2.4-test-maven-hadoop-2.7/external/kafka-0-10-sql/src/test/scala/org/apache/spark/sql/kafka010/KafkaTestUtils.scala:384: object ZkUtils in package utils is deprecated: This is an internal class that is no longer used by Kafka and will be removed in a future release. Please use org.apache.kafka.clients.admin.AdminClient instead.
[warn]       s"${getDeleteTopicPath(topic)} still exists")
[warn]           ^
[warn] /home/jenkins/workspace/spark-branch-2.4-test-maven-hadoop-2.7/external/kafka-0-10-sql/src/test/scala/org/apache/spark/sql/kafka010/KafkaTestUtils.scala:385: object ZkUtils in package utils is deprecated: This is an internal class that is no longer used by Kafka and will be removed in a future release. Please use org.apache.kafka.clients.admin.AdminClient instead.
[warn]     assert(!zkUtils.pathExists(getTopicPath(topic)), s"${getTopicPath(topic)} still exists")
[warn]                                ^
[warn] /home/jenkins/workspace/spark-branch-2.4-test-maven-hadoop-2.7/external/kafka-0-10-sql/src/test/scala/org/apache/spark/sql/kafka010/KafkaTestUtils.scala:385: object ZkUtils in package utils is deprecated: This is an internal class that is no longer used by Kafka and will be removed in a future release. Please use org.apache.kafka.clients.admin.AdminClient instead.
[warn]     assert(!zkUtils.pathExists(getTopicPath(topic)), s"${getTopicPath(topic)} still exists")
[warn]                                                          ^
[warn] /home/jenkins/workspace/spark-branch-2.4-test-maven-hadoop-2.7/external/kafka-0-10-sql/src/test/scala/org/apache/spark/sql/kafka010/KafkaTestUtils.scala:409: class ZkUtils in package utils is deprecated: This is an internal class that is no longer used by Kafka and will be removed in a future release. Please use org.apache.kafka.clients.admin.AdminClient instead.
[warn]       zkUtils: ZkUtils,
[warn]                ^
[warn] /home/jenkins/workspace/spark-branch-2.4-test-maven-hadoop-2.7/external/kafka-0-10-sql/src/test/scala/org/apache/spark/sql/kafka010/KafkaTestUtils.scala:421: method deleteTopic in object AdminUtils is deprecated: This method is deprecated and will be replaced by kafka.zk.AdminZkClient.
[warn]           AdminUtils.deleteTopic(zkUtils, topic)
[warn]                      ^
[warn] 14 warnings found
[info] Compile success at Sep 25, 2020 10:24:03 AM [20.143s]
[INFO] 
[INFO] --- maven-surefire-plugin:2.22.0:test (default-test) @ spark-sql-kafka-0-10_2.11 ---
[INFO] 
[INFO] -------------------------------------------------------
[INFO]  T E S T S
[INFO] -------------------------------------------------------
[INFO] 
[INFO] Results:
[INFO] 
[INFO] Tests run: 0, Failures: 0, Errors: 0, Skipped: 0
[INFO] 
[INFO] 
[INFO] --- maven-surefire-plugin:2.22.0:test (test) @ spark-sql-kafka-0-10_2.11 ---
[INFO] Skipping execution of surefire because it has already been run for this configuration
[INFO] 
[INFO] --- scalatest-maven-plugin:1.0:test (test) @ spark-sql-kafka-0-10_2.11 ---
Discovery starting.
Discovery completed in 636 milliseconds.
Run starting. Expected test count is: 171
KafkaMicroBatchV2SourceSuite:
- cannot stop Kafka stream
- assign from latest offsets (failOnDataLoss: true)
- assign from earliest offsets (failOnDataLoss: true)
- assign from specific offsets (failOnDataLoss: true)
- subscribing topic by name from latest offsets (failOnDataLoss: true)
- subscribing topic by name from earliest offsets (failOnDataLoss: true)
- subscribing topic by name from specific offsets (failOnDataLoss: true)
- subscribing topic by pattern from latest offsets (failOnDataLoss: true)
- subscribing topic by pattern from earliest offsets (failOnDataLoss: true)
- subscribing topic by pattern from specific offsets (failOnDataLoss: true)
- assign from latest offsets (failOnDataLoss: false)
- assign from earliest offsets (failOnDataLoss: false)
- assign from specific offsets (failOnDataLoss: false)
- subscribing topic by name from latest offsets (failOnDataLoss: false)
- subscribing topic by name from earliest offsets (failOnDataLoss: false)
- subscribing topic by name from specific offsets (failOnDataLoss: false)
- subscribing topic by pattern from latest offsets (failOnDataLoss: false)
- subscribing topic by pattern from earliest offsets (failOnDataLoss: false)
- subscribing topic by pattern from specific offsets (failOnDataLoss: false)
- bad source options
- unsupported kafka configs
- get offsets from case insensitive parameters
- Kafka column types
- (de)serialization of initial offsets
- SPARK-26718 Rate limit set to Long.Max should not overflow integer during end offset calculation
- maxOffsetsPerTrigger
- input row metrics
- subscribing topic by pattern with topic deletions
- subscribe topic by pattern with topic recreation between batches
- ensure that initial offset are written with an extra byte in the beginning (SPARK-19517)
- deserialization of initial offset written by Spark 2.1.0 (SPARK-19517)
- deserialization of initial offset written by future version
- KafkaSource with watermark
- delete a topic when a Spark job is running
- SPARK-22956: currentPartitionOffsets should be set when no new data comes in
- ensure stream-stream self-join generates only one offset in log and correct metrics
- read Kafka transactional messages: read_committed
- read Kafka transactional messages: read_uncommitted
- SPARK-25495: FetchedData.reset should reset all fields
- SPARK-27494: read kafka record containing null key/values.
- V2 Source is used by default
- minPartitions is supported
KafkaContinuousSourceStressForDontFailOnDataLossSuite:
- stress test for failOnDataLoss=false *** FAILED ***
  java.util.concurrent.TimeoutException: Timeout after waiting for 10000 ms.
  at org.apache.kafka.clients.producer.internals.FutureRecordMetadata.get(FutureRecordMetadata.java:76)
  at org.apache.kafka.clients.producer.internals.FutureRecordMetadata.get(FutureRecordMetadata.java:29)
  at org.apache.spark.sql.kafka010.KafkaTestUtils$$anonfun$2.apply(KafkaTestUtils.scala:269)
  at org.apache.spark.sql.kafka010.KafkaTestUtils$$anonfun$2.apply(KafkaTestUtils.scala:263)
  at scala.collection.TraversableLike$$anonfun$map$1.apply(TraversableLike.scala:234)
  at scala.collection.TraversableLike$$anonfun$map$1.apply(TraversableLike.scala:234)
  at scala.collection.IndexedSeqOptimized$class.foreach(IndexedSeqOptimized.scala:33)
  at scala.collection.mutable.ArrayOps$ofRef.foreach(ArrayOps.scala:186)
  at scala.collection.TraversableLike$class.map(TraversableLike.scala:234)
  at scala.collection.mutable.ArrayOps$ofRef.map(ArrayOps.scala:186)
  ...
KafkaContinuousSinkSuite:
- ensure continuous stream is being used
- streaming - write to kafka with topic field
- streaming - write w/o topic field, with topic option
- streaming - topic field and topic option
- null topic attribute
- streaming - write data with bad schema
- streaming - write data with valid schema but wrong types
- streaming - write to non-existing topic
- streaming - exception on config serializer
- generic - write big data with small producer buffer
KafkaOffsetRangeCalculatorSuite:
- with no minPartition: N TopicPartitions to N offset ranges
- with no minPartition: empty ranges ignored
- with minPartition = 3: N TopicPartitions to N offset ranges
- with minPartition = 4: 1 TopicPartition to N offset ranges
- with minPartition = 3: N skewed TopicPartitions to M offset ranges
- with minPartition = 3: range inexact multiple of minPartitions
- with minPartition = 3: empty ranges ignored
- with minPartition = 6: SPARK-28489: never drop offsets
KafkaMicroBatchV1SourceSuite:
- cannot stop Kafka stream
- assign from latest offsets (failOnDataLoss: true)
- assign from earliest offsets (failOnDataLoss: true)
- assign from specific offsets (failOnDataLoss: true)
- subscribing topic by name from latest offsets (failOnDataLoss: true)
- subscribing topic by name from earliest offsets (failOnDataLoss: true)
- subscribing topic by name from specific offsets (failOnDataLoss: true)
- subscribing topic by pattern from latest offsets (failOnDataLoss: true)
- subscribing topic by pattern from earliest offsets (failOnDataLoss: true)
- subscribing topic by pattern from specific offsets (failOnDataLoss: true)
- assign from latest offsets (failOnDataLoss: false)
- assign from earliest offsets (failOnDataLoss: false)
- assign from specific offsets (failOnDataLoss: false)
- subscribing topic by name from latest offsets (failOnDataLoss: false)
- subscribing topic by name from earliest offsets (failOnDataLoss: false)
- subscribing topic by name from specific offsets (failOnDataLoss: false)
- subscribing topic by pattern from latest offsets (failOnDataLoss: false)
- subscribing topic by pattern from earliest offsets (failOnDataLoss: false)
- subscribing topic by pattern from specific offsets (failOnDataLoss: false)
- bad source options
- unsupported kafka configs
- get offsets from case insensitive parameters
- Kafka column types
- (de)serialization of initial offsets
- SPARK-26718 Rate limit set to Long.Max should not overflow integer during end offset calculation
- maxOffsetsPerTrigger
- input row metrics
- subscribing topic by pattern with topic deletions
- subscribe topic by pattern with topic recreation between batches
- ensure that initial offset are written with an extra byte in the beginning (SPARK-19517)
- deserialization of initial offset written by Spark 2.1.0 (SPARK-19517)
- deserialization of initial offset written by future version
- KafkaSource with watermark
- delete a topic when a Spark job is running
- SPARK-22956: currentPartitionOffsets should be set when no new data comes in
- ensure stream-stream self-join generates only one offset in log and correct metrics
- read Kafka transactional messages: read_committed
- read Kafka transactional messages: read_uncommitted
- SPARK-25495: FetchedData.reset should reset all fields
- SPARK-27494: read kafka record containing null key/values.
- V1 Source is used when disabled through SQLConf
KafkaDataConsumerSuite:
- SPARK-19886: Report error cause correctly in reportDataLoss
- SPARK-23623: concurrent use of KafkaDataConsumer
JsonUtilsSuite:
- parsing partitions
- parsing partitionOffsets
KafkaSourceOffsetSuite:
- comparison {"t":{"0":1}} <=> {"t":{"0":2}}
- comparison {"t":{"1":0,"0":1}} <=> {"t":{"1":1,"0":2}}
- comparison {"t":{"0":1},"T":{"0":0}} <=> {"t":{"0":2},"T":{"0":1}}
- comparison {"t":{"0":1}} <=> {"t":{"1":1,"0":2}}
- comparison {"t":{"0":1}} <=> {"t":{"1":3,"0":2}}
- basic serialization - deserialization
- OffsetSeqLog serialization - deserialization
- read Spark 2.1.0 offset format
KafkaSinkSuite:
- batch - write to kafka
- batch - null topic field value, and no topic option
- batch - unsupported save modes
- SPARK-20496: batch - enforce analyzed plans
- streaming - write to kafka with topic field
- streaming - write aggregation w/o topic field, with topic option
- streaming - aggregation with topic field and topic option
- streaming - write data with bad schema
- streaming - write data with valid schema but wrong types
- streaming - write to non-existing topic
- streaming - exception on config serializer
- generic - write big data with small producer buffer
KafkaRelationSuite:
- explicit earliest to latest offsets
- default starting and ending offsets
- explicit offsets
- reuse same dataframe in query
- test late binding start offsets
- bad batch query options
- read Kafka transactional messages: read_committed
- read Kafka transactional messages: read_uncommitted
KafkaSourceStressSuite:
- stress test with multiple topics and partitions
KafkaDontFailOnDataLossSuite:
- failOnDataLoss=false should not return duplicated records: v1
- failOnDataLoss=false should not return duplicated records: v2
- failOnDataLoss=false should not return duplicated records: continuous processing
- failOnDataLoss=false should not return duplicated records: batch
CachedKafkaProducerSuite:
- Should return the cached instance on calling getOrCreate with same params.
- Should close the correct kafka producer for the given kafkaPrams.
KafkaContinuousSourceSuite:
- cannot stop Kafka stream
- assign from latest offsets (failOnDataLoss: true)
- assign from earliest offsets (failOnDataLoss: true)
- assign from specific offsets (failOnDataLoss: true)
- subscribing topic by name from latest offsets (failOnDataLoss: true)
- subscribing topic by name from earliest offsets (failOnDataLoss: true)
- subscribing topic by name from specific offsets (failOnDataLoss: true)
- subscribing topic by pattern from latest offsets (failOnDataLoss: true)
- subscribing topic by pattern from earliest offsets (failOnDataLoss: true)
- subscribing topic by pattern from specific offsets (failOnDataLoss: true)
- assign from latest offsets (failOnDataLoss: false)
- assign from earliest offsets (failOnDataLoss: false)
- assign from specific offsets (failOnDataLoss: false)
- subscribing topic by name from latest offsets (failOnDataLoss: false)
- subscribing topic by name from earliest offsets (failOnDataLoss: false)
- subscribing topic by name from specific offsets (failOnDataLoss: false)
- subscribing topic by pattern from latest offsets (failOnDataLoss: false)
- subscribing topic by pattern from earliest offsets (failOnDataLoss: false)
- subscribing topic by pattern from specific offsets (failOnDataLoss: false)
- bad source options
- unsupported kafka configs
- get offsets from case insensitive parameters
- Kafka column types
- ensure continuous stream is being used
- read Kafka transactional messages: read_committed
- read Kafka transactional messages: read_uncommitted
- SPARK-27494: read kafka record containing null key/values.
KafkaSourceStressForDontFailOnDataLossSuite:
- stress test for failOnDataLoss=false
KafkaContinuousSourceTopicDeletionSuite:
- ensure continuous stream is being used
- subscribing topic by pattern with topic deletions
Run completed in 12 minutes, 6 seconds.
Total number of tests run: 171
Suites: completed 17, aborted 0
Tests: succeeded 170, failed 1, canceled 0, ignored 0, pending 0
*** 1 TEST FAILED ***
[INFO] 
[INFO] ---------< org.apache.spark:spark-streaming-kinesis-asl_2.11 >----------
[INFO] Building Spark Kinesis Integration 2.4.8-SNAPSHOT                [26/30]
[INFO] --------------------------------[ jar ]---------------------------------
[INFO] 
[INFO] --- maven-enforcer-plugin:3.0.0-M1:enforce (enforce-versions) @ spark-streaming-kinesis-asl_2.11 ---
[INFO] 
[INFO] --- maven-enforcer-plugin:3.0.0-M1:enforce (enforce-no-duplicate-dependencies) @ spark-streaming-kinesis-asl_2.11 ---
[INFO] 
[INFO] --- scala-maven-plugin:3.2.2:add-source (eclipse-add-source) @ spark-streaming-kinesis-asl_2.11 ---
[INFO] Add Source directory: /home/jenkins/workspace/spark-branch-2.4-test-maven-hadoop-2.7/external/kinesis-asl/src/main/scala
[INFO] Add Test Source directory: /home/jenkins/workspace/spark-branch-2.4-test-maven-hadoop-2.7/external/kinesis-asl/src/test/scala
[INFO] 
[INFO] --- maven-dependency-plugin:3.0.2:build-classpath (default-cli) @ spark-streaming-kinesis-asl_2.11 ---
[INFO] Dependencies classpath:
/home/jenkins/.m2/repository/com/fasterxml/jackson/module/jackson-module-scala_2.11/2.6.7.1/jackson-module-scala_2.11-2.6.7.1.jar:/home/jenkins/.m2/repository/org/apache/htrace/htrace-core/3.1.0-incubating/htrace-core-3.1.0-incubating.jar:/home/jenkins/.m2/repository/org/lz4/lz4-java/1.4.0/lz4-java-1.4.0.jar:/home/jenkins/.m2/repository/com/google/protobuf/protobuf-java/2.5.0/protobuf-java-2.5.0.jar:/home/jenkins/.m2/repository/com/fasterxml/jackson/module/jackson-module-paranamer/2.7.9/jackson-module-paranamer-2.7.9.jar:/home/jenkins/.m2/repository/org/apache/commons/commons-compress/1.8.1/commons-compress-1.8.1.jar:/home/jenkins/.m2/repository/org/json4s/json4s-ast_2.11/3.5.3/json4s-ast_2.11-3.5.3.jar:/home/jenkins/.m2/repository/io/netty/netty-all/4.1.47.Final/netty-all-4.1.47.Final.jar:/home/jenkins/.m2/repository/com/thoughtworks/paranamer/paranamer/2.8/paranamer-2.8.jar:/home/jenkins/.m2/repository/org/fusesource/leveldbjni/leveldbjni-all/1.8/leveldbjni-all-1.8.jar:/home/jenkins/.m2/repository/org/tukaani/xz/1.5/xz-1.5.jar:/home/jenkins/workspace/spark-branch-2.4-test-maven-hadoop-2.7/common/kvstore/target/scala-2.11/classes:/home/jenkins/.m2/repository/org/glassfish/jersey/bundles/repackaged/jersey-guava/2.22.2/jersey-guava-2.22.2.jar:/home/jenkins/.m2/repository/com/amazonaws/aws-java-sdk-core/1.11.655/aws-java-sdk-core-1.11.655.jar:/home/jenkins/.m2/repository/org/apache/commons/commons-crypto/1.0.0/commons-crypto-1.0.0.jar:/home/jenkins/.m2/repository/com/amazonaws/aws-java-sdk-sts/1.11.655/aws-java-sdk-sts-1.11.655.jar:/home/jenkins/.m2/repository/com/amazonaws/aws-java-sdk-cloudwatch/1.11.655/aws-java-sdk-cloudwatch-1.11.655.jar:/home/jenkins/.m2/repository/commons-io/commons-io/2.4/commons-io-2.4.jar:/home/jenkins/.m2/repository/org/scala-lang/scala-reflect/2.11.12/scala-reflect-2.11.12.jar:/home/jenkins/.m2/repository/org/apache/commons/commons-lang3/3.5/commons-lang3-3.5.jar:/home/jenkins/.m2/repository/org/codehaus/jackson/jackson-jaxrs/1.9.13/jackson-jaxrs-1.9.13.jar:/home/jenkins/.m2/repository/org/apache/hadoop/hadoop-auth/2.7.3/hadoop-auth-2.7.3.jar:/home/jenkins/.m2/repository/com/esotericsoftware/kryo-shaded/4.0.2/kryo-shaded-4.0.2.jar:/home/jenkins/.m2/repository/com/esotericsoftware/minlog/1.3.0/minlog-1.3.0.jar:/home/jenkins/.m2/repository/org/apache/hadoop/hadoop-client/2.7.3/hadoop-client-2.7.3.jar:/home/jenkins/.m2/repository/org/apache/hadoop/hadoop-mapreduce-client-shuffle/2.7.3/hadoop-mapreduce-client-shuffle-2.7.3.jar:/home/jenkins/.m2/repository/org/codehaus/jackson/jackson-core-asl/1.9.13/jackson-core-asl-1.9.13.jar:/home/jenkins/.m2/repository/javax/validation/validation-api/1.1.0.Final/validation-api-1.1.0.Final.jar:/home/jenkins/workspace/spark-branch-2.4-test-maven-hadoop-2.7/core/target/scala-2.11/classes:/home/jenkins/.m2/repository/org/glassfish/jersey/core/jersey-common/2.22.2/jersey-common-2.22.2.jar:/home/jenkins/.m2/repository/org/apache/hadoop/hadoop-mapreduce-client-core/2.7.3/hadoop-mapreduce-client-core-2.7.3.jar:/home/jenkins/.m2/repository/joda-time/joda-time/2.9.3/joda-time-2.9.3.jar:/home/jenkins/.m2/repository/org/scala-lang/modules/scala-xml_2.11/1.0.5/scala-xml_2.11-1.0.5.jar:/home/jenkins/.m2/repository/com/amazonaws/aws-java-sdk-kms/1.11.655/aws-java-sdk-kms-1.11.655.jar:/home/jenkins/.m2/repository/com/google/code/findbugs/jsr305/1.3.9/jsr305-1.3.9.jar:/home/jenkins/.m2/repository/commons-net/commons-net/3.1/commons-net-3.1.jar:/home/jenkins/.m2/repository/javax/xml/bind/jaxb-api/2.2.2/jaxb-api-2.2.2.jar:/home/jenkins/.m2/repository/org/glassfish/hk2/hk2-api/2.4.0-b34/hk2-api-2.4.0-b34.jar:/home/jenkins/.m2/repository/org/xerial/snappy/snappy-java/1.1.7.5/snappy-java-1.1.7.5.jar:/home/jenkins/.m2/repository/org/glassfish/jersey/core/jersey-server/2.22.2/jersey-server-2.22.2.jar:/home/jenkins/.m2/repository/com/twitter/chill_2.11/0.9.3/chill_2.11-0.9.3.jar:/home/jenkins/.m2/repository/commons-lang/commons-lang/2.6/commons-lang-2.6.jar:/home/jenkins/.m2/repository/org/apache/hadoop/hadoop-yarn-client/2.7.3/hadoop-yarn-client-2.7.3.jar:/home/jenkins/.m2/repository/com/amazonaws/aws-java-sdk-s3/1.11.655/aws-java-sdk-s3-1.11.655.jar:/home/jenkins/.m2/repository/com/amazonaws/aws-java-sdk-dynamodb/1.11.655/aws-java-sdk-dynamodb-1.11.655.jar:/home/jenkins/.m2/repository/org/apache/zookeeper/zookeeper/3.4.6/zookeeper-3.4.6.jar:/home/jenkins/.m2/repository/javax/activation/activation/1.1.1/activation-1.1.1.jar:/home/jenkins/.m2/repository/commons-codec/commons-codec/1.10/commons-codec-1.10.jar:/home/jenkins/.m2/repository/org/json4s/json4s-jackson_2.11/3.5.3/json4s-jackson_2.11-3.5.3.jar:/home/jenkins/.m2/repository/org/javassist/javassist/3.18.1-GA/javassist-3.18.1-GA.jar:/home/jenkins/.m2/repository/org/apache/xbean/xbean-asm6-shaded/4.8/xbean-asm6-shaded-4.8.jar:/home/jenkins/.m2/repository/commons-beanutils/commons-beanutils/1.9.4/commons-beanutils-1.9.4.jar:/home/jenkins/.m2/repository/org/apache/ivy/ivy/2.4.0/ivy-2.4.0.jar:/home/jenkins/.m2/repository/javax/servlet/javax.servlet-api/3.1.0/javax.servlet-api-3.1.0.jar:/home/jenkins/.m2/repository/org/glassfish/hk2/osgi-resource-locator/1.0.1/osgi-resource-locator-1.0.1.jar:/home/jenkins/.m2/repository/com/fasterxml/jackson/core/jackson-core/2.6.7/jackson-core-2.6.7.jar:/home/jenkins/.m2/repository/org/apache/commons/commons-math3/3.4.1/commons-math3-3.4.1.jar:/home/jenkins/.m2/repository/org/apache/hadoop/hadoop-mapreduce-client-common/2.7.3/hadoop-mapreduce-client-common-2.7.3.jar:/home/jenkins/.m2/repository/io/dropwizard/metrics/metrics-graphite/3.1.5/metrics-graphite-3.1.5.jar:/home/jenkins/.m2/repository/javax/xml/stream/stax-api/1.0-2/stax-api-1.0-2.jar:/home/jenkins/.m2/repository/org/apache/hadoop/hadoop-mapreduce-client-jobclient/2.7.3/hadoop-mapreduce-client-jobclient-2.7.3.jar:/home/jenkins/.m2/repository/org/codehaus/jackson/jackson-xc/1.9.13/jackson-xc-1.9.13.jar:/home/jenkins/.m2/repository/com/amazonaws/amazon-kinesis-client/1.12.0/amazon-kinesis-client-1.12.0.jar:/home/jenkins/.m2/repository/org/glassfish/hk2/hk2-utils/2.4.0-b34/hk2-utils-2.4.0-b34.jar:/home/jenkins/.m2/repository/org/glassfish/hk2/external/aopalliance-repackaged/2.4.0-b34/aopalliance-repackaged-2.4.0-b34.jar:/home/jenkins/.m2/repository/net/sf/py4j/py4j/0.10.7/py4j-0.10.7.jar:/home/jenkins/.m2/repository/org/json4s/json4s-scalap_2.11/3.5.3/json4s-scalap_2.11-3.5.3.jar:/home/jenkins/.m2/repository/org/glassfish/hk2/external/javax.inject/2.4.0-b34/javax.inject-2.4.0-b34.jar:/home/jenkins/.m2/repository/org/glassfish/jersey/containers/jersey-container-servlet-core/2.22.2/jersey-container-servlet-core-2.22.2.jar:/home/jenkins/.m2/repository/oro/oro/2.0.8/oro-2.0.8.jar:/home/jenkins/.m2/repository/org/apache/avro/avro-mapred/1.8.2/avro-mapred-1.8.2-hadoop2.jar:/home/jenkins/workspace/spark-branch-2.4-test-maven-hadoop-2.7/common/network-common/target/scala-2.11/classes:/home/jenkins/.m2/repository/org/apache/hadoop/hadoop-yarn-common/2.7.3/hadoop-yarn-common-2.7.3.jar:/home/jenkins/workspace/spark-branch-2.4-test-maven-hadoop-2.7/common/unsafe/target/scala-2.11/classes:/home/jenkins/.m2/repository/org/apache/hadoop/hadoop-yarn-api/2.7.3/hadoop-yarn-api-2.7.3.jar:/home/jenkins/.m2/repository/log4j/log4j/1.2.17/log4j-1.2.17.jar:/home/jenkins/.m2/repository/org/apache/hadoop/hadoop-yarn-server-common/2.7.3/hadoop-yarn-server-common-2.7.3.jar:/home/jenkins/.m2/repository/org/apache/httpcomponents/httpcore/4.4.10/httpcore-4.4.10.jar:/home/jenkins/workspace/spark-branch-2.4-test-maven-hadoop-2.7/streaming/target/scala-2.11/classes:/home/jenkins/.m2/repository/org/apache/curator/curator-framework/2.7.1/curator-framework-2.7.1.jar:/home/jenkins/.m2/repository/org/apache/curator/curator-recipes/2.7.1/curator-recipes-2.7.1.jar:/home/jenkins/.m2/repository/io/dropwizard/metrics/metrics-json/3.1.5/metrics-json-3.1.5.jar:/home/jenkins/.m2/repository/com/amazonaws/aws-java-sdk-kinesis/1.11.655/aws-java-sdk-kinesis-1.11.655.jar:/home/jenkins/.m2/repository/org/apache/avro/avro/1.8.2/avro-1.8.2.jar:/home/jenkins/.m2/repository/org/apache/directory/server/apacheds-kerberos-codec/2.0.0-M15/apacheds-kerberos-codec-2.0.0-M15.jar:/home/jenkins/.m2/repository/io/dropwizard/metrics/metrics-core/3.1.5/metrics-core-3.1.5.jar:/home/jenkins/workspace/spark-branch-2.4-test-maven-hadoop-2.7/common/tags/target/scala-2.11/classes:/home/jenkins/.m2/repository/org/slf4j/slf4j-api/1.7.16/slf4j-api-1.7.16.jar:/home/jenkins/workspace/spark-branch-2.4-test-maven-hadoop-2.7/launcher/target/scala-2.11/classes:/home/jenkins/.m2/repository/org/mortbay/jetty/jetty-util/6.1.26/jetty-util-6.1.26.jar:/home/jenkins/.m2/repository/org/codehaus/jackson/jackson-mapper-asl/1.9.13/jackson-mapper-asl-1.9.13.jar:/home/jenkins/workspace/spark-branch-2.4-test-maven-hadoop-2.7/common/network-shuffle/target/scala-2.11/classes:/home/jenkins/.m2/repository/javax/ws/rs/javax.ws.rs-api/2.0.1/javax.ws.rs-api-2.0.1.jar:/home/jenkins/.m2/repository/javax/servlet/jsp/jsp-api/2.1/jsp-api-2.1.jar:/home/jenkins/.m2/repository/org/glassfish/jersey/core/jersey-client/2.22.2/jersey-client-2.22.2.jar:/home/jenkins/.m2/repository/io/netty/netty/3.9.9.Final/netty-3.9.9.Final.jar:/home/jenkins/.m2/repository/org/roaringbitmap/shims/0.7.45/shims-0.7.45.jar:/home/jenkins/.m2/repository/org/apache/avro/avro-ipc/1.8.2/avro-ipc-1.8.2.jar:/home/jenkins/.m2/repository/xmlenc/xmlenc/0.52/xmlenc-0.52.jar:/home/jenkins/.m2/repository/com/ning/compress-lzf/1.0.3/compress-lzf-1.0.3.jar:/home/jenkins/.m2/repository/org/apache/hadoop/hadoop-hdfs/2.7.3/hadoop-hdfs-2.7.3.jar:/home/jenkins/.m2/repository/org/apache/directory/api/api-util/1.0.0-M20/api-util-1.0.0-M20.jar:/home/jenkins/.m2/repository/com/google/code/gson/gson/2.2.4/gson-2.2.4.jar:/home/jenkins/.m2/repository/org/apache/directory/api/api-asn1-api/1.0.0-M20/api-asn1-api-1.0.0-M20.jar:/home/jenkins/.m2/repository/com/clearspring/analytics/stream/2.7.0/stream-2.7.0.jar:/home/jenkins/.m2/repository/org/apache/hadoop/hadoop-common/2.7.3/hadoop-common-2.7.3.jar:/home/jenkins/.m2/repository/com/fasterxml/jackson/core/jackson-annotations/2.6.7/jackson-annotations-2.6.7.jar:/home/jenkins/.m2/repository/commons-configuration/commons-configuration/1.6/commons-configuration-1.6.jar:/home/jenkins/.m2/repository/org/glassfish/jersey/containers/jersey-container-servlet/2.22.2/jersey-container-servlet-2.22.2.jar:/home/jenkins/.m2/repository/commons-digester/commons-digester/1.8/commons-digester-1.8.jar:/home/jenkins/.m2/repository/org/slf4j/jul-to-slf4j/1.7.16/jul-to-slf4j-1.7.16.jar:/home/jenkins/.m2/repository/org/scala-lang/scala-library/2.11.12/scala-library-2.11.12.jar:/home/jenkins/.m2/repository/org/apache/directory/server/apacheds-i18n/2.0.0-M15/apacheds-i18n-2.0.0-M15.jar:/home/jenkins/.m2/repository/com/fasterxml/jackson/dataformat/jackson-dataformat-cbor/2.6.7/jackson-dataformat-cbor-2.6.7.jar:/home/jenkins/.m2/repository/org/apache/curator/curator-client/2.7.1/curator-client-2.7.1.jar:/home/jenkins/.m2/repository/org/roaringbitmap/RoaringBitmap/0.7.45/RoaringBitmap-0.7.45.jar:/home/jenkins/.m2/repository/com/fasterxml/jackson/core/jackson-databind/2.6.7.3/jackson-databind-2.6.7.3.jar:/home/jenkins/.m2/repository/commons-cli/commons-cli/1.2/commons-cli-1.2.jar:/home/jenkins/.m2/repository/xerces/xercesImpl/2.9.1/xercesImpl-2.9.1.jar:/home/jenkins/.m2/repository/javax/annotation/javax.annotation-api/1.2/javax.annotation-api-1.2.jar:/home/jenkins/.m2/repository/org/objenesis/objenesis/2.1/objenesis-2.1.jar:/home/jenkins/.m2/repository/org/slf4j/slf4j-log4j12/1.7.16/slf4j-log4j12-1.7.16.jar:/home/jenkins/.m2/repository/org/glassfish/jersey/media/jersey-media-jaxb/2.22.2/jersey-media-jaxb-2.22.2.jar:/home/jenkins/.m2/repository/org/spark-project/spark/unused/1.0.0/unused-1.0.0.jar:/home/jenkins/.m2/repository/com/twitter/chill-java/0.9.3/chill-java-0.9.3.jar:/home/jenkins/.m2/repository/io/dropwizard/metrics/metrics-jvm/3.1.5/metrics-jvm-3.1.5.jar:/home/jenkins/.m2/repository/org/apache/hadoop/hadoop-annotations/2.7.3/hadoop-annotations-2.7.3.jar:/home/jenkins/.m2/repository/com/github/luben/zstd-jni/1.3.2-2/zstd-jni-1.3.2-2.jar:/home/jenkins/.m2/repository/org/json4s/json4s-core_2.11/3.5.3/json4s-core_2.11-3.5.3.jar:/home/jenkins/.m2/repository/commons-collections/commons-collections/3.2.2/commons-collections-3.2.2.jar:/home/jenkins/.m2/repository/org/glassfish/hk2/hk2-locator/2.4.0-b34/hk2-locator-2.4.0-b34.jar:/home/jenkins/.m2/repository/org/apache/hadoop/hadoop-mapreduce-client-app/2.7.3/hadoop-mapreduce-client-app-2.7.3.jar:/home/jenkins/.m2/repository/commons-logging/commons-logging/1.1.3/commons-logging-1.1.3.jar:/home/jenkins/.m2/repository/net/razorvine/pyrolite/4.13/pyrolite-4.13.jar:/home/jenkins/.m2/repository/org/apache/httpcomponents/httpclient/4.5.6/httpclient-4.5.6.jar:/home/jenkins/.m2/repository/com/amazonaws/jmespath-java/1.11.655/jmespath-java-1.11.655.jar:/home/jenkins/.m2/repository/software/amazon/ion/ion-java/1.0.2/ion-java-1.0.2.jar:/home/jenkins/.m2/repository/org/slf4j/jcl-over-slf4j/1.7.16/jcl-over-slf4j-1.7.16.jar:/home/jenkins/.m2/repository/commons-httpclient/commons-httpclient/3.1/commons-httpclient-3.1.jar
[INFO] 
[INFO] --- maven-remote-resources-plugin:1.5:process (process-resource-bundles) @ spark-streaming-kinesis-asl_2.11 ---
[INFO] 
[INFO] --- maven-resources-plugin:2.7:resources (default-resources) @ spark-streaming-kinesis-asl_2.11 ---
[INFO] Using 'UTF-8' encoding to copy filtered resources.
[INFO] Copying 1 resource
[INFO] Copying 3 resources
[INFO] 
[INFO] --- maven-compiler-plugin:3.7.0:compile (default-compile) @ spark-streaming-kinesis-asl_2.11 ---
[INFO] Not compiling main sources
[INFO] 
[INFO] --- scala-maven-plugin:3.2.2:compile (scala-compile-first) @ spark-streaming-kinesis-asl_2.11 ---
[INFO] Using zinc server for incremental compilation
[info] Compiling 11 Scala sources and 2 Java sources to /home/jenkins/workspace/spark-branch-2.4-test-maven-hadoop-2.7/external/kinesis-asl/target/scala-2.11/classes...
[warn] /home/jenkins/workspace/spark-branch-2.4-test-maven-hadoop-2.7/external/kinesis-asl/src/main/scala/org/apache/spark/examples/streaming/KinesisWordCountASL.scala:107: constructor AmazonKinesisClient in class AmazonKinesisClient is deprecated: see corresponding Javadoc for more information.
[warn]     val kinesisClient = new AmazonKinesisClient(credentials)
[warn]                         ^
[warn] /home/jenkins/workspace/spark-branch-2.4-test-maven-hadoop-2.7/external/kinesis-asl/src/main/scala/org/apache/spark/examples/streaming/KinesisWordCountASL.scala:108: method setEndpoint in class AmazonWebServiceClient is deprecated: see corresponding Javadoc for more information.
[warn]     kinesisClient.setEndpoint(endpointUrl)
[warn]                   ^
[warn] /home/jenkins/workspace/spark-branch-2.4-test-maven-hadoop-2.7/external/kinesis-asl/src/main/scala/org/apache/spark/examples/streaming/KinesisWordCountASL.scala:223: constructor AmazonKinesisClient in class AmazonKinesisClient is deprecated: see corresponding Javadoc for more information.
[warn]     val kinesisClient = new AmazonKinesisClient(new DefaultAWSCredentialsProviderChain())
[warn]                         ^
[warn] /home/jenkins/workspace/spark-branch-2.4-test-maven-hadoop-2.7/external/kinesis-asl/src/main/scala/org/apache/spark/examples/streaming/KinesisWordCountASL.scala:224: method setEndpoint in class AmazonWebServiceClient is deprecated: see corresponding Javadoc for more information.
[warn]     kinesisClient.setEndpoint(endpoint)
[warn]                   ^
[warn] /home/jenkins/workspace/spark-branch-2.4-test-maven-hadoop-2.7/external/kinesis-asl/src/main/scala/org/apache/spark/streaming/kinesis/KinesisBackedBlockRDD.scala:140: constructor AmazonKinesisClient in class AmazonKinesisClient is deprecated: see corresponding Javadoc for more information.
[warn]   private val client = new AmazonKinesisClient(credentials)
[warn]                        ^
[warn] /home/jenkins/workspace/spark-branch-2.4-test-maven-hadoop-2.7/external/kinesis-asl/src/main/scala/org/apache/spark/streaming/kinesis/KinesisBackedBlockRDD.scala:150: method setEndpoint in class AmazonWebServiceClient is deprecated: see corresponding Javadoc for more information.
[warn]   client.setEndpoint(endpointUrl)
[warn]          ^
[warn] /home/jenkins/workspace/spark-branch-2.4-test-maven-hadoop-2.7/external/kinesis-asl/src/main/scala/org/apache/spark/streaming/kinesis/KinesisBackedBlockRDD.scala:219: method setRequestCredentials in class AmazonWebServiceRequest is deprecated: see corresponding Javadoc for more information.
[warn]     getRecordsRequest.setRequestCredentials(credentials)
[warn]                       ^
[warn] /home/jenkins/workspace/spark-branch-2.4-test-maven-hadoop-2.7/external/kinesis-asl/src/main/scala/org/apache/spark/streaming/kinesis/KinesisBackedBlockRDD.scala:240: method setRequestCredentials in class AmazonWebServiceRequest is deprecated: see corresponding Javadoc for more information.
[warn]     getShardIteratorRequest.setRequestCredentials(credentials)
[warn]                             ^
[warn] /home/jenkins/workspace/spark-branch-2.4-test-maven-hadoop-2.7/external/kinesis-asl/src/main/scala/org/apache/spark/streaming/kinesis/KinesisReceiver.scala:187: constructor Worker in class Worker is deprecated: see corresponding Javadoc for more information.
[warn]     worker = new Worker(recordProcessorFactory, kinesisClientLibConfiguration)
[warn]              ^
[warn] /home/jenkins/workspace/spark-branch-2.4-test-maven-hadoop-2.7/external/kinesis-asl/src/main/scala/org/apache/spark/streaming/kinesis/KinesisTestUtils.scala:58: constructor AmazonKinesisClient in class AmazonKinesisClient is deprecated: see corresponding Javadoc for more information.
[warn]     val client = new AmazonKinesisClient(KinesisTestUtils.getAWSCredentials())
[warn]                  ^
[warn] /home/jenkins/workspace/spark-branch-2.4-test-maven-hadoop-2.7/external/kinesis-asl/src/main/scala/org/apache/spark/streaming/kinesis/KinesisTestUtils.scala:59: method setEndpoint in class AmazonWebServiceClient is deprecated: see corresponding Javadoc for more information.
[warn]     client.setEndpoint(endpointUrl)
[warn]            ^
[warn] /home/jenkins/workspace/spark-branch-2.4-test-maven-hadoop-2.7/external/kinesis-asl/src/main/scala/org/apache/spark/streaming/kinesis/KinesisTestUtils.scala:64: constructor AmazonDynamoDBClient in class AmazonDynamoDBClient is deprecated: see corresponding Javadoc for more information.
[warn]     val dynamoDBClient = new AmazonDynamoDBClient(new DefaultAWSCredentialsProviderChain())
[warn]                          ^
[warn] /home/jenkins/workspace/spark-branch-2.4-test-maven-hadoop-2.7/external/kinesis-asl/src/main/scala/org/apache/spark/streaming/kinesis/KinesisTestUtils.scala:65: method setRegion in class AmazonWebServiceClient is deprecated: see corresponding Javadoc for more information.
[warn]     dynamoDBClient.setRegion(RegionUtils.getRegion(regionName))
[warn]                    ^
[warn] /home/jenkins/workspace/spark-branch-2.4-test-maven-hadoop-2.7/external/kinesis-asl/src/main/scala/org/apache/spark/streaming/kinesis/KinesisUtils.scala:606: method createStream in object KinesisUtils is deprecated: Use KinesisInputDStream.builder instead
[warn]       KinesisUtils.createStream(jssc.ssc, kinesisAppName, streamName, endpointUrl, regionName,
[warn]                    ^
[warn] /home/jenkins/workspace/spark-branch-2.4-test-maven-hadoop-2.7/external/kinesis-asl/src/main/scala/org/apache/spark/streaming/kinesis/KinesisUtils.scala:613: method createStream in object KinesisUtils is deprecated: Use KinesisInputDStream.builder instead
[warn]         KinesisUtils.createStream(jssc, kinesisAppName, streamName, endpointUrl, regionName,
[warn]                      ^
[warn] /home/jenkins/workspace/spark-branch-2.4-test-maven-hadoop-2.7/external/kinesis-asl/src/main/scala/org/apache/spark/streaming/kinesis/KinesisUtils.scala:616: method createStream in object KinesisUtils is deprecated: Use KinesisInputDStream.builder instead
[warn]         KinesisUtils.createStream(jssc, kinesisAppName, streamName, endpointUrl, regionName,
[warn]                      ^
[warn] /home/jenkins/workspace/spark-branch-2.4-test-maven-hadoop-2.7/external/kinesis-asl/src/main/scala/org/apache/spark/streaming/kinesis/SparkAWSCredentials.scala:76: method withLongLivedCredentialsProvider in class Builder is deprecated: see corresponding Javadoc for more information.
[warn]       .withLongLivedCredentialsProvider(longLivedCreds.provider)
[warn]        ^
[warn] 17 warnings found
[warn] /home/jenkins/workspace/spark-branch-2.4-test-maven-hadoop-2.7/external/kinesis-asl/src/main/java/org/apache/spark/examples/streaming/JavaKinesisWordCountASL.java:109: warning: [deprecation] AmazonKinesisClient(AWSCredentialsProvider) in AmazonKinesisClient has been deprecated
[warn]         new AmazonKinesisClient(new DefaultAWSCredentialsProviderChain());
[warn]         ^
[warn] /home/jenkins/workspace/spark-branch-2.4-test-maven-hadoop-2.7/external/kinesis-asl/src/main/java/org/apache/spark/examples/streaming/JavaKinesisWordCountASL.java:110: warning: [deprecation] setEndpoint(String) in AmazonWebServiceClient has been deprecated
[warn]     kinesisClient.setEndpoint(endpointUrl);
[warn]                  ^
[warn] 2 warnings
[info] Compile success at Sep 25, 2020 10:36:26 AM [4.868s]
[INFO] 
[INFO] --- maven-antrun-plugin:1.8:run (create-tmp-dir) @ spark-streaming-kinesis-asl_2.11 ---
[INFO] Executing tasks

main:
[INFO] Executed tasks
[INFO] 
[INFO] --- maven-resources-plugin:2.7:testResources (default-testResources) @ spark-streaming-kinesis-asl_2.11 ---
[INFO] Using 'UTF-8' encoding to copy filtered resources.
[INFO] Copying 1 resource
[INFO] Copying 3 resources
[INFO] 
[INFO] --- maven-compiler-plugin:3.7.0:testCompile (default-testCompile) @ spark-streaming-kinesis-asl_2.11 ---
[INFO] Not compiling test sources
[INFO] 
[INFO] --- maven-dependency-plugin:3.0.2:build-classpath (generate-test-classpath) @ spark-streaming-kinesis-asl_2.11 ---
[INFO] Dependencies classpath:
/home/jenkins/.m2/repository/org/eclipse/jetty/jetty-security/9.3.27.v20190418/jetty-security-9.3.27.v20190418.jar:/home/jenkins/.m2/repository/com/fasterxml/jackson/module/jackson-module-scala_2.11/2.6.7.1/jackson-module-scala_2.11-2.6.7.1.jar:/home/jenkins/.m2/repository/org/apache/htrace/htrace-core/3.1.0-incubating/htrace-core-3.1.0-incubating.jar:/home/jenkins/.m2/repository/org/lz4/lz4-java/1.4.0/lz4-java-1.4.0.jar:/home/jenkins/.m2/repository/com/google/protobuf/protobuf-java/2.5.0/protobuf-java-2.5.0.jar:/home/jenkins/.m2/repository/org/scalactic/scalactic_2.11/3.0.3/scalactic_2.11-3.0.3.jar:/home/jenkins/.m2/repository/com/fasterxml/jackson/module/jackson-module-paranamer/2.7.9/jackson-module-paranamer-2.7.9.jar:/home/jenkins/.m2/repository/org/apache/commons/commons-compress/1.8.1/commons-compress-1.8.1.jar:/home/jenkins/.m2/repository/org/json4s/json4s-ast_2.11/3.5.3/json4s-ast_2.11-3.5.3.jar:/home/jenkins/.m2/repository/io/netty/netty-all/4.1.47.Final/netty-all-4.1.47.Final.jar:/home/jenkins/.m2/repository/com/thoughtworks/paranamer/paranamer/2.8/paranamer-2.8.jar:/home/jenkins/.m2/repository/org/mockito/mockito-core/1.10.19/mockito-core-1.10.19.jar:/home/jenkins/.m2/repository/xml-apis/xml-apis/1.4.01/xml-apis-1.4.01.jar:/home/jenkins/.m2/repository/org/fusesource/leveldbjni/leveldbjni-all/1.8/leveldbjni-all-1.8.jar:/home/jenkins/.m2/repository/org/tukaani/xz/1.5/xz-1.5.jar:/home/jenkins/workspace/spark-branch-2.4-test-maven-hadoop-2.7/common/kvstore/target/scala-2.11/classes:/home/jenkins/.m2/repository/org/glassfish/jersey/bundles/repackaged/jersey-guava/2.22.2/jersey-guava-2.22.2.jar:/home/jenkins/.m2/repository/com/amazonaws/aws-java-sdk-core/1.11.655/aws-java-sdk-core-1.11.655.jar:/home/jenkins/.m2/repository/org/apache/commons/commons-crypto/1.0.0/commons-crypto-1.0.0.jar:/home/jenkins/.m2/repository/com/amazonaws/aws-java-sdk-sts/1.11.655/aws-java-sdk-sts-1.11.655.jar:/home/jenkins/.m2/repository/com/amazonaws/aws-java-sdk-cloudwatch/1.11.655/aws-java-sdk-cloudwatch-1.11.655.jar:/home/jenkins/.m2/repository/commons-io/commons-io/2.4/commons-io-2.4.jar:/home/jenkins/.m2/repository/org/scala-lang/scala-reflect/2.11.12/scala-reflect-2.11.12.jar:/home/jenkins/.m2/repository/org/eclipse/jetty/jetty-servlet/9.3.27.v20190418/jetty-servlet-9.3.27.v20190418.jar:/home/jenkins/.m2/repository/org/apache/commons/commons-lang3/3.5/commons-lang3-3.5.jar:/home/jenkins/.m2/repository/org/codehaus/jackson/jackson-jaxrs/1.9.13/jackson-jaxrs-1.9.13.jar:/home/jenkins/.m2/repository/org/apache/hadoop/hadoop-auth/2.7.3/hadoop-auth-2.7.3.jar:/home/jenkins/.m2/repository/com/esotericsoftware/kryo-shaded/4.0.2/kryo-shaded-4.0.2.jar:/home/jenkins/.m2/repository/com/esotericsoftware/minlog/1.3.0/minlog-1.3.0.jar:/home/jenkins/.m2/repository/org/apache/hadoop/hadoop-client/2.7.3/hadoop-client-2.7.3.jar:/home/jenkins/.m2/repository/org/apache/hadoop/hadoop-mapreduce-client-shuffle/2.7.3/hadoop-mapreduce-client-shuffle-2.7.3.jar:/home/jenkins/.m2/repository/org/codehaus/jackson/jackson-core-asl/1.9.13/jackson-core-asl-1.9.13.jar:/home/jenkins/.m2/repository/javax/validation/validation-api/1.1.0.Final/validation-api-1.1.0.Final.jar:/home/jenkins/.m2/repository/org/scalacheck/scalacheck_2.11/1.13.5/scalacheck_2.11-1.13.5.jar:/home/jenkins/workspace/spark-branch-2.4-test-maven-hadoop-2.7/core/target/scala-2.11/classes:/home/jenkins/.m2/repository/org/glassfish/jersey/core/jersey-common/2.22.2/jersey-common-2.22.2.jar:/home/jenkins/.m2/repository/org/apache/hadoop/hadoop-mapreduce-client-core/2.7.3/hadoop-mapreduce-client-core-2.7.3.jar:/home/jenkins/.m2/repository/joda-time/joda-time/2.9.3/joda-time-2.9.3.jar:/home/jenkins/.m2/repository/org/scala-lang/modules/scala-xml_2.11/1.0.5/scala-xml_2.11-1.0.5.jar:/home/jenkins/.m2/repository/com/amazonaws/aws-java-sdk-kms/1.11.655/aws-java-sdk-kms-1.11.655.jar:/home/jenkins/.m2/repository/com/google/code/findbugs/jsr305/1.3.9/jsr305-1.3.9.jar:/home/jenkins/.m2/repository/commons-net/commons-net/3.1/commons-net-3.1.jar:/home/jenkins/.m2/repository/com/amazonaws/amazon-kinesis-producer/0.12.8/amazon-kinesis-producer-0.12.8.jar:/home/jenkins/.m2/repository/javax/xml/bind/jaxb-api/2.2.2/jaxb-api-2.2.2.jar:/home/jenkins/.m2/repository/org/glassfish/hk2/hk2-api/2.4.0-b34/hk2-api-2.4.0-b34.jar:/home/jenkins/.m2/repository/org/xerial/snappy/snappy-java/1.1.7.5/snappy-java-1.1.7.5.jar:/home/jenkins/.m2/repository/org/glassfish/jersey/core/jersey-server/2.22.2/jersey-server-2.22.2.jar:/home/jenkins/.m2/repository/com/twitter/chill_2.11/0.9.3/chill_2.11-0.9.3.jar:/home/jenkins/.m2/repository/commons-lang/commons-lang/2.6/commons-lang-2.6.jar:/home/jenkins/.m2/repository/org/apache/hadoop/hadoop-yarn-client/2.7.3/hadoop-yarn-client-2.7.3.jar:/home/jenkins/.m2/repository/com/amazonaws/aws-java-sdk-s3/1.11.655/aws-java-sdk-s3-1.11.655.jar:/home/jenkins/.m2/repository/com/amazonaws/aws-java-sdk-dynamodb/1.11.655/aws-java-sdk-dynamodb-1.11.655.jar:/home/jenkins/.m2/repository/org/apache/zookeeper/zookeeper/3.4.6/zookeeper-3.4.6.jar:/home/jenkins/.m2/repository/javax/activation/activation/1.1.1/activation-1.1.1.jar:/home/jenkins/.m2/repository/commons-codec/commons-codec/1.10/commons-codec-1.10.jar:/home/jenkins/.m2/repository/org/eclipse/jetty/jetty-webapp/9.3.27.v20190418/jetty-webapp-9.3.27.v20190418.jar:/home/jenkins/.m2/repository/org/json4s/json4s-jackson_2.11/3.5.3/json4s-jackson_2.11-3.5.3.jar:/home/jenkins/.m2/repository/org/javassist/javassist/3.18.1-GA/javassist-3.18.1-GA.jar:/home/jenkins/.m2/repository/com/google/guava/guava/14.0.1/guava-14.0.1.jar:/home/jenkins/.m2/repository/org/apache/xbean/xbean-asm6-shaded/4.8/xbean-asm6-shaded-4.8.jar:/home/jenkins/.m2/repository/commons-beanutils/commons-beanutils/1.9.4/commons-beanutils-1.9.4.jar:/home/jenkins/.m2/repository/org/apache/ivy/ivy/2.4.0/ivy-2.4.0.jar:/home/jenkins/workspace/spark-branch-2.4-test-maven-hadoop-2.7/core/target/scala-2.11/test-classes:/home/jenkins/.m2/repository/org/eclipse/jetty/jetty-util/9.3.27.v20190418/jetty-util-9.3.27.v20190418.jar:/home/jenkins/.m2/repository/org/eclipse/jetty/jetty-client/9.3.27.v20190418/jetty-client-9.3.27.v20190418.jar:/home/jenkins/.m2/repository/javax/servlet/javax.servlet-api/3.1.0/javax.servlet-api-3.1.0.jar:/home/jenkins/.m2/repository/org/glassfish/hk2/osgi-resource-locator/1.0.1/osgi-resource-locator-1.0.1.jar:/home/jenkins/.m2/repository/com/fasterxml/jackson/core/jackson-core/2.6.7/jackson-core-2.6.7.jar:/home/jenkins/.m2/repository/org/apache/commons/commons-math3/3.4.1/commons-math3-3.4.1.jar:/home/jenkins/workspace/spark-branch-2.4-test-maven-hadoop-2.7/streaming/target/scala-2.11/test-classes:/home/jenkins/.m2/repository/org/apache/hadoop/hadoop-mapreduce-client-common/2.7.3/hadoop-mapreduce-client-common-2.7.3.jar:/home/jenkins/.m2/repository/org/scala-lang/modules/scala-parser-combinators_2.11/1.1.0/scala-parser-combinators_2.11-1.1.0.jar:/home/jenkins/.m2/repository/io/dropwizard/metrics/metrics-graphite/3.1.5/metrics-graphite-3.1.5.jar:/home/jenkins/.m2/repository/javax/xml/stream/stax-api/1.0-2/stax-api-1.0-2.jar:/home/jenkins/.m2/repository/org/apache/hadoop/hadoop-mapreduce-client-jobclient/2.7.3/hadoop-mapreduce-client-jobclient-2.7.3.jar:/home/jenkins/.m2/repository/org/codehaus/jackson/jackson-xc/1.9.13/jackson-xc-1.9.13.jar:/home/jenkins/.m2/repository/com/amazonaws/amazon-kinesis-client/1.12.0/amazon-kinesis-client-1.12.0.jar:/home/jenkins/.m2/repository/org/eclipse/jetty/jetty-server/9.3.27.v20190418/jetty-server-9.3.27.v20190418.jar:/home/jenkins/.m2/repository/org/glassfish/hk2/hk2-utils/2.4.0-b34/hk2-utils-2.4.0-b34.jar:/home/jenkins/.m2/repository/org/glassfish/hk2/external/aopalliance-repackaged/2.4.0-b34/aopalliance-repackaged-2.4.0-b34.jar:/home/jenkins/.m2/repository/net/sf/py4j/py4j/0.10.7/py4j-0.10.7.jar:/home/jenkins/.m2/repository/org/json4s/json4s-scalap_2.11/3.5.3/json4s-scalap_2.11-3.5.3.jar:/home/jenkins/.m2/repository/org/glassfish/hk2/external/javax.inject/2.4.0-b34/javax.inject-2.4.0-b34.jar:/home/jenkins/.m2/repository/org/glassfish/jersey/containers/jersey-container-servlet-core/2.22.2/jersey-container-servlet-core-2.22.2.jar:/home/jenkins/.m2/repository/oro/oro/2.0.8/oro-2.0.8.jar:/home/jenkins/.m2/repository/org/apache/avro/avro-mapred/1.8.2/avro-mapred-1.8.2-hadoop2.jar:/home/jenkins/workspace/spark-branch-2.4-test-maven-hadoop-2.7/common/tags/target/scala-2.11/test-classes:/home/jenkins/.m2/repository/org/eclipse/jetty/jetty-continuation/9.3.27.v20190418/jetty-continuation-9.3.27.v20190418.jar:/home/jenkins/workspace/spark-branch-2.4-test-maven-hadoop-2.7/common/network-common/target/scala-2.11/classes:/home/jenkins/.m2/repository/org/apache/hadoop/hadoop-yarn-common/2.7.3/hadoop-yarn-common-2.7.3.jar:/home/jenkins/.m2/repository/org/eclipse/jetty/jetty-http/9.3.27.v20190418/jetty-http-9.3.27.v20190418.jar:/home/jenkins/.m2/repository/org/scalatest/scalatest_2.11/3.0.3/scalatest_2.11-3.0.3.jar:/home/jenkins/workspace/spark-branch-2.4-test-maven-hadoop-2.7/common/unsafe/target/scala-2.11/classes:/home/jenkins/.m2/repository/org/apache/hadoop/hadoop-yarn-api/2.7.3/hadoop-yarn-api-2.7.3.jar:/home/jenkins/.m2/repository/log4j/log4j/1.2.17/log4j-1.2.17.jar:/home/jenkins/.m2/repository/com/novocode/junit-interface/0.11/junit-interface-0.11.jar:/home/jenkins/.m2/repository/org/apache/hadoop/hadoop-yarn-server-common/2.7.3/hadoop-yarn-server-common-2.7.3.jar:/home/jenkins/.m2/repository/org/apache/httpcomponents/httpcore/4.4.10/httpcore-4.4.10.jar:/home/jenkins/workspace/spark-branch-2.4-test-maven-hadoop-2.7/streaming/target/scala-2.11/classes:/home/jenkins/.m2/repository/org/apache/curator/curator-framework/2.7.1/curator-framework-2.7.1.jar:/home/jenkins/.m2/repository/org/apache/curator/curator-recipes/2.7.1/curator-recipes-2.7.1.jar:/home/jenkins/.m2/repository/org/eclipse/jetty/jetty-xml/9.3.27.v20190418/jetty-xml-9.3.27.v20190418.jar:/home/jenkins/.m2/repository/io/dropwizard/metrics/metrics-json/3.1.5/metrics-json-3.1.5.jar:/home/jenkins/.m2/repository/com/amazonaws/aws-java-sdk-kinesis/1.11.655/aws-java-sdk-kinesis-1.11.655.jar:/home/jenkins/.m2/repository/org/apache/avro/avro/1.8.2/avro-1.8.2.jar:/home/jenkins/.m2/repository/org/apache/directory/server/apacheds-kerberos-codec/2.0.0-M15/apacheds-kerberos-codec-2.0.0-M15.jar:/home/jenkins/.m2/repository/io/dropwizard/metrics/metrics-core/3.1.5/metrics-core-3.1.5.jar:/home/jenkins/workspace/spark-branch-2.4-test-maven-hadoop-2.7/common/tags/target/scala-2.11/classes:/home/jenkins/.m2/repository/org/slf4j/slf4j-api/1.7.16/slf4j-api-1.7.16.jar:/home/jenkins/.m2/repository/org/eclipse/jetty/jetty-io/9.3.27.v20190418/jetty-io-9.3.27.v20190418.jar:/home/jenkins/workspace/spark-branch-2.4-test-maven-hadoop-2.7/launcher/target/scala-2.11/classes:/home/jenkins/.m2/repository/org/mortbay/jetty/jetty-util/6.1.26/jetty-util-6.1.26.jar:/home/jenkins/.m2/repository/org/scala-sbt/test-interface/1.0/test-interface-1.0.jar:/home/jenkins/.m2/repository/org/hamcrest/hamcrest-core/1.3/hamcrest-core-1.3.jar:/home/jenkins/.m2/repository/org/codehaus/jackson/jackson-mapper-asl/1.9.13/jackson-mapper-asl-1.9.13.jar:/home/jenkins/workspace/spark-branch-2.4-test-maven-hadoop-2.7/common/network-shuffle/target/scala-2.11/classes:/home/jenkins/.m2/repository/javax/ws/rs/javax.ws.rs-api/2.0.1/javax.ws.rs-api-2.0.1.jar:/home/jenkins/.m2/repository/javax/servlet/jsp/jsp-api/2.1/jsp-api-2.1.jar:/home/jenkins/.m2/repository/org/glassfish/jersey/core/jersey-client/2.22.2/jersey-client-2.22.2.jar:/home/jenkins/.m2/repository/io/netty/netty/3.9.9.Final/netty-3.9.9.Final.jar:/home/jenkins/.m2/repository/org/roaringbitmap/shims/0.7.45/shims-0.7.45.jar:/home/jenkins/.m2/repository/org/apache/avro/avro-ipc/1.8.2/avro-ipc-1.8.2.jar:/home/jenkins/.m2/repository/xmlenc/xmlenc/0.52/xmlenc-0.52.jar:/home/jenkins/.m2/repository/com/ning/compress-lzf/1.0.3/compress-lzf-1.0.3.jar:/home/jenkins/.m2/repository/org/apache/hadoop/hadoop-hdfs/2.7.3/hadoop-hdfs-2.7.3.jar:/home/jenkins/.m2/repository/org/apache/directory/api/api-util/1.0.0-M20/api-util-1.0.0-M20.jar:/home/jenkins/.m2/repository/com/google/code/gson/gson/2.2.4/gson-2.2.4.jar:/home/jenkins/.m2/repository/org/apache/directory/api/api-asn1-api/1.0.0-M20/api-asn1-api-1.0.0-M20.jar:/home/jenkins/.m2/repository/com/clearspring/analytics/stream/2.7.0/stream-2.7.0.jar:/home/jenkins/.m2/repository/org/apache/hadoop/hadoop-common/2.7.3/hadoop-common-2.7.3.jar:/home/jenkins/.m2/repository/com/fasterxml/jackson/core/jackson-annotations/2.6.7/jackson-annotations-2.6.7.jar:/home/jenkins/.m2/repository/commons-configuration/commons-configuration/1.6/commons-configuration-1.6.jar:/home/jenkins/.m2/repository/org/glassfish/jersey/containers/jersey-container-servlet/2.22.2/jersey-container-servlet-2.22.2.jar:/home/jenkins/.m2/repository/commons-digester/commons-digester/1.8/commons-digester-1.8.jar:/home/jenkins/.m2/repository/org/slf4j/jul-to-slf4j/1.7.16/jul-to-slf4j-1.7.16.jar:/home/jenkins/.m2/repository/org/scala-lang/scala-library/2.11.12/scala-library-2.11.12.jar:/home/jenkins/.m2/repository/org/apache/directory/server/apacheds-i18n/2.0.0-M15/apacheds-i18n-2.0.0-M15.jar:/home/jenkins/.m2/repository/com/fasterxml/jackson/dataformat/jackson-dataformat-cbor/2.6.7/jackson-dataformat-cbor-2.6.7.jar:/home/jenkins/.m2/repository/org/eclipse/jetty/jetty-proxy/9.3.27.v20190418/jetty-proxy-9.3.27.v20190418.jar:/home/jenkins/.m2/repository/org/apache/curator/curator-client/2.7.1/curator-client-2.7.1.jar:/home/jenkins/.m2/repository/org/roaringbitmap/RoaringBitmap/0.7.45/RoaringBitmap-0.7.45.jar:/home/jenkins/.m2/repository/com/fasterxml/jackson/core/jackson-databind/2.6.7.3/jackson-databind-2.6.7.3.jar:/home/jenkins/.m2/repository/org/eclipse/jetty/jetty-jndi/9.3.27.v20190418/jetty-jndi-9.3.27.v20190418.jar:/home/jenkins/.m2/repository/commons-cli/commons-cli/1.2/commons-cli-1.2.jar:/home/jenkins/.m2/repository/xerces/xercesImpl/2.9.1/xercesImpl-2.9.1.jar:/home/jenkins/.m2/repository/javax/annotation/javax.annotation-api/1.2/javax.annotation-api-1.2.jar:/home/jenkins/.m2/repository/org/objenesis/objenesis/2.1/objenesis-2.1.jar:/home/jenkins/.m2/repository/org/slf4j/slf4j-log4j12/1.7.16/slf4j-log4j12-1.7.16.jar:/home/jenkins/.m2/repository/org/glassfish/jersey/media/jersey-media-jaxb/2.22.2/jersey-media-jaxb-2.22.2.jar:/home/jenkins/.m2/repository/org/spark-project/spark/unused/1.0.0/unused-1.0.0.jar:/home/jenkins/.m2/repository/com/twitter/chill-java/0.9.3/chill-java-0.9.3.jar:/home/jenkins/.m2/repository/org/eclipse/jetty/jetty-plus/9.3.27.v20190418/jetty-plus-9.3.27.v20190418.jar:/home/jenkins/.m2/repository/io/dropwizard/metrics/metrics-jvm/3.1.5/metrics-jvm-3.1.5.jar:/home/jenkins/.m2/repository/org/apache/hadoop/hadoop-annotations/2.7.3/hadoop-annotations-2.7.3.jar:/home/jenkins/.m2/repository/com/github/luben/zstd-jni/1.3.2-2/zstd-jni-1.3.2-2.jar:/home/jenkins/.m2/repository/org/json4s/json4s-core_2.11/3.5.3/json4s-core_2.11-3.5.3.jar:/home/jenkins/.m2/repository/commons-collections/commons-collections/3.2.2/commons-collections-3.2.2.jar:/home/jenkins/.m2/repository/junit/junit/4.12/junit-4.12.jar:/home/jenkins/.m2/repository/org/eclipse/jetty/jetty-servlets/9.3.27.v20190418/jetty-servlets-9.3.27.v20190418.jar:/home/jenkins/.m2/repository/org/glassfish/hk2/hk2-locator/2.4.0-b34/hk2-locator-2.4.0-b34.jar:/home/jenkins/.m2/repository/org/apache/hadoop/hadoop-mapreduce-client-app/2.7.3/hadoop-mapreduce-client-app-2.7.3.jar:/home/jenkins/.m2/repository/commons-logging/commons-logging/1.1.3/commons-logging-1.1.3.jar:/home/jenkins/.m2/repository/net/razorvine/pyrolite/4.13/pyrolite-4.13.jar:/home/jenkins/.m2/repository/org/apache/httpcomponents/httpclient/4.5.6/httpclient-4.5.6.jar:/home/jenkins/.m2/repository/com/amazonaws/jmespath-java/1.11.655/jmespath-java-1.11.655.jar:/home/jenkins/.m2/repository/software/amazon/ion/ion-java/1.0.2/ion-java-1.0.2.jar:/home/jenkins/.m2/repository/org/slf4j/jcl-over-slf4j/1.7.16/jcl-over-slf4j-1.7.16.jar:/home/jenkins/.m2/repository/commons-httpclient/commons-httpclient/3.1/commons-httpclient-3.1.jar
[INFO] 
[INFO] --- scala-maven-plugin:3.2.2:testCompile (scala-test-compile-first) @ spark-streaming-kinesis-asl_2.11 ---
[INFO] Using zinc server for incremental compilation
[info] Compiling 8 Scala sources and 2 Java sources to /home/jenkins/workspace/spark-branch-2.4-test-maven-hadoop-2.7/external/kinesis-asl/target/scala-2.11/test-classes...
[warn] /home/jenkins/workspace/spark-branch-2.4-test-maven-hadoop-2.7/external/kinesis-asl/src/test/scala/org/apache/spark/streaming/kinesis/KinesisInputDStreamBuilderSuite.scala:163: method initialPositionInStream in class Builder is deprecated: use initialPosition(initialPosition: KinesisInitialPosition)
[warn]         .initialPositionInStream(InitialPositionInStream.AT_TIMESTAMP)
[warn]          ^
[warn] /home/jenkins/workspace/spark-branch-2.4-test-maven-hadoop-2.7/external/kinesis-asl/src/test/scala/org/apache/spark/streaming/kinesis/KinesisStreamSuite.scala:103: method createStream in object KinesisUtils is deprecated: Use KinesisInputDStream.builder instead
[warn]     val kinesisStream1 = KinesisUtils.createStream(ssc, "myAppName", "mySparkStream",
[warn]                                       ^
[warn] /home/jenkins/workspace/spark-branch-2.4-test-maven-hadoop-2.7/external/kinesis-asl/src/test/scala/org/apache/spark/streaming/kinesis/KinesisStreamSuite.scala:106: method createStream in object KinesisUtils is deprecated: Use KinesisInputDStream.builder instead
[warn]     val kinesisStream2 = KinesisUtils.createStream(ssc, "myAppName", "mySparkStream",
[warn]                                       ^
[warn] /home/jenkins/workspace/spark-branch-2.4-test-maven-hadoop-2.7/external/kinesis-asl/src/test/scala/org/apache/spark/streaming/kinesis/KinesisStreamSuite.scala:113: method createStream in object KinesisUtils is deprecated: Use KinesisInputDStream.builder instead
[warn]     val inputStream = KinesisUtils.createStream(ssc, appName, "dummyStream",
[warn]                                    ^
[warn] four warnings found
[warn] /home/jenkins/workspace/spark-branch-2.4-test-maven-hadoop-2.7/external/kinesis-asl/src/test/java/org/apache/spark/streaming/kinesis/JavaKinesisInputDStreamBuilderSuite.java:37: warning: auxiliary class KinesisInitialPosition in KinesisInitialPositions.java should not be accessed from outside its own source file
[warn]     KinesisInitialPosition initialPosition = new TrimHorizon();
[warn]     ^
[warn] /home/jenkins/workspace/spark-branch-2.4-test-maven-hadoop-2.7/external/kinesis-asl/src/test/java/org/apache/spark/streaming/kinesis/JavaKinesisInputDStreamBuilderSuite.java:81: warning: [deprecation] initialPositionInStream(InitialPositionInStream) in Builder has been deprecated
[warn]       .initialPositionInStream(InitialPositionInStream.LATEST)
[warn]       ^
[warn] 2 warnings
[info] Compile success at Sep 25, 2020 10:36:35 AM [8.935s]
[INFO] 
[INFO] --- maven-surefire-plugin:2.22.0:test (default-test) @ spark-streaming-kinesis-asl_2.11 ---
[INFO] 
[INFO] -------------------------------------------------------
[INFO]  T E S T S
[INFO] -------------------------------------------------------
[INFO] Running org.apache.spark.streaming.kinesis.JavaKinesisInputDStreamBuilderSuite
[INFO] Tests run: 2, Failures: 0, Errors: 0, Skipped: 0, Time elapsed: 2.563 s - in org.apache.spark.streaming.kinesis.JavaKinesisInputDStreamBuilderSuite
[INFO] Running org.apache.spark.streaming.kinesis.JavaKinesisStreamSuite
[INFO] Tests run: 5, Failures: 0, Errors: 0, Skipped: 0, Time elapsed: 0.787 s - in org.apache.spark.streaming.kinesis.JavaKinesisStreamSuite
[INFO] 
[INFO] Results:
[INFO] 
[INFO] Tests run: 7, Failures: 0, Errors: 0, Skipped: 0
[INFO] 
[INFO] 
[INFO] --- maven-surefire-plugin:2.22.0:test (test) @ spark-streaming-kinesis-asl_2.11 ---
[INFO] Skipping execution of surefire because it has already been run for this configuration
[INFO] 
[INFO] --- scalatest-maven-plugin:1.0:test (test) @ spark-streaming-kinesis-asl_2.11 ---
Discovery starting.
Discovery completed in 1 second, 946 milliseconds.
Run starting. Expected test count is: 37
KinesisInputDStreamBuilderSuite:
- should raise an exception if the StreamingContext is missing
- should raise an exception if the stream name is missing
- should raise an exception if the checkpoint app name is missing
- should propagate required values to KinesisInputDStream
- should propagate default values to KinesisInputDStream
- should propagate custom non-auth values to KinesisInputDStream
- old Api should throw UnsupportedOperationExceptionexception with AT_TIMESTAMP
WithoutAggregationKinesisBackedBlockRDDSuite:
- Basic reading from Kinesis [enable by setting env var ENABLE_KINESIS_TESTS=1] !!! IGNORED !!!
- Read data available in both block manager and Kinesis [enable by setting env var ENABLE_KINESIS_TESTS=1] !!! IGNORED !!!
- Read data available only in block manager, not in Kinesis [enable by setting env var ENABLE_KINESIS_TESTS=1] !!! IGNORED !!!
- Read data available only in Kinesis, not in block manager [enable by setting env var ENABLE_KINESIS_TESTS=1] !!! IGNORED !!!
- Read data available partially in block manager, rest in Kinesis [enable by setting env var ENABLE_KINESIS_TESTS=1] !!! IGNORED !!!
- Test isBlockValid skips block fetching from block manager [enable by setting env var ENABLE_KINESIS_TESTS=1] !!! IGNORED !!!
- Test whether RDD is valid after removing blocks from block manager [enable by setting env var ENABLE_KINESIS_TESTS=1] !!! IGNORED !!!
KinesisReceiverSuite:
- process records including store and set checkpointer
- split into multiple processes if a limitation is set
- shouldn't store and update checkpointer when receiver is stopped
- shouldn't update checkpointer when exception occurs during store
- shutdown should checkpoint if the reason is TERMINATE
- shutdown should not checkpoint if the reason is something other than TERMINATE
- retry success on first attempt
- retry success on second attempt after a Kinesis throttling exception
- retry success on second attempt after a Kinesis dependency exception
- retry failed after a shutdown exception
- retry failed after an invalid state exception
- retry failed after unexpected exception
- retry failed after exhausting all retries
WithAggregationKinesisBackedBlockRDDSuite:
- Basic reading from Kinesis [enable by setting env var ENABLE_KINESIS_TESTS=1] !!! IGNORED !!!
- Read data available in both block manager and Kinesis [enable by setting env var ENABLE_KINESIS_TESTS=1] !!! IGNORED !!!
- Read data available only in block manager, not in Kinesis [enable by setting env var ENABLE_KINESIS_TESTS=1] !!! IGNORED !!!
- Read data available only in Kinesis, not in block manager [enable by setting env var ENABLE_KINESIS_TESTS=1] !!! IGNORED !!!
- Read data available partially in block manager, rest in Kinesis [enable by setting env var ENABLE_KINESIS_TESTS=1] !!! IGNORED !!!
- Test isBlockValid skips block fetching from block manager [enable by setting env var ENABLE_KINESIS_TESTS=1] !!! IGNORED !!!
- Test whether RDD is valid after removing blocks from block manager [enable by setting env var ENABLE_KINESIS_TESTS=1] !!! IGNORED !!!
WithAggregationKinesisStreamSuite:
- KinesisUtils API
- RDD generation
- basic operation [enable by setting env var ENABLE_KINESIS_TESTS=1] !!! IGNORED !!!
- custom message handling [enable by setting env var ENABLE_KINESIS_TESTS=1] !!! IGNORED !!!
- Kinesis read with custom configurations
- split and merge shards in a stream [enable by setting env var ENABLE_KINESIS_TESTS=1] !!! IGNORED !!!
- failure recovery [enable by setting env var ENABLE_KINESIS_TESTS=1] !!! IGNORED !!!
- Prepare KinesisTestUtils [enable by setting env var ENABLE_KINESIS_TESTS=1] !!! IGNORED !!!
KinesisCheckpointerSuite:
- checkpoint is not called twice for the same sequence number
- checkpoint is called after sequence number increases
- should checkpoint if we have exceeded the checkpoint interval
- shouldn't checkpoint if we have not exceeded the checkpoint interval
- should not checkpoint for the same sequence number
- removing checkpointer checkpoints one last time
- if checkpointing is going on, wait until finished before removing and checkpointing
SparkAWSCredentialsBuilderSuite:
- should build DefaultCredentials when given no params
- should build BasicCredentials
- should build STSCredentials
- SparkAWSCredentials classes should be serializable
WithoutAggregationKinesisStreamSuite:
- KinesisUtils API
- RDD generation
- basic operation [enable by setting env var ENABLE_KINESIS_TESTS=1] !!! IGNORED !!!
- custom message handling [enable by setting env var ENABLE_KINESIS_TESTS=1] !!! IGNORED !!!
- Kinesis read with custom configurations
- split and merge shards in a stream [enable by setting env var ENABLE_KINESIS_TESTS=1] !!! IGNORED !!!
- failure recovery [enable by setting env var ENABLE_KINESIS_TESTS=1] !!! IGNORED !!!
- Prepare KinesisTestUtils [enable by setting env var ENABLE_KINESIS_TESTS=1] !!! IGNORED !!!
Run completed in 3 seconds, 168 milliseconds.
Total number of tests run: 37
Suites: completed 9, aborted 0
Tests: succeeded 37, failed 0, canceled 0, ignored 24, pending 0
All tests passed.
[INFO] 
[INFO] ------------------------------------------------------------------------
[INFO] Skipping Spark Project Examples
[INFO] This project has been banned from the build due to previous failures.
[INFO] ------------------------------------------------------------------------
[INFO] 
[INFO] -----< org.apache.spark:spark-streaming-kafka-0-10-assembly_2.11 >------
[INFO] Building Spark Integration for Kafka 0.10 Assembly 2.4.8-SNAPSHOT [27/30]
[INFO] --------------------------------[ jar ]---------------------------------
[INFO] 
[INFO] --- maven-enforcer-plugin:3.0.0-M1:enforce (enforce-versions) @ spark-streaming-kafka-0-10-assembly_2.11 ---
[INFO] 
[INFO] --- maven-enforcer-plugin:3.0.0-M1:enforce (enforce-no-duplicate-dependencies) @ spark-streaming-kafka-0-10-assembly_2.11 ---
[INFO] 
[INFO] --- scala-maven-plugin:3.2.2:add-source (eclipse-add-source) @ spark-streaming-kafka-0-10-assembly_2.11 ---
[INFO] Add Source directory: /home/jenkins/workspace/spark-branch-2.4-test-maven-hadoop-2.7/external/kafka-0-10-assembly/src/main/scala
[INFO] Add Test Source directory: /home/jenkins/workspace/spark-branch-2.4-test-maven-hadoop-2.7/external/kafka-0-10-assembly/src/test/scala
[INFO] 
[INFO] --- maven-dependency-plugin:3.0.2:build-classpath (default-cli) @ spark-streaming-kafka-0-10-assembly_2.11 ---
[INFO] Dependencies classpath:
/home/jenkins/.m2/repository/org/mortbay/jetty/jetty-util/6.1.26/jetty-util-6.1.26.jar:/home/jenkins/.m2/repository/org/apache/hadoop/hadoop-yarn-common/2.7.3/hadoop-yarn-common-2.7.3.jar:/home/jenkins/.m2/repository/org/apache/hadoop/hadoop-yarn-api/2.7.3/hadoop-yarn-api-2.7.3.jar:/home/jenkins/.m2/repository/org/spark-project/spark/unused/1.0.0/unused-1.0.0.jar:/home/jenkins/.m2/repository/org/apache/kafka/kafka-clients/2.0.0/kafka-clients-2.0.0.jar:/home/jenkins/.m2/repository/commons-io/commons-io/2.4/commons-io-2.4.jar:/home/jenkins/.m2/repository/org/codehaus/jackson/jackson-mapper-asl/1.9.13/jackson-mapper-asl-1.9.13.jar:/home/jenkins/.m2/repository/javax/xml/bind/jaxb-api/2.2.2/jaxb-api-2.2.2.jar:/home/jenkins/.m2/repository/org/codehaus/jackson/jackson-jaxrs/1.9.13/jackson-jaxrs-1.9.13.jar:/home/jenkins/.m2/repository/javax/xml/stream/stax-api/1.0-2/stax-api-1.0-2.jar:/home/jenkins/.m2/repository/com/thoughtworks/paranamer/paranamer/2.8/paranamer-2.8.jar:/home/jenkins/.m2/repository/org/codehaus/jackson/jackson-xc/1.9.13/jackson-xc-1.9.13.jar:/home/jenkins/.m2/repository/org/apache/commons/commons-compress/1.4.1/commons-compress-1.4.1.jar:/home/jenkins/.m2/repository/org/apache/hadoop/hadoop-yarn-client/2.7.3/hadoop-yarn-client-2.7.3.jar:/home/jenkins/.m2/repository/org/codehaus/jackson/jackson-core-asl/1.9.13/jackson-core-asl-1.9.13.jar:/home/jenkins/workspace/spark-branch-2.4-test-maven-hadoop-2.7/common/tags/target/scala-2.11/classes:/home/jenkins/workspace/spark-branch-2.4-test-maven-hadoop-2.7/external/kafka-0-10/target/scala-2.11/classes:/home/jenkins/.m2/repository/javax/activation/activation/1.1.1/activation-1.1.1.jar:/home/jenkins/.m2/repository/commons-cli/commons-cli/1.2/commons-cli-1.2.jar:/home/jenkins/.m2/repository/org/tukaani/xz/1.5/xz-1.5.jar
[INFO] 
[INFO] --- maven-remote-resources-plugin:1.5:process (process-resource-bundles) @ spark-streaming-kafka-0-10-assembly_2.11 ---
[INFO] 
[INFO] --- maven-resources-plugin:2.7:resources (default-resources) @ spark-streaming-kafka-0-10-assembly_2.11 ---
[INFO] Using 'UTF-8' encoding to copy filtered resources.
[INFO] skip non existing resourceDirectory /home/jenkins/workspace/spark-branch-2.4-test-maven-hadoop-2.7/external/kafka-0-10-assembly/src/main/resources
[INFO] Copying 3 resources
[INFO] 
[INFO] --- maven-compiler-plugin:3.7.0:compile (default-compile) @ spark-streaming-kafka-0-10-assembly_2.11 ---
[INFO] Not compiling main sources
[INFO] 
[INFO] --- scala-maven-plugin:3.2.2:compile (scala-compile-first) @ spark-streaming-kafka-0-10-assembly_2.11 ---
[INFO] No sources to compile
[INFO] 
[INFO] --- maven-antrun-plugin:1.8:run (create-tmp-dir) @ spark-streaming-kafka-0-10-assembly_2.11 ---
[INFO] Executing tasks

main:
[INFO] Executed tasks
[INFO] 
[INFO] --- maven-resources-plugin:2.7:testResources (default-testResources) @ spark-streaming-kafka-0-10-assembly_2.11 ---
[INFO] Using 'UTF-8' encoding to copy filtered resources.
[INFO] skip non existing resourceDirectory /home/jenkins/workspace/spark-branch-2.4-test-maven-hadoop-2.7/external/kafka-0-10-assembly/src/test/resources
[INFO] Copying 3 resources
[INFO] 
[INFO] --- maven-compiler-plugin:3.7.0:testCompile (default-testCompile) @ spark-streaming-kafka-0-10-assembly_2.11 ---
[INFO] Not compiling test sources
[INFO] 
[INFO] --- maven-dependency-plugin:3.0.2:build-classpath (generate-test-classpath) @ spark-streaming-kafka-0-10-assembly_2.11 ---
[INFO] Dependencies classpath:
/home/jenkins/.m2/repository/org/eclipse/jetty/jetty-security/9.3.27.v20190418/jetty-security-9.3.27.v20190418.jar:/home/jenkins/.m2/repository/com/fasterxml/jackson/module/jackson-module-scala_2.11/2.6.7.1/jackson-module-scala_2.11-2.6.7.1.jar:/home/jenkins/.m2/repository/org/apache/htrace/htrace-core/3.1.0-incubating/htrace-core-3.1.0-incubating.jar:/home/jenkins/.m2/repository/com/google/protobuf/protobuf-java/2.5.0/protobuf-java-2.5.0.jar:/home/jenkins/.m2/repository/org/lz4/lz4-java/1.4.0/lz4-java-1.4.0.jar:/home/jenkins/.m2/repository/org/scalactic/scalactic_2.11/3.0.3/scalactic_2.11-3.0.3.jar:/home/jenkins/.m2/repository/com/fasterxml/jackson/module/jackson-module-paranamer/2.7.9/jackson-module-paranamer-2.7.9.jar:/home/jenkins/.m2/repository/org/json4s/json4s-ast_2.11/3.5.3/json4s-ast_2.11-3.5.3.jar:/home/jenkins/.m2/repository/io/netty/netty-all/4.1.47.Final/netty-all-4.1.47.Final.jar:/home/jenkins/.m2/repository/com/thoughtworks/paranamer/paranamer/2.8/paranamer-2.8.jar:/home/jenkins/.m2/repository/xml-apis/xml-apis/1.4.01/xml-apis-1.4.01.jar:/home/jenkins/.m2/repository/org/fusesource/leveldbjni/leveldbjni-all/1.8/leveldbjni-all-1.8.jar:/home/jenkins/.m2/repository/org/tukaani/xz/1.5/xz-1.5.jar:/home/jenkins/workspace/spark-branch-2.4-test-maven-hadoop-2.7/common/kvstore/target/scala-2.11/classes:/home/jenkins/.m2/repository/org/glassfish/jersey/bundles/repackaged/jersey-guava/2.22.2/jersey-guava-2.22.2.jar:/home/jenkins/.m2/repository/org/apache/commons/commons-crypto/1.0.0/commons-crypto-1.0.0.jar:/home/jenkins/.m2/repository/commons-io/commons-io/2.4/commons-io-2.4.jar:/home/jenkins/.m2/repository/org/scala-lang/scala-reflect/2.11.12/scala-reflect-2.11.12.jar:/home/jenkins/.m2/repository/org/eclipse/jetty/jetty-servlet/9.3.27.v20190418/jetty-servlet-9.3.27.v20190418.jar:/home/jenkins/.m2/repository/org/apache/commons/commons-lang3/3.5/commons-lang3-3.5.jar:/home/jenkins/.m2/repository/org/codehaus/jackson/jackson-jaxrs/1.9.13/jackson-jaxrs-1.9.13.jar:/home/jenkins/.m2/repository/org/apache/hadoop/hadoop-auth/2.7.3/hadoop-auth-2.7.3.jar:/home/jenkins/.m2/repository/com/esotericsoftware/kryo-shaded/4.0.2/kryo-shaded-4.0.2.jar:/home/jenkins/.m2/repository/com/esotericsoftware/minlog/1.3.0/minlog-1.3.0.jar:/home/jenkins/.m2/repository/org/apache/hadoop/hadoop-client/2.7.3/hadoop-client-2.7.3.jar:/home/jenkins/.m2/repository/org/apache/hadoop/hadoop-mapreduce-client-shuffle/2.7.3/hadoop-mapreduce-client-shuffle-2.7.3.jar:/home/jenkins/.m2/repository/org/codehaus/jackson/jackson-core-asl/1.9.13/jackson-core-asl-1.9.13.jar:/home/jenkins/.m2/repository/javax/validation/validation-api/1.1.0.Final/validation-api-1.1.0.Final.jar:/home/jenkins/workspace/spark-branch-2.4-test-maven-hadoop-2.7/core/target/scala-2.11/classes:/home/jenkins/.m2/repository/org/glassfish/jersey/core/jersey-common/2.22.2/jersey-common-2.22.2.jar:/home/jenkins/.m2/repository/org/objenesis/objenesis/2.5.1/objenesis-2.5.1.jar:/home/jenkins/.m2/repository/org/apache/hadoop/hadoop-mapreduce-client-core/2.7.3/hadoop-mapreduce-client-core-2.7.3.jar:/home/jenkins/.m2/repository/org/scala-lang/modules/scala-xml_2.11/1.0.5/scala-xml_2.11-1.0.5.jar:/home/jenkins/.m2/repository/com/google/code/findbugs/jsr305/1.3.9/jsr305-1.3.9.jar:/home/jenkins/.m2/repository/commons-net/commons-net/3.1/commons-net-3.1.jar:/home/jenkins/.m2/repository/javax/xml/bind/jaxb-api/2.2.2/jaxb-api-2.2.2.jar:/home/jenkins/.m2/repository/org/glassfish/hk2/hk2-api/2.4.0-b34/hk2-api-2.4.0-b34.jar:/home/jenkins/.m2/repository/org/xerial/snappy/snappy-java/1.1.7.5/snappy-java-1.1.7.5.jar:/home/jenkins/.m2/repository/org/glassfish/jersey/core/jersey-server/2.22.2/jersey-server-2.22.2.jar:/home/jenkins/.m2/repository/com/twitter/chill_2.11/0.9.3/chill_2.11-0.9.3.jar:/home/jenkins/.m2/repository/commons-lang/commons-lang/2.6/commons-lang-2.6.jar:/home/jenkins/.m2/repository/org/apache/hadoop/hadoop-yarn-client/2.7.3/hadoop-yarn-client-2.7.3.jar:/home/jenkins/.m2/repository/org/apache/zookeeper/zookeeper/3.4.6/zookeeper-3.4.6.jar:/home/jenkins/.m2/repository/javax/activation/activation/1.1.1/activation-1.1.1.jar:/home/jenkins/.m2/repository/commons-codec/commons-codec/1.10/commons-codec-1.10.jar:/home/jenkins/.m2/repository/org/eclipse/jetty/jetty-webapp/9.3.27.v20190418/jetty-webapp-9.3.27.v20190418.jar:/home/jenkins/.m2/repository/org/json4s/json4s-jackson_2.11/3.5.3/json4s-jackson_2.11-3.5.3.jar:/home/jenkins/.m2/repository/org/javassist/javassist/3.18.1-GA/javassist-3.18.1-GA.jar:/home/jenkins/.m2/repository/com/google/guava/guava/14.0.1/guava-14.0.1.jar:/home/jenkins/.m2/repository/org/apache/xbean/xbean-asm6-shaded/4.8/xbean-asm6-shaded-4.8.jar:/home/jenkins/.m2/repository/commons-beanutils/commons-beanutils/1.9.4/commons-beanutils-1.9.4.jar:/home/jenkins/.m2/repository/org/apache/ivy/ivy/2.4.0/ivy-2.4.0.jar:/home/jenkins/.m2/repository/org/apache/kafka/kafka-clients/2.0.0/kafka-clients-2.0.0.jar:/home/jenkins/.m2/repository/org/eclipse/jetty/jetty-util/9.3.27.v20190418/jetty-util-9.3.27.v20190418.jar:/home/jenkins/.m2/repository/org/eclipse/jetty/jetty-client/9.3.27.v20190418/jetty-client-9.3.27.v20190418.jar:/home/jenkins/.m2/repository/javax/servlet/javax.servlet-api/3.1.0/javax.servlet-api-3.1.0.jar:/home/jenkins/.m2/repository/org/glassfish/hk2/osgi-resource-locator/1.0.1/osgi-resource-locator-1.0.1.jar:/home/jenkins/.m2/repository/com/fasterxml/jackson/core/jackson-core/2.6.7/jackson-core-2.6.7.jar:/home/jenkins/.m2/repository/org/apache/commons/commons-math3/3.4.1/commons-math3-3.4.1.jar:/home/jenkins/.m2/repository/org/apache/hadoop/hadoop-mapreduce-client-common/2.7.3/hadoop-mapreduce-client-common-2.7.3.jar:/home/jenkins/.m2/repository/org/scala-lang/modules/scala-parser-combinators_2.11/1.1.0/scala-parser-combinators_2.11-1.1.0.jar:/home/jenkins/.m2/repository/io/dropwizard/metrics/metrics-graphite/3.1.5/metrics-graphite-3.1.5.jar:/home/jenkins/.m2/repository/javax/xml/stream/stax-api/1.0-2/stax-api-1.0-2.jar:/home/jenkins/.m2/repository/org/apache/hadoop/hadoop-mapreduce-client-jobclient/2.7.3/hadoop-mapreduce-client-jobclient-2.7.3.jar:/home/jenkins/.m2/repository/org/codehaus/jackson/jackson-xc/1.9.13/jackson-xc-1.9.13.jar:/home/jenkins/.m2/repository/org/eclipse/jetty/jetty-server/9.3.27.v20190418/jetty-server-9.3.27.v20190418.jar:/home/jenkins/.m2/repository/org/glassfish/hk2/hk2-utils/2.4.0-b34/hk2-utils-2.4.0-b34.jar:/home/jenkins/.m2/repository/org/glassfish/hk2/external/aopalliance-repackaged/2.4.0-b34/aopalliance-repackaged-2.4.0-b34.jar:/home/jenkins/.m2/repository/net/sf/py4j/py4j/0.10.7/py4j-0.10.7.jar:/home/jenkins/.m2/repository/org/json4s/json4s-scalap_2.11/3.5.3/json4s-scalap_2.11-3.5.3.jar:/home/jenkins/.m2/repository/org/glassfish/hk2/external/javax.inject/2.4.0-b34/javax.inject-2.4.0-b34.jar:/home/jenkins/.m2/repository/org/glassfish/jersey/containers/jersey-container-servlet-core/2.22.2/jersey-container-servlet-core-2.22.2.jar:/home/jenkins/.m2/repository/oro/oro/2.0.8/oro-2.0.8.jar:/home/jenkins/.m2/repository/org/apache/avro/avro-mapred/1.8.2/avro-mapred-1.8.2-hadoop2.jar:/home/jenkins/.m2/repository/org/eclipse/jetty/jetty-continuation/9.3.27.v20190418/jetty-continuation-9.3.27.v20190418.jar:/home/jenkins/workspace/spark-branch-2.4-test-maven-hadoop-2.7/common/network-common/target/scala-2.11/classes:/home/jenkins/.m2/repository/org/eclipse/jetty/jetty-http/9.3.27.v20190418/jetty-http-9.3.27.v20190418.jar:/home/jenkins/.m2/repository/org/apache/hadoop/hadoop-yarn-common/2.7.3/hadoop-yarn-common-2.7.3.jar:/home/jenkins/.m2/repository/org/scalatest/scalatest_2.11/3.0.3/scalatest_2.11-3.0.3.jar:/home/jenkins/workspace/spark-branch-2.4-test-maven-hadoop-2.7/common/unsafe/target/scala-2.11/classes:/home/jenkins/.m2/repository/org/apache/hadoop/hadoop-yarn-api/2.7.3/hadoop-yarn-api-2.7.3.jar:/home/jenkins/.m2/repository/log4j/log4j/1.2.17/log4j-1.2.17.jar:/home/jenkins/.m2/repository/com/novocode/junit-interface/0.11/junit-interface-0.11.jar:/home/jenkins/.m2/repository/org/apache/hadoop/hadoop-yarn-server-common/2.7.3/hadoop-yarn-server-common-2.7.3.jar:/home/jenkins/.m2/repository/org/apache/httpcomponents/httpcore/4.4.10/httpcore-4.4.10.jar:/home/jenkins/workspace/spark-branch-2.4-test-maven-hadoop-2.7/streaming/target/scala-2.11/classes:/home/jenkins/.m2/repository/org/apache/curator/curator-framework/2.7.1/curator-framework-2.7.1.jar:/home/jenkins/.m2/repository/org/apache/curator/curator-recipes/2.7.1/curator-recipes-2.7.1.jar:/home/jenkins/.m2/repository/org/eclipse/jetty/jetty-xml/9.3.27.v20190418/jetty-xml-9.3.27.v20190418.jar:/home/jenkins/.m2/repository/io/dropwizard/metrics/metrics-json/3.1.5/metrics-json-3.1.5.jar:/home/jenkins/.m2/repository/org/apache/avro/avro/1.8.2/avro-1.8.2.jar:/home/jenkins/.m2/repository/org/apache/commons/commons-compress/1.4.1/commons-compress-1.4.1.jar:/home/jenkins/.m2/repository/org/apache/directory/server/apacheds-kerberos-codec/2.0.0-M15/apacheds-kerberos-codec-2.0.0-M15.jar:/home/jenkins/.m2/repository/io/dropwizard/metrics/metrics-core/3.1.5/metrics-core-3.1.5.jar:/home/jenkins/workspace/spark-branch-2.4-test-maven-hadoop-2.7/common/tags/target/scala-2.11/classes:/home/jenkins/workspace/spark-branch-2.4-test-maven-hadoop-2.7/external/kafka-0-10/target/scala-2.11/classes:/home/jenkins/.m2/repository/org/slf4j/slf4j-api/1.7.16/slf4j-api-1.7.16.jar:/home/jenkins/.m2/repository/org/eclipse/jetty/jetty-io/9.3.27.v20190418/jetty-io-9.3.27.v20190418.jar:/home/jenkins/workspace/spark-branch-2.4-test-maven-hadoop-2.7/launcher/target/scala-2.11/classes:/home/jenkins/.m2/repository/org/mortbay/jetty/jetty-util/6.1.26/jetty-util-6.1.26.jar:/home/jenkins/.m2/repository/org/scala-sbt/test-interface/1.0/test-interface-1.0.jar:/home/jenkins/.m2/repository/org/hamcrest/hamcrest-core/1.3/hamcrest-core-1.3.jar:/home/jenkins/.m2/repository/org/codehaus/jackson/jackson-mapper-asl/1.9.13/jackson-mapper-asl-1.9.13.jar:/home/jenkins/workspace/spark-branch-2.4-test-maven-hadoop-2.7/common/network-shuffle/target/scala-2.11/classes:/home/jenkins/.m2/repository/javax/ws/rs/javax.ws.rs-api/2.0.1/javax.ws.rs-api-2.0.1.jar:/home/jenkins/.m2/repository/javax/servlet/jsp/jsp-api/2.1/jsp-api-2.1.jar:/home/jenkins/.m2/repository/org/glassfish/jersey/core/jersey-client/2.22.2/jersey-client-2.22.2.jar:/home/jenkins/.m2/repository/io/netty/netty/3.9.9.Final/netty-3.9.9.Final.jar:/home/jenkins/.m2/repository/org/roaringbitmap/shims/0.7.45/shims-0.7.45.jar:/home/jenkins/.m2/repository/com/ning/compress-lzf/1.0.3/compress-lzf-1.0.3.jar:/home/jenkins/.m2/repository/xmlenc/xmlenc/0.52/xmlenc-0.52.jar:/home/jenkins/.m2/repository/org/apache/avro/avro-ipc/1.8.2/avro-ipc-1.8.2.jar:/home/jenkins/.m2/repository/org/apache/hadoop/hadoop-hdfs/2.7.3/hadoop-hdfs-2.7.3.jar:/home/jenkins/.m2/repository/org/apache/directory/api/api-util/1.0.0-M20/api-util-1.0.0-M20.jar:/home/jenkins/.m2/repository/com/google/code/gson/gson/2.2.4/gson-2.2.4.jar:/home/jenkins/.m2/repository/com/clearspring/analytics/stream/2.7.0/stream-2.7.0.jar:/home/jenkins/.m2/repository/org/apache/directory/api/api-asn1-api/1.0.0-M20/api-asn1-api-1.0.0-M20.jar:/home/jenkins/.m2/repository/com/fasterxml/jackson/core/jackson-annotations/2.6.7/jackson-annotations-2.6.7.jar:/home/jenkins/.m2/repository/org/apache/hadoop/hadoop-common/2.7.3/hadoop-common-2.7.3.jar:/home/jenkins/.m2/repository/org/glassfish/jersey/containers/jersey-container-servlet/2.22.2/jersey-container-servlet-2.22.2.jar:/home/jenkins/.m2/repository/commons-configuration/commons-configuration/1.6/commons-configuration-1.6.jar:/home/jenkins/.m2/repository/org/slf4j/jul-to-slf4j/1.7.16/jul-to-slf4j-1.7.16.jar:/home/jenkins/.m2/repository/commons-digester/commons-digester/1.8/commons-digester-1.8.jar:/home/jenkins/.m2/repository/org/apache/directory/server/apacheds-i18n/2.0.0-M15/apacheds-i18n-2.0.0-M15.jar:/home/jenkins/.m2/repository/org/scala-lang/scala-library/2.11.12/scala-library-2.11.12.jar:/home/jenkins/.m2/repository/org/eclipse/jetty/jetty-proxy/9.3.27.v20190418/jetty-proxy-9.3.27.v20190418.jar:/home/jenkins/.m2/repository/org/apache/curator/curator-client/2.7.1/curator-client-2.7.1.jar:/home/jenkins/.m2/repository/org/roaringbitmap/RoaringBitmap/0.7.45/RoaringBitmap-0.7.45.jar:/home/jenkins/.m2/repository/com/fasterxml/jackson/core/jackson-databind/2.6.7.3/jackson-databind-2.6.7.3.jar:/home/jenkins/.m2/repository/org/eclipse/jetty/jetty-jndi/9.3.27.v20190418/jetty-jndi-9.3.27.v20190418.jar:/home/jenkins/.m2/repository/commons-cli/commons-cli/1.2/commons-cli-1.2.jar:/home/jenkins/.m2/repository/xerces/xercesImpl/2.9.1/xercesImpl-2.9.1.jar:/home/jenkins/.m2/repository/javax/annotation/javax.annotation-api/1.2/javax.annotation-api-1.2.jar:/home/jenkins/.m2/repository/org/slf4j/slf4j-log4j12/1.7.16/slf4j-log4j12-1.7.16.jar:/home/jenkins/.m2/repository/org/glassfish/jersey/media/jersey-media-jaxb/2.22.2/jersey-media-jaxb-2.22.2.jar:/home/jenkins/.m2/repository/org/spark-project/spark/unused/1.0.0/unused-1.0.0.jar:/home/jenkins/.m2/repository/com/twitter/chill-java/0.9.3/chill-java-0.9.3.jar:/home/jenkins/.m2/repository/org/eclipse/jetty/jetty-plus/9.3.27.v20190418/jetty-plus-9.3.27.v20190418.jar:/home/jenkins/.m2/repository/io/dropwizard/metrics/metrics-jvm/3.1.5/metrics-jvm-3.1.5.jar:/home/jenkins/.m2/repository/com/github/luben/zstd-jni/1.3.2-2/zstd-jni-1.3.2-2.jar:/home/jenkins/.m2/repository/org/apache/hadoop/hadoop-annotations/2.7.3/hadoop-annotations-2.7.3.jar:/home/jenkins/.m2/repository/org/json4s/json4s-core_2.11/3.5.3/json4s-core_2.11-3.5.3.jar:/home/jenkins/.m2/repository/commons-collections/commons-collections/3.2.2/commons-collections-3.2.2.jar:/home/jenkins/.m2/repository/junit/junit/4.12/junit-4.12.jar:/home/jenkins/.m2/repository/org/eclipse/jetty/jetty-servlets/9.3.27.v20190418/jetty-servlets-9.3.27.v20190418.jar:/home/jenkins/.m2/repository/org/glassfish/hk2/hk2-locator/2.4.0-b34/hk2-locator-2.4.0-b34.jar:/home/jenkins/.m2/repository/org/apache/hadoop/hadoop-mapreduce-client-app/2.7.3/hadoop-mapreduce-client-app-2.7.3.jar:/home/jenkins/.m2/repository/net/razorvine/pyrolite/4.13/pyrolite-4.13.jar:/home/jenkins/.m2/repository/org/apache/httpcomponents/httpclient/4.5.6/httpclient-4.5.6.jar:/home/jenkins/.m2/repository/org/slf4j/jcl-over-slf4j/1.7.16/jcl-over-slf4j-1.7.16.jar:/home/jenkins/.m2/repository/commons-httpclient/commons-httpclient/3.1/commons-httpclient-3.1.jar
[INFO] 
[INFO] --- scala-maven-plugin:3.2.2:testCompile (scala-test-compile-first) @ spark-streaming-kafka-0-10-assembly_2.11 ---
[INFO] No sources to compile
[INFO] 
[INFO] --- maven-surefire-plugin:2.22.0:test (default-test) @ spark-streaming-kafka-0-10-assembly_2.11 ---
[INFO] 
[INFO] --- maven-surefire-plugin:2.22.0:test (test) @ spark-streaming-kafka-0-10-assembly_2.11 ---
[INFO] Skipping execution of surefire because it has already been run for this configuration
[INFO] 
[INFO] --- scalatest-maven-plugin:1.0:test (test) @ spark-streaming-kafka-0-10-assembly_2.11 ---
Discovery starting.
Discovery completed in 45 milliseconds.
Run starting. Expected test count is: 0
DiscoverySuite:
Run completed in 100 milliseconds.
Total number of tests run: 0
Suites: completed 1, aborted 0
Tests: succeeded 0, failed 0, canceled 0, ignored 0, pending 0
No tests were executed.
[INFO] 
[INFO] ------------------< org.apache.spark:spark-avro_2.11 >------------------
[INFO] Building Spark Avro 2.4.8-SNAPSHOT                               [28/30]
[INFO] --------------------------------[ jar ]---------------------------------
[INFO] 
[INFO] --- maven-enforcer-plugin:3.0.0-M1:enforce (enforce-versions) @ spark-avro_2.11 ---
[INFO] 
[INFO] --- maven-enforcer-plugin:3.0.0-M1:enforce (enforce-no-duplicate-dependencies) @ spark-avro_2.11 ---
[INFO] 
[INFO] --- scala-maven-plugin:3.2.2:add-source (eclipse-add-source) @ spark-avro_2.11 ---
[INFO] Add Source directory: /home/jenkins/workspace/spark-branch-2.4-test-maven-hadoop-2.7/external/avro/src/main/scala
[INFO] Add Test Source directory: /home/jenkins/workspace/spark-branch-2.4-test-maven-hadoop-2.7/external/avro/src/test/scala
[INFO] 
[INFO] --- maven-dependency-plugin:3.0.2:build-classpath (default-cli) @ spark-avro_2.11 ---
[INFO] Dependencies classpath:
/home/jenkins/.m2/repository/org/apache/hadoop/hadoop-yarn-common/2.7.3/hadoop-yarn-common-2.7.3.jar:/home/jenkins/.m2/repository/org/apache/hadoop/hadoop-yarn-api/2.7.3/hadoop-yarn-api-2.7.3.jar:/home/jenkins/.m2/repository/log4j/log4j/1.2.17/log4j-1.2.17.jar:/home/jenkins/.m2/repository/org/apache/htrace/htrace-core/3.1.0-incubating/htrace-core-3.1.0-incubating.jar:/home/jenkins/.m2/repository/org/apache/hadoop/hadoop-yarn-server-common/2.7.3/hadoop-yarn-server-common-2.7.3.jar:/home/jenkins/.m2/repository/com/google/protobuf/protobuf-java/2.5.0/protobuf-java-2.5.0.jar:/home/jenkins/.m2/repository/org/apache/httpcomponents/httpcore/4.4.10/httpcore-4.4.10.jar:/home/jenkins/.m2/repository/org/apache/curator/curator-framework/2.7.1/curator-framework-2.7.1.jar:/home/jenkins/.m2/repository/org/apache/parquet/parquet-column/1.10.1/parquet-column-1.10.1.jar:/home/jenkins/.m2/repository/org/apache/curator/curator-recipes/2.7.1/curator-recipes-2.7.1.jar:/home/jenkins/.m2/repository/org/apache/commons/commons-compress/1.8.1/commons-compress-1.8.1.jar:/home/jenkins/.m2/repository/io/netty/netty-all/4.1.47.Final/netty-all-4.1.47.Final.jar:/home/jenkins/.m2/repository/com/thoughtworks/paranamer/paranamer/2.8/paranamer-2.8.jar:/home/jenkins/.m2/repository/org/apache/avro/avro/1.8.2/avro-1.8.2.jar:/home/jenkins/.m2/repository/org/apache/directory/server/apacheds-kerberos-codec/2.0.0-M15/apacheds-kerberos-codec-2.0.0-M15.jar:/home/jenkins/workspace/spark-branch-2.4-test-maven-hadoop-2.7/common/tags/target/scala-2.11/classes:/home/jenkins/.m2/repository/org/fusesource/leveldbjni/leveldbjni-all/1.8/leveldbjni-all-1.8.jar:/home/jenkins/.m2/repository/org/slf4j/slf4j-api/1.7.16/slf4j-api-1.7.16.jar:/home/jenkins/.m2/repository/org/tukaani/xz/1.5/xz-1.5.jar:/home/jenkins/.m2/repository/org/mortbay/jetty/jetty-util/6.1.26/jetty-util-6.1.26.jar:/home/jenkins/.m2/repository/commons-io/commons-io/2.4/commons-io-2.4.jar:/home/jenkins/.m2/repository/org/codehaus/jackson/jackson-mapper-asl/1.9.13/jackson-mapper-asl-1.9.13.jar:/home/jenkins/.m2/repository/javax/servlet/jsp/jsp-api/2.1/jsp-api-2.1.jar:/home/jenkins/.m2/repository/org/codehaus/jackson/jackson-jaxrs/1.9.13/jackson-jaxrs-1.9.13.jar:/home/jenkins/.m2/repository/org/apache/parquet/parquet-hadoop/1.10.1/parquet-hadoop-1.10.1.jar:/home/jenkins/.m2/repository/io/netty/netty/3.9.9.Final/netty-3.9.9.Final.jar:/home/jenkins/.m2/repository/org/apache/orc/orc-shims/1.5.5/orc-shims-1.5.5.jar:/home/jenkins/.m2/repository/org/apache/hadoop/hadoop-auth/2.7.3/hadoop-auth-2.7.3.jar:/home/jenkins/.m2/repository/org/apache/avro/avro-ipc/1.8.2/avro-ipc-1.8.2.jar:/home/jenkins/.m2/repository/org/apache/hadoop/hadoop-client/2.7.3/hadoop-client-2.7.3.jar:/home/jenkins/.m2/repository/xmlenc/xmlenc/0.52/xmlenc-0.52.jar:/home/jenkins/.m2/repository/org/apache/hadoop/hadoop-hdfs/2.7.3/hadoop-hdfs-2.7.3.jar:/home/jenkins/.m2/repository/org/apache/hadoop/hadoop-mapreduce-client-shuffle/2.7.3/hadoop-mapreduce-client-shuffle-2.7.3.jar:/home/jenkins/.m2/repository/org/codehaus/jackson/jackson-core-asl/1.9.13/jackson-core-asl-1.9.13.jar:/home/jenkins/.m2/repository/org/apache/directory/api/api-util/1.0.0-M20/api-util-1.0.0-M20.jar:/home/jenkins/.m2/repository/com/google/code/gson/gson/2.2.4/gson-2.2.4.jar:/home/jenkins/.m2/repository/org/apache/directory/api/api-asn1-api/1.0.0-M20/api-asn1-api-1.0.0-M20.jar:/home/jenkins/.m2/repository/org/apache/parquet/parquet-common/1.10.1/parquet-common-1.10.1.jar:/home/jenkins/.m2/repository/org/apache/hadoop/hadoop-mapreduce-client-core/2.7.3/hadoop-mapreduce-client-core-2.7.3.jar:/home/jenkins/.m2/repository/org/apache/hadoop/hadoop-common/2.7.3/hadoop-common-2.7.3.jar:/home/jenkins/.m2/repository/org/apache/orc/orc-mapreduce/1.5.5/orc-mapreduce-1.5.5-nohive.jar:/home/jenkins/.m2/repository/org/apache/parquet/parquet-format/2.4.0/parquet-format-2.4.0.jar:/home/jenkins/.m2/repository/commons-configuration/commons-configuration/1.6/commons-configuration-1.6.jar:/home/jenkins/.m2/repository/com/google/code/findbugs/jsr305/1.3.9/jsr305-1.3.9.jar:/home/jenkins/.m2/repository/commons-net/commons-net/3.1/commons-net-3.1.jar:/home/jenkins/.m2/repository/commons-digester/commons-digester/1.8/commons-digester-1.8.jar:/home/jenkins/.m2/repository/io/airlift/aircompressor/0.10/aircompressor-0.10.jar:/home/jenkins/.m2/repository/org/apache/directory/server/apacheds-i18n/2.0.0-M15/apacheds-i18n-2.0.0-M15.jar:/home/jenkins/.m2/repository/org/scala-lang/scala-library/2.11.12/scala-library-2.11.12.jar:/home/jenkins/.m2/repository/javax/xml/bind/jaxb-api/2.2.2/jaxb-api-2.2.2.jar:/home/jenkins/.m2/repository/org/xerial/snappy/snappy-java/1.1.7.5/snappy-java-1.1.7.5.jar:/home/jenkins/.m2/repository/commons-lang/commons-lang/2.6/commons-lang-2.6.jar:/home/jenkins/.m2/repository/org/apache/hadoop/hadoop-yarn-client/2.7.3/hadoop-yarn-client-2.7.3.jar:/home/jenkins/.m2/repository/org/apache/curator/curator-client/2.7.1/curator-client-2.7.1.jar:/home/jenkins/.m2/repository/org/apache/orc/orc-core/1.5.5/orc-core-1.5.5-nohive.jar:/home/jenkins/.m2/repository/org/apache/zookeeper/zookeeper/3.4.6/zookeeper-3.4.6.jar:/home/jenkins/.m2/repository/javax/activation/activation/1.1.1/activation-1.1.1.jar:/home/jenkins/.m2/repository/commons-cli/commons-cli/1.2/commons-cli-1.2.jar:/home/jenkins/.m2/repository/commons-codec/commons-codec/1.10/commons-codec-1.10.jar:/home/jenkins/.m2/repository/org/apache/parquet/parquet-encoding/1.10.1/parquet-encoding-1.10.1.jar:/home/jenkins/.m2/repository/xerces/xercesImpl/2.9.1/xercesImpl-2.9.1.jar:/home/jenkins/.m2/repository/org/slf4j/slf4j-log4j12/1.7.16/slf4j-log4j12-1.7.16.jar:/home/jenkins/.m2/repository/commons-beanutils/commons-beanutils/1.9.4/commons-beanutils-1.9.4.jar:/home/jenkins/.m2/repository/org/spark-project/spark/unused/1.0.0/unused-1.0.0.jar:/home/jenkins/.m2/repository/org/apache/hadoop/hadoop-annotations/2.7.3/hadoop-annotations-2.7.3.jar:/home/jenkins/.m2/repository/org/apache/commons/commons-math3/3.4.1/commons-math3-3.4.1.jar:/home/jenkins/.m2/repository/commons-collections/commons-collections/3.2.2/commons-collections-3.2.2.jar:/home/jenkins/.m2/repository/org/apache/hadoop/hadoop-mapreduce-client-common/2.7.3/hadoop-mapreduce-client-common-2.7.3.jar:/home/jenkins/.m2/repository/javax/xml/stream/stax-api/1.0-2/stax-api-1.0-2.jar:/home/jenkins/.m2/repository/org/apache/hadoop/hadoop-mapreduce-client-jobclient/2.7.3/hadoop-mapreduce-client-jobclient-2.7.3.jar:/home/jenkins/.m2/repository/org/apache/parquet/parquet-jackson/1.10.1/parquet-jackson-1.10.1.jar:/home/jenkins/.m2/repository/org/apache/hadoop/hadoop-mapreduce-client-app/2.7.3/hadoop-mapreduce-client-app-2.7.3.jar:/home/jenkins/.m2/repository/org/codehaus/jackson/jackson-xc/1.9.13/jackson-xc-1.9.13.jar:/home/jenkins/.m2/repository/org/apache/httpcomponents/httpclient/4.5.6/httpclient-4.5.6.jar:/home/jenkins/.m2/repository/org/apache/avro/avro-mapred/1.8.2/avro-mapred-1.8.2-hadoop2.jar:/home/jenkins/.m2/repository/commons-httpclient/commons-httpclient/3.1/commons-httpclient-3.1.jar
[INFO] 
[INFO] --- maven-remote-resources-plugin:1.5:process (process-resource-bundles) @ spark-avro_2.11 ---
[INFO] 
[INFO] --- maven-resources-plugin:2.7:resources (default-resources) @ spark-avro_2.11 ---
[INFO] Using 'UTF-8' encoding to copy filtered resources.
[INFO] Copying 1 resource
[INFO] Copying 3 resources
[INFO] 
[INFO] --- maven-compiler-plugin:3.7.0:compile (default-compile) @ spark-avro_2.11 ---
[INFO] Not compiling main sources
[INFO] 
[INFO] --- scala-maven-plugin:3.2.2:compile (scala-compile-first) @ spark-avro_2.11 ---
[INFO] Using zinc server for incremental compilation
[info] Compiling 10 Scala sources and 1 Java source to /home/jenkins/workspace/spark-branch-2.4-test-maven-hadoop-2.7/external/avro/target/scala-2.11/classes...
[warn] /home/jenkins/workspace/spark-branch-2.4-test-maven-hadoop-2.7/external/avro/src/main/java/org/apache/spark/sql/avro/SparkAvroKeyOutputFormat.java:55: warning: [rawtypes] found raw type: SparkAvroKeyRecordWriter
[warn]       return new SparkAvroKeyRecordWriter(
[warn]                  ^
[warn]   missing type arguments for generic class SparkAvroKeyRecordWriter<T>
[warn]   where T is a type-variable:
[warn]     T extends Object declared in class SparkAvroKeyRecordWriter
[warn] /home/jenkins/workspace/spark-branch-2.4-test-maven-hadoop-2.7/external/avro/src/main/java/org/apache/spark/sql/avro/SparkAvroKeyOutputFormat.java:55: warning: [unchecked] unchecked call to SparkAvroKeyRecordWriter(Schema,GenericData,CodecFactory,OutputStream,int,Map<String,String>) as a member of the raw type SparkAvroKeyRecordWriter
[warn]       return new SparkAvroKeyRecordWriter(
[warn]              ^
[warn] /home/jenkins/workspace/spark-branch-2.4-test-maven-hadoop-2.7/external/avro/src/main/java/org/apache/spark/sql/avro/SparkAvroKeyOutputFormat.java:55: warning: [unchecked] unchecked conversion
[warn]       return new SparkAvroKeyRecordWriter(
[warn]              ^
[warn]   required: RecordWriter<AvroKey<GenericRecord>,NullWritable>
[warn]   found:    SparkAvroKeyRecordWriter
[warn] /home/jenkins/workspace/spark-branch-2.4-test-maven-hadoop-2.7/external/avro/src/main/java/org/apache/spark/sql/avro/SparkAvroKeyOutputFormat.java:74: warning: [rawtypes] found raw type: DataFileWriter
[warn]     this.mAvroFileWriter = new DataFileWriter(dataModel.createDatumWriter(writerSchema));
[warn]                                ^
[warn]   missing type arguments for generic class DataFileWriter<D>
[warn]   where D is a type-variable:
[warn]     D extends Object declared in class DataFileWriter
[warn] /home/jenkins/workspace/spark-branch-2.4-test-maven-hadoop-2.7/external/avro/src/main/java/org/apache/spark/sql/avro/SparkAvroKeyOutputFormat.java:74: warning: [unchecked] unchecked call to DataFileWriter(DatumWriter<D>) as a member of the raw type DataFileWriter
[warn]     this.mAvroFileWriter = new DataFileWriter(dataModel.createDatumWriter(writerSchema));
[warn]                            ^
[warn]   where D is a type-variable:
[warn]     D extends Object declared in class DataFileWriter
[warn] /home/jenkins/workspace/spark-branch-2.4-test-maven-hadoop-2.7/external/avro/src/main/java/org/apache/spark/sql/avro/SparkAvroKeyOutputFormat.java:74: warning: [unchecked] unchecked conversion
[warn]     this.mAvroFileWriter = new DataFileWriter(dataModel.createDatumWriter(writerSchema));
[warn]                            ^
[warn]   required: DataFileWriter<T>
[warn]   found:    DataFileWriter
[warn]   where T is a type-variable:
[warn]     T extends Object declared in class SparkAvroKeyRecordWriter
[warn] 6 warnings
[info] Compile success at Sep 25, 2020 10:37:01 AM [14.983s]
[INFO] 
[INFO] --- maven-antrun-plugin:1.8:run (create-tmp-dir) @ spark-avro_2.11 ---
[INFO] Executing tasks

main:
[INFO] Executed tasks
[INFO] 
[INFO] --- maven-resources-plugin:2.7:testResources (default-testResources) @ spark-avro_2.11 ---
[INFO] Using 'UTF-8' encoding to copy filtered resources.
[INFO] Copying 16 resources
[INFO] Copying 3 resources
[INFO] 
[INFO] --- maven-compiler-plugin:3.7.0:testCompile (default-testCompile) @ spark-avro_2.11 ---
[INFO] Not compiling test sources
[INFO] 
[INFO] --- maven-dependency-plugin:3.0.2:build-classpath (generate-test-classpath) @ spark-avro_2.11 ---
[INFO] Dependencies classpath:
/home/jenkins/.m2/repository/org/eclipse/jetty/jetty-security/9.3.27.v20190418/jetty-security-9.3.27.v20190418.jar:/home/jenkins/.m2/repository/com/fasterxml/jackson/module/jackson-module-scala_2.11/2.6.7.1/jackson-module-scala_2.11-2.6.7.1.jar:/home/jenkins/.m2/repository/org/apache/htrace/htrace-core/3.1.0-incubating/htrace-core-3.1.0-incubating.jar:/home/jenkins/.m2/repository/com/google/protobuf/protobuf-java/2.5.0/protobuf-java-2.5.0.jar:/home/jenkins/.m2/repository/org/lz4/lz4-java/1.4.0/lz4-java-1.4.0.jar:/home/jenkins/.m2/repository/org/scalactic/scalactic_2.11/3.0.3/scalactic_2.11-3.0.3.jar:/home/jenkins/.m2/repository/org/apache/parquet/parquet-column/1.10.1/parquet-column-1.10.1.jar:/home/jenkins/.m2/repository/com/fasterxml/jackson/module/jackson-module-paranamer/2.7.9/jackson-module-paranamer-2.7.9.jar:/home/jenkins/.m2/repository/org/apache/commons/commons-compress/1.8.1/commons-compress-1.8.1.jar:/home/jenkins/.m2/repository/org/json4s/json4s-ast_2.11/3.5.3/json4s-ast_2.11-3.5.3.jar:/home/jenkins/.m2/repository/io/netty/netty-all/4.1.47.Final/netty-all-4.1.47.Final.jar:/home/jenkins/.m2/repository/com/thoughtworks/paranamer/paranamer/2.8/paranamer-2.8.jar:/home/jenkins/.m2/repository/xml-apis/xml-apis/1.4.01/xml-apis-1.4.01.jar:/home/jenkins/.m2/repository/org/fusesource/leveldbjni/leveldbjni-all/1.8/leveldbjni-all-1.8.jar:/home/jenkins/.m2/repository/org/tukaani/xz/1.5/xz-1.5.jar:/home/jenkins/workspace/spark-branch-2.4-test-maven-hadoop-2.7/common/kvstore/target/scala-2.11/classes:/home/jenkins/.m2/repository/org/glassfish/jersey/bundles/repackaged/jersey-guava/2.22.2/jersey-guava-2.22.2.jar:/home/jenkins/.m2/repository/org/apache/commons/commons-crypto/1.0.0/commons-crypto-1.0.0.jar:/home/jenkins/.m2/repository/org/antlr/antlr4-runtime/4.7/antlr4-runtime-4.7.jar:/home/jenkins/.m2/repository/commons-io/commons-io/2.4/commons-io-2.4.jar:/home/jenkins/.m2/repository/org/scala-lang/scala-reflect/2.11.12/scala-reflect-2.11.12.jar:/home/jenkins/.m2/repository/org/eclipse/jetty/jetty-servlet/9.3.27.v20190418/jetty-servlet-9.3.27.v20190418.jar:/home/jenkins/.m2/repository/org/apache/commons/commons-lang3/3.5/commons-lang3-3.5.jar:/home/jenkins/.m2/repository/org/codehaus/jackson/jackson-jaxrs/1.9.13/jackson-jaxrs-1.9.13.jar:/home/jenkins/.m2/repository/org/apache/parquet/parquet-hadoop/1.10.1/parquet-hadoop-1.10.1.jar:/home/jenkins/.m2/repository/org/apache/orc/orc-shims/1.5.5/orc-shims-1.5.5.jar:/home/jenkins/.m2/repository/org/apache/hadoop/hadoop-auth/2.7.3/hadoop-auth-2.7.3.jar:/home/jenkins/.m2/repository/com/esotericsoftware/kryo-shaded/4.0.2/kryo-shaded-4.0.2.jar:/home/jenkins/.m2/repository/com/esotericsoftware/minlog/1.3.0/minlog-1.3.0.jar:/home/jenkins/.m2/repository/org/apache/hadoop/hadoop-client/2.7.3/hadoop-client-2.7.3.jar:/home/jenkins/.m2/repository/org/apache/hadoop/hadoop-mapreduce-client-shuffle/2.7.3/hadoop-mapreduce-client-shuffle-2.7.3.jar:/home/jenkins/.m2/repository/org/codehaus/jackson/jackson-core-asl/1.9.13/jackson-core-asl-1.9.13.jar:/home/jenkins/.m2/repository/javax/validation/validation-api/1.1.0.Final/validation-api-1.1.0.Final.jar:/home/jenkins/.m2/repository/org/scalacheck/scalacheck_2.11/1.13.5/scalacheck_2.11-1.13.5.jar:/home/jenkins/workspace/spark-branch-2.4-test-maven-hadoop-2.7/core/target/scala-2.11/classes:/home/jenkins/.m2/repository/org/glassfish/jersey/core/jersey-common/2.22.2/jersey-common-2.22.2.jar:/home/jenkins/.m2/repository/org/objenesis/objenesis/2.5.1/objenesis-2.5.1.jar:/home/jenkins/.m2/repository/org/apache/hadoop/hadoop-mapreduce-client-core/2.7.3/hadoop-mapreduce-client-core-2.7.3.jar:/home/jenkins/.m2/repository/joda-time/joda-time/2.9.3/joda-time-2.9.3.jar:/home/jenkins/.m2/repository/org/scala-lang/modules/scala-xml_2.11/1.0.5/scala-xml_2.11-1.0.5.jar:/home/jenkins/.m2/repository/org/apache/orc/orc-mapreduce/1.5.5/orc-mapreduce-1.5.5-nohive.jar:/home/jenkins/.m2/repository/com/google/code/findbugs/jsr305/1.3.9/jsr305-1.3.9.jar:/home/jenkins/.m2/repository/commons-net/commons-net/3.1/commons-net-3.1.jar:/home/jenkins/.m2/repository/javax/xml/bind/jaxb-api/2.2.2/jaxb-api-2.2.2.jar:/home/jenkins/.m2/repository/org/glassfish/hk2/hk2-api/2.4.0-b34/hk2-api-2.4.0-b34.jar:/home/jenkins/.m2/repository/org/xerial/snappy/snappy-java/1.1.7.5/snappy-java-1.1.7.5.jar:/home/jenkins/.m2/repository/org/glassfish/jersey/core/jersey-server/2.22.2/jersey-server-2.22.2.jar:/home/jenkins/.m2/repository/com/twitter/chill_2.11/0.9.3/chill_2.11-0.9.3.jar:/home/jenkins/.m2/repository/commons-lang/commons-lang/2.6/commons-lang-2.6.jar:/home/jenkins/.m2/repository/org/apache/hadoop/hadoop-yarn-client/2.7.3/hadoop-yarn-client-2.7.3.jar:/home/jenkins/.m2/repository/org/apache/zookeeper/zookeeper/3.4.6/zookeeper-3.4.6.jar:/home/jenkins/.m2/repository/org/codehaus/janino/janino/3.0.16/janino-3.0.16.jar:/home/jenkins/.m2/repository/javax/activation/activation/1.1.1/activation-1.1.1.jar:/home/jenkins/.m2/repository/commons-codec/commons-codec/1.10/commons-codec-1.10.jar:/home/jenkins/.m2/repository/com/univocity/univocity-parsers/2.7.3/univocity-parsers-2.7.3.jar:/home/jenkins/.m2/repository/com/google/guava/guava/14.0.1/guava-14.0.1.jar:/home/jenkins/.m2/repository/org/apache/parquet/parquet-encoding/1.10.1/parquet-encoding-1.10.1.jar:/home/jenkins/.m2/repository/org/eclipse/jetty/jetty-webapp/9.3.27.v20190418/jetty-webapp-9.3.27.v20190418.jar:/home/jenkins/.m2/repository/org/json4s/json4s-jackson_2.11/3.5.3/json4s-jackson_2.11-3.5.3.jar:/home/jenkins/.m2/repository/org/javassist/javassist/3.18.1-GA/javassist-3.18.1-GA.jar:/home/jenkins/.m2/repository/org/apache/xbean/xbean-asm6-shaded/4.8/xbean-asm6-shaded-4.8.jar:/home/jenkins/.m2/repository/commons-beanutils/commons-beanutils/1.9.4/commons-beanutils-1.9.4.jar:/home/jenkins/.m2/repository/org/apache/ivy/ivy/2.4.0/ivy-2.4.0.jar:/home/jenkins/workspace/spark-branch-2.4-test-maven-hadoop-2.7/core/target/scala-2.11/test-classes:/home/jenkins/.m2/repository/org/eclipse/jetty/jetty-util/9.3.27.v20190418/jetty-util-9.3.27.v20190418.jar:/home/jenkins/.m2/repository/org/eclipse/jetty/jetty-client/9.3.27.v20190418/jetty-client-9.3.27.v20190418.jar:/home/jenkins/.m2/repository/javax/servlet/javax.servlet-api/3.1.0/javax.servlet-api-3.1.0.jar:/home/jenkins/.m2/repository/org/glassfish/hk2/osgi-resource-locator/1.0.1/osgi-resource-locator-1.0.1.jar:/home/jenkins/.m2/repository/com/fasterxml/jackson/core/jackson-core/2.6.7/jackson-core-2.6.7.jar:/home/jenkins/.m2/repository/org/apache/commons/commons-math3/3.4.1/commons-math3-3.4.1.jar:/home/jenkins/.m2/repository/org/apache/hadoop/hadoop-mapreduce-client-common/2.7.3/hadoop-mapreduce-client-common-2.7.3.jar:/home/jenkins/.m2/repository/org/scala-lang/modules/scala-parser-combinators_2.11/1.1.0/scala-parser-combinators_2.11-1.1.0.jar:/home/jenkins/.m2/repository/io/dropwizard/metrics/metrics-graphite/3.1.5/metrics-graphite-3.1.5.jar:/home/jenkins/.m2/repository/javax/xml/stream/stax-api/1.0-2/stax-api-1.0-2.jar:/home/jenkins/.m2/repository/org/apache/hadoop/hadoop-mapreduce-client-jobclient/2.7.3/hadoop-mapreduce-client-jobclient-2.7.3.jar:/home/jenkins/.m2/repository/org/codehaus/jackson/jackson-xc/1.9.13/jackson-xc-1.9.13.jar:/home/jenkins/.m2/repository/org/eclipse/jetty/jetty-server/9.3.27.v20190418/jetty-server-9.3.27.v20190418.jar:/home/jenkins/.m2/repository/org/glassfish/hk2/hk2-utils/2.4.0-b34/hk2-utils-2.4.0-b34.jar:/home/jenkins/.m2/repository/org/glassfish/hk2/external/aopalliance-repackaged/2.4.0-b34/aopalliance-repackaged-2.4.0-b34.jar:/home/jenkins/.m2/repository/net/sf/py4j/py4j/0.10.7/py4j-0.10.7.jar:/home/jenkins/.m2/repository/org/json4s/json4s-scalap_2.11/3.5.3/json4s-scalap_2.11-3.5.3.jar:/home/jenkins/.m2/repository/org/glassfish/hk2/external/javax.inject/2.4.0-b34/javax.inject-2.4.0-b34.jar:/home/jenkins/.m2/repository/org/glassfish/jersey/containers/jersey-container-servlet-core/2.22.2/jersey-container-servlet-core-2.22.2.jar:/home/jenkins/.m2/repository/oro/oro/2.0.8/oro-2.0.8.jar:/home/jenkins/.m2/repository/org/apache/avro/avro-mapred/1.8.2/avro-mapred-1.8.2-hadoop2.jar:/home/jenkins/.m2/repository/org/eclipse/jetty/jetty-continuation/9.3.27.v20190418/jetty-continuation-9.3.27.v20190418.jar:/home/jenkins/workspace/spark-branch-2.4-test-maven-hadoop-2.7/common/network-common/target/scala-2.11/classes:/home/jenkins/.m2/repository/org/apache/hadoop/hadoop-yarn-common/2.7.3/hadoop-yarn-common-2.7.3.jar:/home/jenkins/.m2/repository/org/eclipse/jetty/jetty-http/9.3.27.v20190418/jetty-http-9.3.27.v20190418.jar:/home/jenkins/.m2/repository/org/scalatest/scalatest_2.11/3.0.3/scalatest_2.11-3.0.3.jar:/home/jenkins/workspace/spark-branch-2.4-test-maven-hadoop-2.7/common/unsafe/target/scala-2.11/classes:/home/jenkins/.m2/repository/org/apache/hadoop/hadoop-yarn-api/2.7.3/hadoop-yarn-api-2.7.3.jar:/home/jenkins/.m2/repository/log4j/log4j/1.2.17/log4j-1.2.17.jar:/home/jenkins/.m2/repository/org/codehaus/janino/commons-compiler/3.0.16/commons-compiler-3.0.16.jar:/home/jenkins/.m2/repository/com/novocode/junit-interface/0.11/junit-interface-0.11.jar:/home/jenkins/.m2/repository/org/apache/hadoop/hadoop-yarn-server-common/2.7.3/hadoop-yarn-server-common-2.7.3.jar:/home/jenkins/.m2/repository/org/apache/httpcomponents/httpcore/4.4.10/httpcore-4.4.10.jar:/home/jenkins/workspace/spark-branch-2.4-test-maven-hadoop-2.7/sql/catalyst/target/scala-2.11/classes:/home/jenkins/.m2/repository/org/apache/curator/curator-framework/2.7.1/curator-framework-2.7.1.jar:/home/jenkins/workspace/spark-branch-2.4-test-maven-hadoop-2.7/common/sketch/target/scala-2.11/classes:/home/jenkins/.m2/repository/org/apache/curator/curator-recipes/2.7.1/curator-recipes-2.7.1.jar:/home/jenkins/.m2/repository/org/eclipse/jetty/jetty-xml/9.3.27.v20190418/jetty-xml-9.3.27.v20190418.jar:/home/jenkins/.m2/repository/io/dropwizard/metrics/metrics-json/3.1.5/metrics-json-3.1.5.jar:/home/jenkins/.m2/repository/org/apache/avro/avro/1.8.2/avro-1.8.2.jar:/home/jenkins/.m2/repository/org/apache/directory/server/apacheds-kerberos-codec/2.0.0-M15/apacheds-kerberos-codec-2.0.0-M15.jar:/home/jenkins/.m2/repository/io/dropwizard/metrics/metrics-core/3.1.5/metrics-core-3.1.5.jar:/home/jenkins/workspace/spark-branch-2.4-test-maven-hadoop-2.7/common/tags/target/scala-2.11/classes:/home/jenkins/.m2/repository/org/apache/arrow/arrow-memory/0.10.0/arrow-memory-0.10.0.jar:/home/jenkins/.m2/repository/org/slf4j/slf4j-api/1.7.16/slf4j-api-1.7.16.jar:/home/jenkins/.m2/repository/org/eclipse/jetty/jetty-io/9.3.27.v20190418/jetty-io-9.3.27.v20190418.jar:/home/jenkins/workspace/spark-branch-2.4-test-maven-hadoop-2.7/launcher/target/scala-2.11/classes:/home/jenkins/.m2/repository/org/mortbay/jetty/jetty-util/6.1.26/jetty-util-6.1.26.jar:/home/jenkins/.m2/repository/com/vlkan/flatbuffers/1.2.0-3f79e055/flatbuffers-1.2.0-3f79e055.jar:/home/jenkins/.m2/repository/org/scala-sbt/test-interface/1.0/test-interface-1.0.jar:/home/jenkins/.m2/repository/org/hamcrest/hamcrest-core/1.3/hamcrest-core-1.3.jar:/home/jenkins/.m2/repository/org/codehaus/jackson/jackson-mapper-asl/1.9.13/jackson-mapper-asl-1.9.13.jar:/home/jenkins/workspace/spark-branch-2.4-test-maven-hadoop-2.7/common/network-shuffle/target/scala-2.11/classes:/home/jenkins/.m2/repository/javax/ws/rs/javax.ws.rs-api/2.0.1/javax.ws.rs-api-2.0.1.jar:/home/jenkins/.m2/repository/javax/servlet/jsp/jsp-api/2.1/jsp-api-2.1.jar:/home/jenkins/workspace/spark-branch-2.4-test-maven-hadoop-2.7/sql/catalyst/target/spark-catalyst_2.11-2.4.8-SNAPSHOT-tests.jar:/home/jenkins/.m2/repository/org/glassfish/jersey/core/jersey-client/2.22.2/jersey-client-2.22.2.jar:/home/jenkins/.m2/repository/io/netty/netty/3.9.9.Final/netty-3.9.9.Final.jar:/home/jenkins/.m2/repository/org/roaringbitmap/shims/0.7.45/shims-0.7.45.jar:/home/jenkins/.m2/repository/org/apache/avro/avro-ipc/1.8.2/avro-ipc-1.8.2.jar:/home/jenkins/.m2/repository/xmlenc/xmlenc/0.52/xmlenc-0.52.jar:/home/jenkins/.m2/repository/com/ning/compress-lzf/1.0.3/compress-lzf-1.0.3.jar:/home/jenkins/.m2/repository/org/apache/hadoop/hadoop-hdfs/2.7.3/hadoop-hdfs-2.7.3.jar:/home/jenkins/.m2/repository/org/apache/directory/api/api-util/1.0.0-M20/api-util-1.0.0-M20.jar:/home/jenkins/workspace/spark-branch-2.4-test-maven-hadoop-2.7/sql/core/target/spark-sql_2.11-2.4.8-SNAPSHOT-tests.jar:/home/jenkins/.m2/repository/com/google/code/gson/gson/2.2.4/gson-2.2.4.jar:/home/jenkins/.m2/repository/org/apache/directory/api/api-asn1-api/1.0.0-M20/api-asn1-api-1.0.0-M20.jar:/home/jenkins/.m2/repository/com/clearspring/analytics/stream/2.7.0/stream-2.7.0.jar:/home/jenkins/.m2/repository/org/apache/parquet/parquet-common/1.10.1/parquet-common-1.10.1.jar:/home/jenkins/.m2/repository/org/apache/arrow/arrow-vector/0.10.0/arrow-vector-0.10.0.jar:/home/jenkins/.m2/repository/com/fasterxml/jackson/core/jackson-annotations/2.6.7/jackson-annotations-2.6.7.jar:/home/jenkins/.m2/repository/org/apache/hadoop/hadoop-common/2.7.3/hadoop-common-2.7.3.jar:/home/jenkins/.m2/repository/org/apache/parquet/parquet-format/2.4.0/parquet-format-2.4.0.jar:/home/jenkins/.m2/repository/commons-configuration/commons-configuration/1.6/commons-configuration-1.6.jar:/home/jenkins/.m2/repository/org/glassfish/jersey/containers/jersey-container-servlet/2.22.2/jersey-container-servlet-2.22.2.jar:/home/jenkins/.m2/repository/commons-digester/commons-digester/1.8/commons-digester-1.8.jar:/home/jenkins/.m2/repository/org/slf4j/jul-to-slf4j/1.7.16/jul-to-slf4j-1.7.16.jar:/home/jenkins/.m2/repository/io/airlift/aircompressor/0.10/aircompressor-0.10.jar:/home/jenkins/.m2/repository/org/apache/directory/server/apacheds-i18n/2.0.0-M15/apacheds-i18n-2.0.0-M15.jar:/home/jenkins/.m2/repository/org/scala-lang/scala-library/2.11.12/scala-library-2.11.12.jar:/home/jenkins/.m2/repository/org/eclipse/jetty/jetty-proxy/9.3.27.v20190418/jetty-proxy-9.3.27.v20190418.jar:/home/jenkins/.m2/repository/org/apache/curator/curator-client/2.7.1/curator-client-2.7.1.jar:/home/jenkins/workspace/spark-branch-2.4-test-maven-hadoop-2.7/sql/core/target/scala-2.11/classes:/home/jenkins/.m2/repository/org/apache/orc/orc-core/1.5.5/orc-core-1.5.5-nohive.jar:/home/jenkins/.m2/repository/com/fasterxml/jackson/core/jackson-databind/2.6.7.3/jackson-databind-2.6.7.3.jar:/home/jenkins/.m2/repository/org/roaringbitmap/RoaringBitmap/0.7.45/RoaringBitmap-0.7.45.jar:/home/jenkins/.m2/repository/org/eclipse/jetty/jetty-jndi/9.3.27.v20190418/jetty-jndi-9.3.27.v20190418.jar:/home/jenkins/.m2/repository/org/apache/arrow/arrow-format/0.10.0/arrow-format-0.10.0.jar:/home/jenkins/.m2/repository/commons-cli/commons-cli/1.2/commons-cli-1.2.jar:/home/jenkins/.m2/repository/xerces/xercesImpl/2.9.1/xercesImpl-2.9.1.jar:/home/jenkins/.m2/repository/javax/annotation/javax.annotation-api/1.2/javax.annotation-api-1.2.jar:/home/jenkins/.m2/repository/org/slf4j/slf4j-log4j12/1.7.16/slf4j-log4j12-1.7.16.jar:/home/jenkins/.m2/repository/org/glassfish/jersey/media/jersey-media-jaxb/2.22.2/jersey-media-jaxb-2.22.2.jar:/home/jenkins/.m2/repository/org/spark-project/spark/unused/1.0.0/unused-1.0.0.jar:/home/jenkins/.m2/repository/com/twitter/chill-java/0.9.3/chill-java-0.9.3.jar:/home/jenkins/.m2/repository/org/eclipse/jetty/jetty-plus/9.3.27.v20190418/jetty-plus-9.3.27.v20190418.jar:/home/jenkins/.m2/repository/io/dropwizard/metrics/metrics-jvm/3.1.5/metrics-jvm-3.1.5.jar:/home/jenkins/.m2/repository/org/apache/hadoop/hadoop-annotations/2.7.3/hadoop-annotations-2.7.3.jar:/home/jenkins/.m2/repository/com/github/luben/zstd-jni/1.3.2-2/zstd-jni-1.3.2-2.jar:/home/jenkins/.m2/repository/org/json4s/json4s-core_2.11/3.5.3/json4s-core_2.11-3.5.3.jar:/home/jenkins/.m2/repository/commons-collections/commons-collections/3.2.2/commons-collections-3.2.2.jar:/home/jenkins/.m2/repository/junit/junit/4.12/junit-4.12.jar:/home/jenkins/.m2/repository/com/carrotsearch/hppc/0.7.2/hppc-0.7.2.jar:/home/jenkins/.m2/repository/org/eclipse/jetty/jetty-servlets/9.3.27.v20190418/jetty-servlets-9.3.27.v20190418.jar:/home/jenkins/.m2/repository/org/glassfish/hk2/hk2-locator/2.4.0-b34/hk2-locator-2.4.0-b34.jar:/home/jenkins/.m2/repository/org/apache/parquet/parquet-jackson/1.10.1/parquet-jackson-1.10.1.jar:/home/jenkins/.m2/repository/org/apache/hadoop/hadoop-mapreduce-client-app/2.7.3/hadoop-mapreduce-client-app-2.7.3.jar:/home/jenkins/.m2/repository/org/apache/httpcomponents/httpclient/4.5.6/httpclient-4.5.6.jar:/home/jenkins/.m2/repository/net/razorvine/pyrolite/4.13/pyrolite-4.13.jar:/home/jenkins/.m2/repository/org/slf4j/jcl-over-slf4j/1.7.16/jcl-over-slf4j-1.7.16.jar:/home/jenkins/.m2/repository/commons-httpclient/commons-httpclient/3.1/commons-httpclient-3.1.jar
[INFO] 
[INFO] --- scala-maven-plugin:3.2.2:testCompile (scala-test-compile-first) @ spark-avro_2.11 ---
[INFO] Using zinc server for incremental compilation
[info] Compiling 5 Scala sources to /home/jenkins/workspace/spark-branch-2.4-test-maven-hadoop-2.7/external/avro/target/scala-2.11/test-classes...
[warn] /home/jenkins/workspace/spark-branch-2.4-test-maven-hadoop-2.7/external/avro/src/test/scala/org/apache/spark/sql/avro/AvroSuite.scala:141: constructor Field in class Field is deprecated: see corresponding Javadoc for more information.
[warn]         Seq(new Field("null", Schema.create(Type.NULL), "doc", null)).asJava
[warn]             ^
[warn] /home/jenkins/workspace/spark-branch-2.4-test-maven-hadoop-2.7/external/avro/src/test/scala/org/apache/spark/sql/avro/AvroSuite.scala:164: constructor Field in class Field is deprecated: see corresponding Javadoc for more information.
[warn]         val fields = Seq(new Field("field1", union, "doc", null)).asJava
[warn]                          ^
[warn] /home/jenkins/workspace/spark-branch-2.4-test-maven-hadoop-2.7/external/avro/src/test/scala/org/apache/spark/sql/avro/AvroSuite.scala:192: constructor Field in class Field is deprecated: see corresponding Javadoc for more information.
[warn]         val fields = Seq(new Field("field1", union, "doc", null)).asJava
[warn]                          ^
[warn] /home/jenkins/workspace/spark-branch-2.4-test-maven-hadoop-2.7/external/avro/src/test/scala/org/apache/spark/sql/avro/AvroSuite.scala:224: constructor Field in class Field is deprecated: see corresponding Javadoc for more information.
[warn]         val fields = Seq(new Field("field1", union, "doc", null)).asJava
[warn]                          ^
[warn] /home/jenkins/workspace/spark-branch-2.4-test-maven-hadoop-2.7/external/avro/src/test/scala/org/apache/spark/sql/avro/AvroSuite.scala:250: constructor Field in class Field is deprecated: see corresponding Javadoc for more information.
[warn]       val fields = Seq(new Field("field1", UnionOfOne, "doc", null)).asJava
[warn]                        ^
[warn] /home/jenkins/workspace/spark-branch-2.4-test-maven-hadoop-2.7/external/avro/src/test/scala/org/apache/spark/sql/avro/AvroSuite.scala:303: constructor Field in class Field is deprecated: see corresponding Javadoc for more information.
[warn]         new Field("field1", complexUnionType, "doc", null),
[warn]         ^
[warn] /home/jenkins/workspace/spark-branch-2.4-test-maven-hadoop-2.7/external/avro/src/test/scala/org/apache/spark/sql/avro/AvroSuite.scala:304: constructor Field in class Field is deprecated: see corresponding Javadoc for more information.
[warn]         new Field("field2", complexUnionType, "doc", null),
[warn]         ^
[warn] /home/jenkins/workspace/spark-branch-2.4-test-maven-hadoop-2.7/external/avro/src/test/scala/org/apache/spark/sql/avro/AvroSuite.scala:305: constructor Field in class Field is deprecated: see corresponding Javadoc for more information.
[warn]         new Field("field3", complexUnionType, "doc", null),
[warn]         ^
[warn] /home/jenkins/workspace/spark-branch-2.4-test-maven-hadoop-2.7/external/avro/src/test/scala/org/apache/spark/sql/avro/AvroSuite.scala:306: constructor Field in class Field is deprecated: see corresponding Javadoc for more information.
[warn]         new Field("field4", complexUnionType, "doc", null)
[warn]         ^
[warn] /home/jenkins/workspace/spark-branch-2.4-test-maven-hadoop-2.7/external/avro/src/test/scala/org/apache/spark/sql/avro/AvroSuite.scala:970: constructor Field in class Field is deprecated: see corresponding Javadoc for more information.
[warn]       val avroField = new Field(name, avroType, "", null)
[warn]                       ^
[warn] 10 warnings found
[info] Compile success at Sep 25, 2020 10:37:20 AM [18.804s]
[INFO] 
[INFO] --- maven-surefire-plugin:2.22.0:test (default-test) @ spark-avro_2.11 ---
[INFO] 
[INFO] -------------------------------------------------------
[INFO]  T E S T S
[INFO] -------------------------------------------------------
[INFO] 
[INFO] Results:
[INFO] 
[INFO] Tests run: 0, Failures: 0, Errors: 0, Skipped: 0
[INFO] 
[INFO] 
[INFO] --- maven-surefire-plugin:2.22.0:test (test) @ spark-avro_2.11 ---
[INFO] Skipping execution of surefire because it has already been run for this configuration
[INFO] 
[INFO] --- scalatest-maven-plugin:1.0:test (test) @ spark-avro_2.11 ---
Discovery starting.
Discovery completed in 405 milliseconds.
Run starting. Expected test count is: 98
AvroCatalystDataConversionSuite:
- single BooleanType with seed -2740396649609507771
- single ByteType with seed -7389462774226491760
- single ShortType with seed -3671780905785175004
- single IntegerType with seed 5956330270014782668
- single LongType with seed 4114561142862827666
- single FloatType with seed -4427966184182082330
- single DoubleType with seed 8259754045157217823
- single DecimalType(8,0) with seed -7970269368092083331
- single DecimalType(8,4) with seed 2293114395612171284
- single DecimalType(16,0) with seed 9051217264857029956
- single DecimalType(16,11) with seed 5692025552876337076
- single DecimalType(38,0) with seed -6354615244009763358
- single DecimalType(38,38) with seed -2612436399204862012
- single StringType with seed -2731862666565478119
- single BinaryType with seed 2957955623445312589
- flat schema struct<col_0:decimal(38,38),col_1:decimal(8,0),col_2:decimal(38,0),col_3:tinyint,col_4:binary> with seed 932259183770649129
- flat schema struct<col_0:bigint,col_1:boolean,col_2:decimal(38,38),col_3:float,col_4:smallint> with seed -4698638217825352032
- flat schema struct<col_0:smallint,col_1:boolean,col_2:tinyint,col_3:boolean,col_4:double> with seed -4417579961568832138
- flat schema struct<col_0:binary,col_1:binary,col_2:boolean,col_3:decimal(38,38),col_4:decimal(8,4)> with seed 4824913951058369947
- flat schema struct<col_0:int,col_1:boolean,col_2:decimal(38,0),col_3:binary,col_4:binary> with seed 2880775007523090536
- nested schema struct<col_0:struct<col_0:decimal(16,0)>,col_1:array<decimal(8,0)>,col_2:double,col_3:float,col_4:struct<col_0:struct<col_0:struct<col_0:array<decimal(38,0)>>>>,col_5:struct<col_0:struct<col_0:binary>>,col_6:struct<col_0:struct<col_0:struct<col_0:float>>,col_1:array<double>,col_2:array<int>>,col_7:array<boolean>> with seed 5338265512002052649
- nested schema struct<col_0:array<decimal(16,0)>,col_1:bigint,col_2:struct<col_0:array<boolean>,col_1:decimal(38,38),col_2:array<float>>,col_3:decimal(8,4),col_4:struct<col_0:smallint>,col_5:decimal(8,4),col_6:array<smallint>,col_7:array<decimal(8,4)>> with seed -5223836878573919342
- nested schema struct<col_0:decimal(8,4),col_1:binary,col_2:decimal(38,38),col_3:decimal(8,0),col_4:decimal(16,11),col_5:struct<col_0:decimal(8,4)>,col_6:array<double>,col_7:struct<col_0:array<float>>,col_8:tinyint,col_9:struct<col_0:int>> with seed -6521170483334701042
- nested schema struct<col_0:array<bigint>,col_1:array<double>,col_2:struct<col_0:struct<col_0:array<decimal(8,0)>,col_1:struct<col_0:struct<col_0:struct<col_0:float>>>>,col_1:array<decimal(38,0)>,col_2:struct<col_0:array<binary>>,col_3:array<float>>,col_3:int,col_4:struct<col_0:array<binary>>,col_5:struct<col_0:struct<col_0:array<boolean>>>> with seed 6396388357381870358
- nested schema struct<col_0:struct<col_0:binary,col_1:struct<col_0:struct<col_0:struct<col_0:binary>>,col_1:struct<col_0:boolean>>,col_2:array<binary>,col_3:struct<col_0:array<decimal(16,11)>>,col_4:binary,col_5:array<int>>,col_1:array<float>,col_2:decimal(8,4),col_3:binary> with seed -3938519778371766556
- read int as string
- read string as int
- read float as double
- read double as float
AvroFunctionsSuite:
- roundtrip in to_avro and from_avro - int and string
- roundtrip in to_avro and from_avro - struct
- roundtrip in to_avro and from_avro - array with null
- SPARK-27798: from_avro produces same value when converted to local relation
AvroLogicalTypeSuite:
- Logical type: date
- Logical type: timestamp_millis
- Logical type: timestamp_micros
- Logical type: user specified output schema with different timestamp types
- Read Long type as Timestamp
- Logical type: user specified read schema
- Logical type: Decimal
- Logical type: write Decimal with BYTES type
- Logical type: Decimal with too large precision
AvroSuite:
- resolve avro data source
- reading from multiple paths
- reading and writing partitioned data
- request no fields
- convert formats
- rearrange internal schema
- test NULL avro type
- union(int, long) is read as long
- union(float, double) is read as double
- union(float, double, null) is read as nullable double
- Union of a single type
- SPARK-27858 Union type: More than one non-null type
- Complex Union Type
- Lots of nulls
- Struct field type
- Ignore corrupt Avro file if flag IGNORE_CORRUPT_FILES enabled
- Throws IOException on reading corrupt Avro file if flag IGNORE_CORRUPT_FILES disabled
- Date field type
- Array data types
- write with compression - sql configs
- dsl test
- old avro data source name works
- support of various data types
- sql test
- conversion to avro and back
- conversion to avro and back with namespace
- converting some specific sparkSQL types to avro
- correctly read long as date/timestamp type
- support of globbed paths
- does not coerce null date/timestamp value to 0 epoch.
- support user provided avro schema
- support user provided avro schema with defaults for missing fields
- support user provided avro schema for writing nullable enum type
- support user provided avro schema for writing non-nullable enum type
- support user provided avro schema for writing nullable fixed type
- support user provided avro schema for writing non-nullable fixed type
- throw exception if unable to write with user provided Avro schema
- reading from invalid path throws exception
- SQL test insert overwrite
- test save and load
- test load with non-Avro file
- read avro with user defined schema: read partial columns
- read avro with user defined schema: read non-exist columns
- read avro file partitioned
- Validate namespace in avro file that has nested records with the same name
- saving avro that has nested records with the same name
- check namespace - toAvroType
- check empty namespace - toAvroType
- saving avro that has nested records with the same name inside an array
- saving avro that has nested records with the same name inside a map
- SPARK-24805: do not ignore files without .avro extension by default
- SPARK-24836: checking the ignoreExtension option
- SPARK-24836: ignoreExtension must override hadoop's config
- SPARK-24881: write with compression - avro options
- Detect recursive loop
- SPARK-31327: Write Spark version into Avro file metadata
Run completed in 29 seconds, 820 milliseconds.
Total number of tests run: 98
Suites: completed 5, aborted 0
Tests: succeeded 98, failed 0, canceled 0, ignored 0, pending 0
All tests passed.
[INFO] 
[INFO] -----< org.apache.spark:spark-streaming-kinesis-asl-assembly_2.11 >-----
[INFO] Building Spark Project Kinesis Assembly 2.4.8-SNAPSHOT           [29/30]
[INFO] --------------------------------[ jar ]---------------------------------
[INFO] 
[INFO] --- maven-enforcer-plugin:3.0.0-M1:enforce (enforce-versions) @ spark-streaming-kinesis-asl-assembly_2.11 ---
[INFO] 
[INFO] --- maven-enforcer-plugin:3.0.0-M1:enforce (enforce-no-duplicate-dependencies) @ spark-streaming-kinesis-asl-assembly_2.11 ---
[INFO] 
[INFO] --- scala-maven-plugin:3.2.2:add-source (eclipse-add-source) @ spark-streaming-kinesis-asl-assembly_2.11 ---
[INFO] Add Source directory: /home/jenkins/workspace/spark-branch-2.4-test-maven-hadoop-2.7/external/kinesis-asl-assembly/src/main/scala
[INFO] Add Test Source directory: /home/jenkins/workspace/spark-branch-2.4-test-maven-hadoop-2.7/external/kinesis-asl-assembly/src/test/scala
[INFO] 
[INFO] --- maven-dependency-plugin:3.0.2:build-classpath (default-cli) @ spark-streaming-kinesis-asl-assembly_2.11 ---
[INFO] Dependencies classpath:
/home/jenkins/.m2/repository/joda-time/joda-time/2.9.3/joda-time-2.9.3.jar:/home/jenkins/.m2/repository/org/apache/hadoop/hadoop-yarn-common/2.7.3/hadoop-yarn-common-2.7.3.jar:/home/jenkins/.m2/repository/com/amazonaws/aws-java-sdk-kms/1.11.655/aws-java-sdk-kms-1.11.655.jar:/home/jenkins/.m2/repository/org/apache/hadoop/hadoop-yarn-api/2.7.3/hadoop-yarn-api-2.7.3.jar:/home/jenkins/.m2/repository/org/apache/httpcomponents/httpcore/4.4.10/httpcore-4.4.10.jar:/home/jenkins/.m2/repository/com/fasterxml/jackson/dataformat/jackson-dataformat-cbor/2.6.7/jackson-dataformat-cbor-2.6.7.jar:/home/jenkins/.m2/repository/org/scala-lang/scala-library/2.11.12/scala-library-2.11.12.jar:/home/jenkins/.m2/repository/javax/xml/bind/jaxb-api/2.2.2/jaxb-api-2.2.2.jar:/home/jenkins/.m2/repository/com/thoughtworks/paranamer/paranamer/2.8/paranamer-2.8.jar:/home/jenkins/.m2/repository/com/amazonaws/aws-java-sdk-kinesis/1.11.655/aws-java-sdk-kinesis-1.11.655.jar:/home/jenkins/.m2/repository/org/apache/commons/commons-compress/1.4.1/commons-compress-1.4.1.jar:/home/jenkins/.m2/repository/com/amazonaws/aws-java-sdk-s3/1.11.655/aws-java-sdk-s3-1.11.655.jar:/home/jenkins/.m2/repository/org/apache/hadoop/hadoop-yarn-client/2.7.3/hadoop-yarn-client-2.7.3.jar:/home/jenkins/.m2/repository/com/amazonaws/aws-java-sdk-dynamodb/1.11.655/aws-java-sdk-dynamodb-1.11.655.jar:/home/jenkins/workspace/spark-branch-2.4-test-maven-hadoop-2.7/common/tags/target/scala-2.11/classes:/home/jenkins/.m2/repository/javax/activation/activation/1.1.1/activation-1.1.1.jar:/home/jenkins/.m2/repository/commons-cli/commons-cli/1.2/commons-cli-1.2.jar:/home/jenkins/.m2/repository/commons-codec/commons-codec/1.10/commons-codec-1.10.jar:/home/jenkins/workspace/spark-branch-2.4-test-maven-hadoop-2.7/external/kinesis-asl/target/scala-2.11/classes:/home/jenkins/.m2/repository/com/amazonaws/aws-java-sdk-core/1.11.655/aws-java-sdk-core-1.11.655.jar:/home/jenkins/.m2/repository/org/tukaani/xz/1.5/xz-1.5.jar:/home/jenkins/.m2/repository/com/google/protobuf/protobuf-java/2.6.1/protobuf-java-2.6.1.jar:/home/jenkins/.m2/repository/org/mortbay/jetty/jetty-util/6.1.26/jetty-util-6.1.26.jar:/home/jenkins/.m2/repository/org/spark-project/spark/unused/1.0.0/unused-1.0.0.jar:/home/jenkins/.m2/repository/com/amazonaws/aws-java-sdk-sts/1.11.655/aws-java-sdk-sts-1.11.655.jar:/home/jenkins/.m2/repository/com/amazonaws/aws-java-sdk-cloudwatch/1.11.655/aws-java-sdk-cloudwatch-1.11.655.jar:/home/jenkins/.m2/repository/commons-io/commons-io/2.4/commons-io-2.4.jar:/home/jenkins/.m2/repository/com/fasterxml/jackson/core/jackson-core/2.6.7/jackson-core-2.6.7.jar:/home/jenkins/.m2/repository/org/codehaus/jackson/jackson-mapper-asl/1.9.13/jackson-mapper-asl-1.9.13.jar:/home/jenkins/.m2/repository/org/apache/commons/commons-lang3/3.5/commons-lang3-3.5.jar:/home/jenkins/.m2/repository/org/codehaus/jackson/jackson-jaxrs/1.9.13/jackson-jaxrs-1.9.13.jar:/home/jenkins/.m2/repository/javax/xml/stream/stax-api/1.0-2/stax-api-1.0-2.jar:/home/jenkins/.m2/repository/com/amazonaws/amazon-kinesis-client/1.12.0/amazon-kinesis-client-1.12.0.jar:/home/jenkins/.m2/repository/org/codehaus/jackson/jackson-xc/1.9.13/jackson-xc-1.9.13.jar:/home/jenkins/.m2/repository/commons-logging/commons-logging/1.1.3/commons-logging-1.1.3.jar:/home/jenkins/.m2/repository/org/apache/httpcomponents/httpclient/4.5.6/httpclient-4.5.6.jar:/home/jenkins/.m2/repository/com/amazonaws/jmespath-java/1.11.655/jmespath-java-1.11.655.jar:/home/jenkins/.m2/repository/org/codehaus/jackson/jackson-core-asl/1.9.13/jackson-core-asl-1.9.13.jar:/home/jenkins/.m2/repository/software/amazon/ion/ion-java/1.0.2/ion-java-1.0.2.jar
[INFO] 
[INFO] --- maven-remote-resources-plugin:1.5:process (process-resource-bundles) @ spark-streaming-kinesis-asl-assembly_2.11 ---
[INFO] 
[INFO] --- maven-resources-plugin:2.7:resources (default-resources) @ spark-streaming-kinesis-asl-assembly_2.11 ---
[INFO] Using 'UTF-8' encoding to copy filtered resources.
[INFO] skip non existing resourceDirectory /home/jenkins/workspace/spark-branch-2.4-test-maven-hadoop-2.7/external/kinesis-asl-assembly/src/main/resources
[INFO] Copying 3 resources
[INFO] 
[INFO] --- maven-compiler-plugin:3.7.0:compile (default-compile) @ spark-streaming-kinesis-asl-assembly_2.11 ---
[INFO] Not compiling main sources
[INFO] 
[INFO] --- scala-maven-plugin:3.2.2:compile (scala-compile-first) @ spark-streaming-kinesis-asl-assembly_2.11 ---
[INFO] No sources to compile
[INFO] 
[INFO] --- maven-antrun-plugin:1.8:run (create-tmp-dir) @ spark-streaming-kinesis-asl-assembly_2.11 ---
[INFO] Executing tasks

main:
[INFO] Executed tasks
[INFO] 
[INFO] --- maven-resources-plugin:2.7:testResources (default-testResources) @ spark-streaming-kinesis-asl-assembly_2.11 ---
[INFO] Using 'UTF-8' encoding to copy filtered resources.
[INFO] skip non existing resourceDirectory /home/jenkins/workspace/spark-branch-2.4-test-maven-hadoop-2.7/external/kinesis-asl-assembly/src/test/resources
[INFO] Copying 3 resources
[INFO] 
[INFO] --- maven-compiler-plugin:3.7.0:testCompile (default-testCompile) @ spark-streaming-kinesis-asl-assembly_2.11 ---
[INFO] Not compiling test sources
[INFO] 
[INFO] --- maven-dependency-plugin:3.0.2:build-classpath (generate-test-classpath) @ spark-streaming-kinesis-asl-assembly_2.11 ---
[INFO] Dependencies classpath:
/home/jenkins/.m2/repository/org/eclipse/jetty/jetty-security/9.3.27.v20190418/jetty-security-9.3.27.v20190418.jar:/home/jenkins/.m2/repository/com/fasterxml/jackson/module/jackson-module-scala_2.11/2.6.7.1/jackson-module-scala_2.11-2.6.7.1.jar:/home/jenkins/.m2/repository/org/apache/htrace/htrace-core/3.1.0-incubating/htrace-core-3.1.0-incubating.jar:/home/jenkins/.m2/repository/org/lz4/lz4-java/1.4.0/lz4-java-1.4.0.jar:/home/jenkins/.m2/repository/org/scalactic/scalactic_2.11/3.0.3/scalactic_2.11-3.0.3.jar:/home/jenkins/.m2/repository/com/fasterxml/jackson/module/jackson-module-paranamer/2.7.9/jackson-module-paranamer-2.7.9.jar:/home/jenkins/.m2/repository/org/json4s/json4s-ast_2.11/3.5.3/json4s-ast_2.11-3.5.3.jar:/home/jenkins/.m2/repository/io/netty/netty-all/4.1.47.Final/netty-all-4.1.47.Final.jar:/home/jenkins/.m2/repository/com/thoughtworks/paranamer/paranamer/2.8/paranamer-2.8.jar:/home/jenkins/.m2/repository/xml-apis/xml-apis/1.4.01/xml-apis-1.4.01.jar:/home/jenkins/.m2/repository/org/fusesource/leveldbjni/leveldbjni-all/1.8/leveldbjni-all-1.8.jar:/home/jenkins/.m2/repository/com/amazonaws/aws-java-sdk-core/1.11.655/aws-java-sdk-core-1.11.655.jar:/home/jenkins/workspace/spark-branch-2.4-test-maven-hadoop-2.7/common/kvstore/target/scala-2.11/classes:/home/jenkins/.m2/repository/org/glassfish/jersey/bundles/repackaged/jersey-guava/2.22.2/jersey-guava-2.22.2.jar:/home/jenkins/.m2/repository/org/tukaani/xz/1.5/xz-1.5.jar:/home/jenkins/.m2/repository/com/google/protobuf/protobuf-java/2.6.1/protobuf-java-2.6.1.jar:/home/jenkins/.m2/repository/org/apache/commons/commons-crypto/1.0.0/commons-crypto-1.0.0.jar:/home/jenkins/.m2/repository/com/amazonaws/aws-java-sdk-sts/1.11.655/aws-java-sdk-sts-1.11.655.jar:/home/jenkins/.m2/repository/com/amazonaws/aws-java-sdk-cloudwatch/1.11.655/aws-java-sdk-cloudwatch-1.11.655.jar:/home/jenkins/.m2/repository/commons-io/commons-io/2.4/commons-io-2.4.jar:/home/jenkins/.m2/repository/org/scala-lang/scala-reflect/2.11.12/scala-reflect-2.11.12.jar:/home/jenkins/.m2/repository/org/eclipse/jetty/jetty-servlet/9.3.27.v20190418/jetty-servlet-9.3.27.v20190418.jar:/home/jenkins/.m2/repository/org/apache/commons/commons-lang3/3.5/commons-lang3-3.5.jar:/home/jenkins/.m2/repository/org/codehaus/jackson/jackson-jaxrs/1.9.13/jackson-jaxrs-1.9.13.jar:/home/jenkins/.m2/repository/org/apache/hadoop/hadoop-auth/2.7.3/hadoop-auth-2.7.3.jar:/home/jenkins/.m2/repository/com/esotericsoftware/kryo-shaded/4.0.2/kryo-shaded-4.0.2.jar:/home/jenkins/.m2/repository/com/esotericsoftware/minlog/1.3.0/minlog-1.3.0.jar:/home/jenkins/.m2/repository/org/apache/hadoop/hadoop-client/2.7.3/hadoop-client-2.7.3.jar:/home/jenkins/.m2/repository/org/apache/hadoop/hadoop-mapreduce-client-shuffle/2.7.3/hadoop-mapreduce-client-shuffle-2.7.3.jar:/home/jenkins/.m2/repository/org/codehaus/jackson/jackson-core-asl/1.9.13/jackson-core-asl-1.9.13.jar:/home/jenkins/.m2/repository/javax/validation/validation-api/1.1.0.Final/validation-api-1.1.0.Final.jar:/home/jenkins/workspace/spark-branch-2.4-test-maven-hadoop-2.7/core/target/scala-2.11/classes:/home/jenkins/.m2/repository/org/glassfish/jersey/core/jersey-common/2.22.2/jersey-common-2.22.2.jar:/home/jenkins/.m2/repository/org/objenesis/objenesis/2.5.1/objenesis-2.5.1.jar:/home/jenkins/.m2/repository/org/apache/hadoop/hadoop-mapreduce-client-core/2.7.3/hadoop-mapreduce-client-core-2.7.3.jar:/home/jenkins/.m2/repository/joda-time/joda-time/2.9.3/joda-time-2.9.3.jar:/home/jenkins/.m2/repository/org/scala-lang/modules/scala-xml_2.11/1.0.5/scala-xml_2.11-1.0.5.jar:/home/jenkins/.m2/repository/com/amazonaws/aws-java-sdk-kms/1.11.655/aws-java-sdk-kms-1.11.655.jar:/home/jenkins/.m2/repository/com/google/code/findbugs/jsr305/1.3.9/jsr305-1.3.9.jar:/home/jenkins/.m2/repository/commons-net/commons-net/3.1/commons-net-3.1.jar:/home/jenkins/.m2/repository/javax/xml/bind/jaxb-api/2.2.2/jaxb-api-2.2.2.jar:/home/jenkins/.m2/repository/org/glassfish/hk2/hk2-api/2.4.0-b34/hk2-api-2.4.0-b34.jar:/home/jenkins/.m2/repository/org/xerial/snappy/snappy-java/1.1.7.5/snappy-java-1.1.7.5.jar:/home/jenkins/.m2/repository/org/glassfish/jersey/core/jersey-server/2.22.2/jersey-server-2.22.2.jar:/home/jenkins/.m2/repository/com/twitter/chill_2.11/0.9.3/chill_2.11-0.9.3.jar:/home/jenkins/.m2/repository/commons-lang/commons-lang/2.6/commons-lang-2.6.jar:/home/jenkins/.m2/repository/com/amazonaws/aws-java-sdk-s3/1.11.655/aws-java-sdk-s3-1.11.655.jar:/home/jenkins/.m2/repository/org/apache/hadoop/hadoop-yarn-client/2.7.3/hadoop-yarn-client-2.7.3.jar:/home/jenkins/.m2/repository/com/amazonaws/aws-java-sdk-dynamodb/1.11.655/aws-java-sdk-dynamodb-1.11.655.jar:/home/jenkins/.m2/repository/org/apache/zookeeper/zookeeper/3.4.6/zookeeper-3.4.6.jar:/home/jenkins/.m2/repository/javax/activation/activation/1.1.1/activation-1.1.1.jar:/home/jenkins/.m2/repository/commons-codec/commons-codec/1.10/commons-codec-1.10.jar:/home/jenkins/workspace/spark-branch-2.4-test-maven-hadoop-2.7/external/kinesis-asl/target/scala-2.11/classes:/home/jenkins/.m2/repository/org/eclipse/jetty/jetty-webapp/9.3.27.v20190418/jetty-webapp-9.3.27.v20190418.jar:/home/jenkins/.m2/repository/org/json4s/json4s-jackson_2.11/3.5.3/json4s-jackson_2.11-3.5.3.jar:/home/jenkins/.m2/repository/org/javassist/javassist/3.18.1-GA/javassist-3.18.1-GA.jar:/home/jenkins/.m2/repository/com/google/guava/guava/14.0.1/guava-14.0.1.jar:/home/jenkins/.m2/repository/org/apache/xbean/xbean-asm6-shaded/4.8/xbean-asm6-shaded-4.8.jar:/home/jenkins/.m2/repository/commons-beanutils/commons-beanutils/1.9.4/commons-beanutils-1.9.4.jar:/home/jenkins/.m2/repository/org/apache/ivy/ivy/2.4.0/ivy-2.4.0.jar:/home/jenkins/.m2/repository/org/eclipse/jetty/jetty-util/9.3.27.v20190418/jetty-util-9.3.27.v20190418.jar:/home/jenkins/.m2/repository/org/eclipse/jetty/jetty-client/9.3.27.v20190418/jetty-client-9.3.27.v20190418.jar:/home/jenkins/.m2/repository/javax/servlet/javax.servlet-api/3.1.0/javax.servlet-api-3.1.0.jar:/home/jenkins/.m2/repository/org/glassfish/hk2/osgi-resource-locator/1.0.1/osgi-resource-locator-1.0.1.jar:/home/jenkins/.m2/repository/com/fasterxml/jackson/core/jackson-core/2.6.7/jackson-core-2.6.7.jar:/home/jenkins/.m2/repository/org/apache/commons/commons-math3/3.4.1/commons-math3-3.4.1.jar:/home/jenkins/.m2/repository/org/apache/hadoop/hadoop-mapreduce-client-common/2.7.3/hadoop-mapreduce-client-common-2.7.3.jar:/home/jenkins/.m2/repository/org/scala-lang/modules/scala-parser-combinators_2.11/1.1.0/scala-parser-combinators_2.11-1.1.0.jar:/home/jenkins/.m2/repository/io/dropwizard/metrics/metrics-graphite/3.1.5/metrics-graphite-3.1.5.jar:/home/jenkins/.m2/repository/javax/xml/stream/stax-api/1.0-2/stax-api-1.0-2.jar:/home/jenkins/.m2/repository/org/apache/hadoop/hadoop-mapreduce-client-jobclient/2.7.3/hadoop-mapreduce-client-jobclient-2.7.3.jar:/home/jenkins/.m2/repository/com/amazonaws/amazon-kinesis-client/1.12.0/amazon-kinesis-client-1.12.0.jar:/home/jenkins/.m2/repository/org/codehaus/jackson/jackson-xc/1.9.13/jackson-xc-1.9.13.jar:/home/jenkins/.m2/repository/org/eclipse/jetty/jetty-server/9.3.27.v20190418/jetty-server-9.3.27.v20190418.jar:/home/jenkins/.m2/repository/org/glassfish/hk2/hk2-utils/2.4.0-b34/hk2-utils-2.4.0-b34.jar:/home/jenkins/.m2/repository/org/glassfish/hk2/external/aopalliance-repackaged/2.4.0-b34/aopalliance-repackaged-2.4.0-b34.jar:/home/jenkins/.m2/repository/net/sf/py4j/py4j/0.10.7/py4j-0.10.7.jar:/home/jenkins/.m2/repository/org/json4s/json4s-scalap_2.11/3.5.3/json4s-scalap_2.11-3.5.3.jar:/home/jenkins/.m2/repository/org/glassfish/jersey/containers/jersey-container-servlet-core/2.22.2/jersey-container-servlet-core-2.22.2.jar:/home/jenkins/.m2/repository/org/glassfish/hk2/external/javax.inject/2.4.0-b34/javax.inject-2.4.0-b34.jar:/home/jenkins/.m2/repository/oro/oro/2.0.8/oro-2.0.8.jar:/home/jenkins/.m2/repository/org/apache/avro/avro-mapred/1.8.2/avro-mapred-1.8.2-hadoop2.jar:/home/jenkins/.m2/repository/org/eclipse/jetty/jetty-continuation/9.3.27.v20190418/jetty-continuation-9.3.27.v20190418.jar:/home/jenkins/workspace/spark-branch-2.4-test-maven-hadoop-2.7/common/network-common/target/scala-2.11/classes:/home/jenkins/.m2/repository/org/eclipse/jetty/jetty-http/9.3.27.v20190418/jetty-http-9.3.27.v20190418.jar:/home/jenkins/.m2/repository/org/apache/hadoop/hadoop-yarn-common/2.7.3/hadoop-yarn-common-2.7.3.jar:/home/jenkins/.m2/repository/org/scalatest/scalatest_2.11/3.0.3/scalatest_2.11-3.0.3.jar:/home/jenkins/workspace/spark-branch-2.4-test-maven-hadoop-2.7/common/unsafe/target/scala-2.11/classes:/home/jenkins/.m2/repository/org/apache/hadoop/hadoop-yarn-api/2.7.3/hadoop-yarn-api-2.7.3.jar:/home/jenkins/.m2/repository/log4j/log4j/1.2.17/log4j-1.2.17.jar:/home/jenkins/.m2/repository/com/novocode/junit-interface/0.11/junit-interface-0.11.jar:/home/jenkins/.m2/repository/org/apache/hadoop/hadoop-yarn-server-common/2.7.3/hadoop-yarn-server-common-2.7.3.jar:/home/jenkins/.m2/repository/org/apache/httpcomponents/httpcore/4.4.10/httpcore-4.4.10.jar:/home/jenkins/workspace/spark-branch-2.4-test-maven-hadoop-2.7/streaming/target/scala-2.11/classes:/home/jenkins/.m2/repository/org/apache/curator/curator-framework/2.7.1/curator-framework-2.7.1.jar:/home/jenkins/.m2/repository/org/apache/curator/curator-recipes/2.7.1/curator-recipes-2.7.1.jar:/home/jenkins/.m2/repository/org/eclipse/jetty/jetty-xml/9.3.27.v20190418/jetty-xml-9.3.27.v20190418.jar:/home/jenkins/.m2/repository/io/dropwizard/metrics/metrics-json/3.1.5/metrics-json-3.1.5.jar:/home/jenkins/.m2/repository/com/amazonaws/aws-java-sdk-kinesis/1.11.655/aws-java-sdk-kinesis-1.11.655.jar:/home/jenkins/.m2/repository/org/apache/commons/commons-compress/1.4.1/commons-compress-1.4.1.jar:/home/jenkins/.m2/repository/org/apache/avro/avro/1.8.2/avro-1.8.2.jar:/home/jenkins/.m2/repository/org/apache/directory/server/apacheds-kerberos-codec/2.0.0-M15/apacheds-kerberos-codec-2.0.0-M15.jar:/home/jenkins/.m2/repository/io/dropwizard/metrics/metrics-core/3.1.5/metrics-core-3.1.5.jar:/home/jenkins/workspace/spark-branch-2.4-test-maven-hadoop-2.7/common/tags/target/scala-2.11/classes:/home/jenkins/.m2/repository/org/slf4j/slf4j-api/1.7.16/slf4j-api-1.7.16.jar:/home/jenkins/.m2/repository/org/eclipse/jetty/jetty-io/9.3.27.v20190418/jetty-io-9.3.27.v20190418.jar:/home/jenkins/workspace/spark-branch-2.4-test-maven-hadoop-2.7/launcher/target/scala-2.11/classes:/home/jenkins/.m2/repository/org/mortbay/jetty/jetty-util/6.1.26/jetty-util-6.1.26.jar:/home/jenkins/.m2/repository/org/scala-sbt/test-interface/1.0/test-interface-1.0.jar:/home/jenkins/.m2/repository/org/hamcrest/hamcrest-core/1.3/hamcrest-core-1.3.jar:/home/jenkins/.m2/repository/org/codehaus/jackson/jackson-mapper-asl/1.9.13/jackson-mapper-asl-1.9.13.jar:/home/jenkins/workspace/spark-branch-2.4-test-maven-hadoop-2.7/common/network-shuffle/target/scala-2.11/classes:/home/jenkins/.m2/repository/javax/ws/rs/javax.ws.rs-api/2.0.1/javax.ws.rs-api-2.0.1.jar:/home/jenkins/.m2/repository/javax/servlet/jsp/jsp-api/2.1/jsp-api-2.1.jar:/home/jenkins/.m2/repository/org/glassfish/jersey/core/jersey-client/2.22.2/jersey-client-2.22.2.jar:/home/jenkins/.m2/repository/io/netty/netty/3.9.9.Final/netty-3.9.9.Final.jar:/home/jenkins/.m2/repository/org/roaringbitmap/shims/0.7.45/shims-0.7.45.jar:/home/jenkins/.m2/repository/com/ning/compress-lzf/1.0.3/compress-lzf-1.0.3.jar:/home/jenkins/.m2/repository/xmlenc/xmlenc/0.52/xmlenc-0.52.jar:/home/jenkins/.m2/repository/org/apache/avro/avro-ipc/1.8.2/avro-ipc-1.8.2.jar:/home/jenkins/.m2/repository/org/apache/hadoop/hadoop-hdfs/2.7.3/hadoop-hdfs-2.7.3.jar:/home/jenkins/.m2/repository/org/apache/directory/api/api-util/1.0.0-M20/api-util-1.0.0-M20.jar:/home/jenkins/.m2/repository/com/google/code/gson/gson/2.2.4/gson-2.2.4.jar:/home/jenkins/.m2/repository/com/clearspring/analytics/stream/2.7.0/stream-2.7.0.jar:/home/jenkins/.m2/repository/org/apache/directory/api/api-asn1-api/1.0.0-M20/api-asn1-api-1.0.0-M20.jar:/home/jenkins/.m2/repository/com/fasterxml/jackson/core/jackson-annotations/2.6.7/jackson-annotations-2.6.7.jar:/home/jenkins/.m2/repository/org/apache/hadoop/hadoop-common/2.7.3/hadoop-common-2.7.3.jar:/home/jenkins/.m2/repository/org/glassfish/jersey/containers/jersey-container-servlet/2.22.2/jersey-container-servlet-2.22.2.jar:/home/jenkins/.m2/repository/commons-configuration/commons-configuration/1.6/commons-configuration-1.6.jar:/home/jenkins/.m2/repository/org/slf4j/jul-to-slf4j/1.7.16/jul-to-slf4j-1.7.16.jar:/home/jenkins/.m2/repository/commons-digester/commons-digester/1.8/commons-digester-1.8.jar:/home/jenkins/.m2/repository/com/fasterxml/jackson/dataformat/jackson-dataformat-cbor/2.6.7/jackson-dataformat-cbor-2.6.7.jar:/home/jenkins/.m2/repository/org/scala-lang/scala-library/2.11.12/scala-library-2.11.12.jar:/home/jenkins/.m2/repository/org/apache/directory/server/apacheds-i18n/2.0.0-M15/apacheds-i18n-2.0.0-M15.jar:/home/jenkins/.m2/repository/org/eclipse/jetty/jetty-proxy/9.3.27.v20190418/jetty-proxy-9.3.27.v20190418.jar:/home/jenkins/.m2/repository/org/apache/curator/curator-client/2.7.1/curator-client-2.7.1.jar:/home/jenkins/.m2/repository/org/roaringbitmap/RoaringBitmap/0.7.45/RoaringBitmap-0.7.45.jar:/home/jenkins/.m2/repository/com/fasterxml/jackson/core/jackson-databind/2.6.7.3/jackson-databind-2.6.7.3.jar:/home/jenkins/.m2/repository/org/eclipse/jetty/jetty-jndi/9.3.27.v20190418/jetty-jndi-9.3.27.v20190418.jar:/home/jenkins/.m2/repository/commons-cli/commons-cli/1.2/commons-cli-1.2.jar:/home/jenkins/.m2/repository/xerces/xercesImpl/2.9.1/xercesImpl-2.9.1.jar:/home/jenkins/.m2/repository/javax/annotation/javax.annotation-api/1.2/javax.annotation-api-1.2.jar:/home/jenkins/.m2/repository/org/slf4j/slf4j-log4j12/1.7.16/slf4j-log4j12-1.7.16.jar:/home/jenkins/.m2/repository/org/glassfish/jersey/media/jersey-media-jaxb/2.22.2/jersey-media-jaxb-2.22.2.jar:/home/jenkins/.m2/repository/org/spark-project/spark/unused/1.0.0/unused-1.0.0.jar:/home/jenkins/.m2/repository/com/twitter/chill-java/0.9.3/chill-java-0.9.3.jar:/home/jenkins/.m2/repository/org/eclipse/jetty/jetty-plus/9.3.27.v20190418/jetty-plus-9.3.27.v20190418.jar:/home/jenkins/.m2/repository/io/dropwizard/metrics/metrics-jvm/3.1.5/metrics-jvm-3.1.5.jar:/home/jenkins/.m2/repository/com/github/luben/zstd-jni/1.3.2-2/zstd-jni-1.3.2-2.jar:/home/jenkins/.m2/repository/org/apache/hadoop/hadoop-annotations/2.7.3/hadoop-annotations-2.7.3.jar:/home/jenkins/.m2/repository/org/json4s/json4s-core_2.11/3.5.3/json4s-core_2.11-3.5.3.jar:/home/jenkins/.m2/repository/commons-collections/commons-collections/3.2.2/commons-collections-3.2.2.jar:/home/jenkins/.m2/repository/junit/junit/4.12/junit-4.12.jar:/home/jenkins/.m2/repository/org/eclipse/jetty/jetty-servlets/9.3.27.v20190418/jetty-servlets-9.3.27.v20190418.jar:/home/jenkins/.m2/repository/org/glassfish/hk2/hk2-locator/2.4.0-b34/hk2-locator-2.4.0-b34.jar:/home/jenkins/.m2/repository/org/apache/hadoop/hadoop-mapreduce-client-app/2.7.3/hadoop-mapreduce-client-app-2.7.3.jar:/home/jenkins/.m2/repository/commons-logging/commons-logging/1.1.3/commons-logging-1.1.3.jar:/home/jenkins/.m2/repository/org/apache/httpcomponents/httpclient/4.5.6/httpclient-4.5.6.jar:/home/jenkins/.m2/repository/net/razorvine/pyrolite/4.13/pyrolite-4.13.jar:/home/jenkins/.m2/repository/com/amazonaws/jmespath-java/1.11.655/jmespath-java-1.11.655.jar:/home/jenkins/.m2/repository/software/amazon/ion/ion-java/1.0.2/ion-java-1.0.2.jar:/home/jenkins/.m2/repository/org/slf4j/jcl-over-slf4j/1.7.16/jcl-over-slf4j-1.7.16.jar:/home/jenkins/.m2/repository/commons-httpclient/commons-httpclient/3.1/commons-httpclient-3.1.jar
[INFO] 
[INFO] --- scala-maven-plugin:3.2.2:testCompile (scala-test-compile-first) @ spark-streaming-kinesis-asl-assembly_2.11 ---
[INFO] No sources to compile
[INFO] 
[INFO] --- maven-surefire-plugin:2.22.0:test (default-test) @ spark-streaming-kinesis-asl-assembly_2.11 ---
[INFO] 
[INFO] --- maven-surefire-plugin:2.22.0:test (test) @ spark-streaming-kinesis-asl-assembly_2.11 ---
[INFO] Skipping execution of surefire because it has already been run for this configuration
[INFO] 
[INFO] --- scalatest-maven-plugin:1.0:test (test) @ spark-streaming-kinesis-asl-assembly_2.11 ---
Discovery starting.
Discovery completed in 64 milliseconds.
Run starting. Expected test count is: 0
DiscoverySuite:
Run completed in 137 milliseconds.
Total number of tests run: 0
Suites: completed 1, aborted 0
Tests: succeeded 0, failed 0, canceled 0, ignored 0, pending 0
No tests were executed.
[INFO] ------------------------------------------------------------------------
[INFO] Reactor Summary for Spark Project Parent POM 2.4.8-SNAPSHOT:
[INFO] 
[INFO] Spark Project Parent POM ........................... SUCCESS [  2.572 s]
[INFO] Spark Project Tags ................................. SUCCESS [  2.672 s]
[INFO] Spark Project Sketch ............................... SUCCESS [ 15.403 s]
[INFO] Spark Project Local DB ............................. SUCCESS [  2.989 s]
[INFO] Spark Project Networking ........................... SUCCESS [ 45.124 s]
[INFO] Spark Project Shuffle Streaming Service ............ SUCCESS [ 11.119 s]
[INFO] Spark Project Unsafe ............................... SUCCESS [  2.914 s]
[INFO] Spark Project Launcher ............................. SUCCESS [  4.299 s]
[INFO] Spark Project Core ................................. SUCCESS [24:59 min]
[INFO] Spark Project ML Local Library ..................... SUCCESS [  5.403 s]
[INFO] Spark Project GraphX ............................... SUCCESS [02:22 min]
[INFO] Spark Project Streaming ............................ SUCCESS [05:28 min]
[INFO] Spark Project Catalyst ............................. SUCCESS [12:26 min]
[INFO] Spark Project SQL .................................. SUCCESS [42:38 min]
[INFO] Spark Project ML Library ........................... SUCCESS [27:45 min]
[INFO] Spark Project Tools ................................ SUCCESS [  0.868 s]
[INFO] Spark Project Hive ................................. SUCCESS [  01:16 h]
[INFO] Spark Project REPL ................................. SUCCESS [01:49 min]
[INFO] Spark Project YARN Shuffle Service ................. SUCCESS [  3.123 s]
[INFO] Spark Project YARN ................................. SUCCESS [07:32 min]
[INFO] Spark Project Mesos ................................ SUCCESS [ 32.256 s]
[INFO] Spark Project Hive Thrift Server ................... SUCCESS [05:18 min]
[INFO] Spark Project Assembly ............................. SUCCESS [  2.570 s]
[INFO] Spark Integration for Kafka 0.10 ................... SUCCESS [04:59 min]
[INFO] Kafka 0.10+ Source for Structured Streaming ........ FAILURE [12:55 min]
[INFO] Spark Kinesis Integration .......................... SUCCESS [ 23.119 s]
[INFO] Spark Project Examples ............................. SKIPPED
[INFO] Spark Integration for Kafka 0.10 Assembly .......... SUCCESS [  2.232 s]
[INFO] Spark Avro ......................................... SUCCESS [01:06 min]
[INFO] Spark Project Kinesis Assembly ..................... SUCCESS [  2.738 s]
[INFO] ------------------------------------------------------------------------
[INFO] BUILD FAILURE
[INFO] ------------------------------------------------------------------------
[INFO] Total time:  03:48 h
[INFO] Finished at: 2020-09-25T10:37:54-07:00
[INFO] ------------------------------------------------------------------------
[ERROR] Failed to execute goal org.scalatest:scalatest-maven-plugin:1.0:test (test) on project spark-sql-kafka-0-10_2.11: There are test failures -> [Help 1]
[ERROR] 
[ERROR] To see the full stack trace of the errors, re-run Maven with the -e switch.
[ERROR] Re-run Maven using the -X switch to enable full debug logging.
[ERROR] 
[ERROR] For more information about the errors and possible solutions, please read the following articles:
[ERROR] [Help 1] http://cwiki.apache.org/confluence/display/MAVEN/MojoFailureException
[ERROR] 
[ERROR] After correcting the problems, you can resume the build with the command
[ERROR]   mvn <args> -rf :spark-sql-kafka-0-10_2.11
+ retcode2=1
+ [[ 0 -ne 0 ]]
+ [[ 1 -ne 0 ]]
+ [[ 0 -ne 0 ]]
+ [[ 1 -ne 0 ]]
+ echo 'Testing Spark with Maven failed'
Testing Spark with Maven failed
+ exit 1
Build step 'Execute shell' marked build as failure
Archiving artifacts
Recording test results
Finished: FAILURE