FailedConsole Output

[EnvInject] - Mask passwords passed as build parameters.
GitHub pull request #595 of commit fa7150dfc12834f0a270b842c80a0452a10b36ef automatically merged.
[EnvInject] - Loading node environment variables.
Building remotely on research-jenkins-worker-07 (research-07 ubuntu) in workspace /home/jenkins/workspace/Clipper-PRB
[WS-CLEANUP] Deleting project workspace...
[WS-CLEANUP] Done
Cloning the remote Git repository
Cloning repository https://github.com/ucbrise/clipper.git
 > git init /home/jenkins/workspace/Clipper-PRB # timeout=10
Fetching upstream changes from https://github.com/ucbrise/clipper.git
 > git --version # timeout=10
 > git fetch --tags --progress https://github.com/ucbrise/clipper.git +refs/heads/*:refs/remotes/origin/*
 > git config remote.origin.url https://github.com/ucbrise/clipper.git # timeout=10
 > git config --add remote.origin.fetch +refs/heads/*:refs/remotes/origin/* # timeout=10
 > git config remote.origin.url https://github.com/ucbrise/clipper.git # timeout=10
Fetching upstream changes from https://github.com/ucbrise/clipper.git
 > git fetch --tags --progress https://github.com/ucbrise/clipper.git +refs/pull/*:refs/remotes/origin/pr/*
 > git rev-parse origin/pr/595/merge^{commit} # timeout=10
 > git branch -a -v --no-abbrev --contains 3a84966c784cda1d56ed33070fb5ff74af9601be # timeout=10
Checking out Revision 3a84966c784cda1d56ed33070fb5ff74af9601be (origin/pr/595/merge)
 > git config core.sparsecheckout # timeout=10
 > git checkout -f 3a84966c784cda1d56ed33070fb5ff74af9601be
 > git rev-list ce05a1473b5264136043f5b01a6f530f8ba1cb95 # timeout=10
First time build. Skipping changelog.
 > git remote # timeout=10
 > git submodule init # timeout=10
 > git submodule sync # timeout=10
 > git config --get remote.origin.url # timeout=10
 > git submodule init # timeout=10
 > git config -f .gitmodules --get-regexp ^submodule\.(.*)\.url # timeout=10
 > git config --get submodule.src/libs/redox.url # timeout=10
 > git config -f .gitmodules --get submodule.src/libs/redox.path # timeout=10
 > git submodule update --init --recursive src/libs/redox
 > git config --get submodule.src/libs/rapidjson.url # timeout=10
 > git config -f .gitmodules --get submodule.src/libs/rapidjson.path # timeout=10
 > git submodule update --init --recursive src/libs/rapidjson
 > git config --get submodule.src/libs/spdlog.url # timeout=10
 > git config -f .gitmodules --get submodule.src/libs/spdlog.path # timeout=10
 > git submodule update --init --recursive src/libs/spdlog
 > git config --get submodule.bin/yapf.url # timeout=10
 > git config -f .gitmodules --get submodule.bin/yapf.path # timeout=10
 > git submodule update --init --recursive bin/yapf
 > git config --get submodule.src/libs/dlib.url # timeout=10
 > git config -f .gitmodules --get submodule.src/libs/dlib.path # timeout=10
 > git submodule update --init --recursive src/libs/dlib
[EnvInject] - Executing scripts and injecting environment variables after the SCM step.
[EnvInject] - Injecting as environment variables the properties content 
LD_LIBRARY_PATH=/lib:/lib64:/usr/lib

[EnvInject] - Variables injected successfully.
[Clipper-PRB] $ /bin/bash /tmp/hudson8347351642516178464.sh
WARNING! Using --password via the CLI is insecure. Use --password-stdin.
WARNING! Your password will be stored unencrypted in /home/jenkins/.docker/config.json.
Configure a credential helper to remove this warning. See
https://docs.docker.com/engine/reference/commandline/login/#credentials-store

Login Succeeded
[Clipper-PRB] $ /bin/bash /tmp/hudson2614339436813995314.sh
WARNING! Using --password via the CLI is insecure. Use --password-stdin.
WARNING! Your password will be stored unencrypted in /home/jenkins/.docker/config.json.
Configure a credential helper to remove this warning. See
https://docs.docker.com/engine/reference/commandline/login/#credentials-store

Login Succeeded
[Clipper-PRB] $ /bin/bash /tmp/hudson3297578460339950129.sh
+ set -e
+ set -u
+ set -o pipefail
+ date
Sat Nov 10 22:26:00 PST 2018
+ unset CDPATH
+++ dirname bin/run_ci.sh
++ cd bin
++ pwd
+ DIR=/home/jenkins/workspace/Clipper-PRB/bin
+ cd /home/jenkins/workspace/Clipper-PRB/bin/..
+ tag=develop
+ CLIPPER_REGISTRY=clippertesting
++ git rev-parse --verify --short=10 HEAD
+ sha_tag=3a84966c78
+ docker build -t shipyard ./bin/shipyard
Sending build context to Docker daemon  11.26kB

Step 1/4 : FROM python:3-alpine
 ---> 408808fb1a9e
Step 2/4 : RUN pip install click
 ---> Using cache
 ---> 975647d08740
Step 3/4 : COPY . .
 ---> Using cache
 ---> e18ee62800f1
Step 4/4 : ENTRYPOINT ["python", "shipyard.py"]
 ---> Using cache
 ---> 3cd287f213bd
Successfully built 3cd287f213bd
Successfully tagged shipyard:latest
++ pwd
+ docker run --rm shipyard --sha-tag 3a84966c78 --namespace clippertesting --clipper-root /home/jenkins/workspace/Clipper-PRB --config clipper_docker.cfg.py --no-push
+ cat Makefile

placeholder: 
	echo "Do not run make directly"
        

lib_base: 
	time docker build --build-arg CODE_VERSION=3a84966c78             --build-arg REGISTRY=clippertesting              -t clippertesting/lib_base:3a84966c78             -f dockerfiles/ClipperLibBaseDockerfile /home/jenkins/workspace/Clipper-PRB > lib_base.build.log
        

publish_lib_base: lib_base
	docker tag clippertesting/lib_base:3a84966c78 clippertesting/lib_base:develop
        

query_frontend: lib_base
	time docker build --build-arg CODE_VERSION=3a84966c78             --build-arg REGISTRY=clippertesting              -t clippertesting/query_frontend:3a84966c78             -f dockerfiles/QueryFrontendDockerfile /home/jenkins/workspace/Clipper-PRB > query_frontend.build.log
        

publish_query_frontend: query_frontend
	docker tag clippertesting/query_frontend:3a84966c78 clippertesting/query_frontend:develop
        

management_frontend: lib_base
	time docker build --build-arg CODE_VERSION=3a84966c78             --build-arg REGISTRY=clippertesting              -t clippertesting/management_frontend:3a84966c78             -f dockerfiles/ManagementFrontendDockerfile /home/jenkins/workspace/Clipper-PRB > management_frontend.build.log
        

publish_management_frontend: management_frontend
	docker tag clippertesting/management_frontend:3a84966c78 clippertesting/management_frontend:develop
        

dev: lib_base
	time docker build --build-arg CODE_VERSION=3a84966c78             --build-arg REGISTRY=clippertesting              -t clippertesting/dev:3a84966c78             -f dockerfiles/ClipperDevDockerfile  /home/jenkins/workspace/Clipper-PRB > dev.build.log
        

publish_dev: dev
	docker tag clippertesting/dev:3a84966c78 clippertesting/dev:develop
        

py35-dev: lib_base
	time docker build --build-arg CODE_VERSION=3a84966c78             --build-arg REGISTRY=clippertesting              -t clippertesting/py35-dev:3a84966c78             -f dockerfiles/ClipperPy35DevDockerfile  /home/jenkins/workspace/Clipper-PRB > py35-dev.build.log
        

publish_py35-dev: py35-dev
	docker tag clippertesting/py35-dev:3a84966c78 clippertesting/py35-dev:develop
        

unittests: dev
	time docker build --build-arg CODE_VERSION=3a84966c78             --build-arg REGISTRY=clippertesting              -t clippertesting/unittests:3a84966c78             -f dockerfiles/ClipperTestsDockerfile  /home/jenkins/workspace/Clipper-PRB > unittests.build.log
        

publish_unittests: unittests
	docker tag clippertesting/unittests:3a84966c78 clippertesting/unittests:develop
        

py35tests: py35-dev
	time docker build --build-arg CODE_VERSION=3a84966c78             --build-arg REGISTRY=clippertesting              -t clippertesting/py35tests:3a84966c78             -f dockerfiles/ClipperPy35TestsDockerfile  /home/jenkins/workspace/Clipper-PRB > py35tests.build.log
        

publish_py35tests: py35tests
	docker tag clippertesting/py35tests:3a84966c78 clippertesting/py35tests:develop
        

r-container-base: 
	time docker build --build-arg CODE_VERSION=3a84966c78             --build-arg REGISTRY=clippertesting              -t clippertesting/r-container-base:3a84966c78             -f dockerfiles/RContainerDockerfile /home/jenkins/workspace/Clipper-PRB > r-container-base.build.log
        

publish_r-container-base: r-container-base
	docker tag clippertesting/r-container-base:3a84966c78 clippertesting/r-container-base:develop
        

frontend-exporter: 
	time docker build --build-arg CODE_VERSION=3a84966c78             --build-arg REGISTRY=clippertesting              -t clippertesting/frontend-exporter:3a84966c78             -f dockerfiles/FrontendExporterDockerfile /home/jenkins/workspace/Clipper-PRB > frontend-exporter.build.log
        

publish_frontend-exporter: frontend-exporter
	docker tag clippertesting/frontend-exporter:3a84966c78 clippertesting/frontend-exporter:develop
        

py-rpc: 
	time docker build --build-arg CODE_VERSION=3a84966c78             --build-arg REGISTRY=clippertesting --build-arg RPC_VERSION=py             -t clippertesting/py-rpc:3a84966c78             -f dockerfiles/Py2RPCDockerfile /home/jenkins/workspace/Clipper-PRB > py-rpc.build.log
        

publish_py-rpc: py-rpc
	docker tag clippertesting/py-rpc:3a84966c78 clippertesting/py-rpc:develop
        

py35-rpc: 
	time docker build --build-arg CODE_VERSION=3a84966c78             --build-arg REGISTRY=clippertesting --build-arg RPC_VERSION=py35             -t clippertesting/py35-rpc:3a84966c78             -f dockerfiles/Py35RPCDockerfile /home/jenkins/workspace/Clipper-PRB > py35-rpc.build.log
        

publish_py35-rpc: py35-rpc
	docker tag clippertesting/py35-rpc:3a84966c78 clippertesting/py35-rpc:develop
        

py36-rpc: 
	time docker build --build-arg CODE_VERSION=3a84966c78             --build-arg REGISTRY=clippertesting --build-arg RPC_VERSION=py36             -t clippertesting/py36-rpc:3a84966c78             -f dockerfiles/Py36RPCDockerfile /home/jenkins/workspace/Clipper-PRB > py36-rpc.build.log
        

publish_py36-rpc: py36-rpc
	docker tag clippertesting/py36-rpc:3a84966c78 clippertesting/py36-rpc:develop
        

sum-container: py-rpc
	time docker build --build-arg CODE_VERSION=3a84966c78             --build-arg REGISTRY=clippertesting              -t clippertesting/sum-container:3a84966c78             -f dockerfiles/SumDockerfile  /home/jenkins/workspace/Clipper-PRB > sum-container.build.log
        

publish_sum-container: sum-container
	docker tag clippertesting/sum-container:3a84966c78 clippertesting/sum-container:develop
        

noop-container: py-rpc
	time docker build --build-arg CODE_VERSION=3a84966c78             --build-arg REGISTRY=clippertesting              -t clippertesting/noop-container:3a84966c78             -f dockerfiles/NoopDockerfile /home/jenkins/workspace/Clipper-PRB > noop-container.build.log
        

publish_noop-container: noop-container
	docker tag clippertesting/noop-container:3a84966c78 clippertesting/noop-container:develop
        

mxnet-container: py-rpc
	time docker build --build-arg CODE_VERSION=3a84966c78             --build-arg REGISTRY=clippertesting --build-arg RPC_VERSION=py             -t clippertesting/mxnet-container:3a84966c78             -f dockerfiles/MXNetContainerDockerfile /home/jenkins/workspace/Clipper-PRB > mxnet-container.build.log
        

publish_mxnet-container: mxnet-container
	docker tag clippertesting/mxnet-container:3a84966c78 clippertesting/mxnet-container:develop
        

mxnet35-container: py35-rpc
	time docker build --build-arg CODE_VERSION=3a84966c78             --build-arg REGISTRY=clippertesting --build-arg RPC_VERSION=py35             -t clippertesting/mxnet35-container:3a84966c78             -f dockerfiles/MXNetContainerDockerfile /home/jenkins/workspace/Clipper-PRB > mxnet35-container.build.log
        

publish_mxnet35-container: mxnet35-container
	docker tag clippertesting/mxnet35-container:3a84966c78 clippertesting/mxnet35-container:develop
        

mxnet36-container: py36-rpc
	time docker build --build-arg CODE_VERSION=3a84966c78             --build-arg REGISTRY=clippertesting --build-arg RPC_VERSION=py36             -t clippertesting/mxnet36-container:3a84966c78             -f dockerfiles/MXNetContainerDockerfile /home/jenkins/workspace/Clipper-PRB > mxnet36-container.build.log
        

publish_mxnet36-container: mxnet36-container
	docker tag clippertesting/mxnet36-container:3a84966c78 clippertesting/mxnet36-container:develop
        

pytorch-container: py-rpc
	time docker build --build-arg CODE_VERSION=3a84966c78             --build-arg REGISTRY=clippertesting --build-arg RPC_VERSION=py             -t clippertesting/pytorch-container:3a84966c78             -f dockerfiles/PyTorchContainerDockerfile /home/jenkins/workspace/Clipper-PRB > pytorch-container.build.log
        

publish_pytorch-container: pytorch-container
	docker tag clippertesting/pytorch-container:3a84966c78 clippertesting/pytorch-container:develop
        

pytorch35-container: py35-rpc
	time docker build --build-arg CODE_VERSION=3a84966c78             --build-arg REGISTRY=clippertesting --build-arg RPC_VERSION=py35             -t clippertesting/pytorch35-container:3a84966c78             -f dockerfiles/PyTorchContainerDockerfile /home/jenkins/workspace/Clipper-PRB > pytorch35-container.build.log
        

publish_pytorch35-container: pytorch35-container
	docker tag clippertesting/pytorch35-container:3a84966c78 clippertesting/pytorch35-container:develop
        

pytorch36-container: py36-rpc
	time docker build --build-arg CODE_VERSION=3a84966c78             --build-arg REGISTRY=clippertesting --build-arg RPC_VERSION=py36             -t clippertesting/pytorch36-container:3a84966c78             -f dockerfiles/PyTorchContainerDockerfile /home/jenkins/workspace/Clipper-PRB > pytorch36-container.build.log
        

publish_pytorch36-container: pytorch36-container
	docker tag clippertesting/pytorch36-container:3a84966c78 clippertesting/pytorch36-container:develop
        

tf-container: py-rpc
	time docker build --build-arg CODE_VERSION=3a84966c78             --build-arg REGISTRY=clippertesting --build-arg RPC_VERSION=py             -t clippertesting/tf-container:3a84966c78             -f dockerfiles/TensorFlowDockerfile /home/jenkins/workspace/Clipper-PRB > tf-container.build.log
        

publish_tf-container: tf-container
	docker tag clippertesting/tf-container:3a84966c78 clippertesting/tf-container:develop
        

tf35-container: py35-rpc
	time docker build --build-arg CODE_VERSION=3a84966c78             --build-arg REGISTRY=clippertesting --build-arg RPC_VERSION=py35             -t clippertesting/tf35-container:3a84966c78             -f dockerfiles/TensorFlowDockerfile /home/jenkins/workspace/Clipper-PRB > tf35-container.build.log
        

publish_tf35-container: tf35-container
	docker tag clippertesting/tf35-container:3a84966c78 clippertesting/tf35-container:develop
        

tf36-container: py36-rpc
	time docker build --build-arg CODE_VERSION=3a84966c78             --build-arg REGISTRY=clippertesting --build-arg RPC_VERSION=py36             -t clippertesting/tf36-container:3a84966c78             -f dockerfiles/TensorFlowDockerfile /home/jenkins/workspace/Clipper-PRB > tf36-container.build.log
        

publish_tf36-container: tf36-container
	docker tag clippertesting/tf36-container:3a84966c78 clippertesting/tf36-container:develop
        

pyspark-container: py-rpc
	time docker build --build-arg CODE_VERSION=3a84966c78             --build-arg REGISTRY=clippertesting --build-arg RPC_VERSION=py             -t clippertesting/pyspark-container:3a84966c78             -f dockerfiles/PySparkContainerDockerfile /home/jenkins/workspace/Clipper-PRB > pyspark-container.build.log
        

publish_pyspark-container: pyspark-container
	docker tag clippertesting/pyspark-container:3a84966c78 clippertesting/pyspark-container:develop
        

pyspark35-container: py35-rpc
	time docker build --build-arg CODE_VERSION=3a84966c78             --build-arg REGISTRY=clippertesting --build-arg RPC_VERSION=py35             -t clippertesting/pyspark35-container:3a84966c78             -f dockerfiles/PySparkContainerDockerfile /home/jenkins/workspace/Clipper-PRB > pyspark35-container.build.log
        

publish_pyspark35-container: pyspark35-container
	docker tag clippertesting/pyspark35-container:3a84966c78 clippertesting/pyspark35-container:develop
        

pyspark36-container: py36-rpc
	time docker build --build-arg CODE_VERSION=3a84966c78             --build-arg REGISTRY=clippertesting --build-arg RPC_VERSION=py36             -t clippertesting/pyspark36-container:3a84966c78             -f dockerfiles/PySparkContainerDockerfile /home/jenkins/workspace/Clipper-PRB > pyspark36-container.build.log
        

publish_pyspark36-container: pyspark36-container
	docker tag clippertesting/pyspark36-container:3a84966c78 clippertesting/pyspark36-container:develop
        

python-closure-container: py-rpc
	time docker build --build-arg CODE_VERSION=3a84966c78             --build-arg REGISTRY=clippertesting --build-arg RPC_VERSION=py             -t clippertesting/python-closure-container:3a84966c78             -f dockerfiles/PyClosureContainerDockerfile /home/jenkins/workspace/Clipper-PRB > python-closure-container.build.log
        

publish_python-closure-container: python-closure-container
	docker tag clippertesting/python-closure-container:3a84966c78 clippertesting/python-closure-container:develop
        

python35-closure-container: py35-rpc
	time docker build --build-arg CODE_VERSION=3a84966c78             --build-arg REGISTRY=clippertesting --build-arg RPC_VERSION=py35             -t clippertesting/python35-closure-container:3a84966c78             -f dockerfiles/PyClosureContainerDockerfile /home/jenkins/workspace/Clipper-PRB > python35-closure-container.build.log
        

publish_python35-closure-container: python35-closure-container
	docker tag clippertesting/python35-closure-container:3a84966c78 clippertesting/python35-closure-container:develop
        

python36-closure-container: py36-rpc
	time docker build --build-arg CODE_VERSION=3a84966c78             --build-arg REGISTRY=clippertesting --build-arg RPC_VERSION=py36             -t clippertesting/python36-closure-container:3a84966c78             -f dockerfiles/PyClosureContainerDockerfile /home/jenkins/workspace/Clipper-PRB > python36-closure-container.build.log
        

publish_python36-closure-container: python36-closure-container
	docker tag clippertesting/python36-closure-container:3a84966c78 clippertesting/python36-closure-container:develop
        

all: placeholder lib_base publish_lib_base query_frontend publish_query_frontend management_frontend publish_management_frontend dev publish_dev py35-dev publish_py35-dev unittests publish_unittests py35tests publish_py35tests r-container-base publish_r-container-base frontend-exporter publish_frontend-exporter py-rpc publish_py-rpc py35-rpc publish_py35-rpc py36-rpc publish_py36-rpc sum-container publish_sum-container noop-container publish_noop-container mxnet-container publish_mxnet-container mxnet35-container publish_mxnet35-container mxnet36-container publish_mxnet36-container pytorch-container publish_pytorch-container pytorch35-container publish_pytorch35-container pytorch36-container publish_pytorch36-container tf-container publish_tf-container tf35-container publish_tf35-container tf36-container publish_tf36-container pyspark-container publish_pyspark-container pyspark35-container publish_pyspark35-container pyspark36-container publish_pyspark36-container python-closure-container publish_python-closure-container python35-closure-container publish_python35-closure-container python36-closure-container publish_python36-closure-container

+ make -j 10 all
echo "Do not run make directly"
time docker build --build-arg CODE_VERSION=3a84966c78             --build-arg REGISTRY=clippertesting              -t clippertesting/lib_base:3a84966c78             -f dockerfiles/ClipperLibBaseDockerfile /home/jenkins/workspace/Clipper-PRB > lib_base.build.log
time docker build --build-arg CODE_VERSION=3a84966c78             --build-arg REGISTRY=clippertesting              -t clippertesting/r-container-base:3a84966c78             -f dockerfiles/RContainerDockerfile /home/jenkins/workspace/Clipper-PRB > r-container-base.build.log
time docker build --build-arg CODE_VERSION=3a84966c78             --build-arg REGISTRY=clippertesting              -t clippertesting/frontend-exporter:3a84966c78             -f dockerfiles/FrontendExporterDockerfile /home/jenkins/workspace/Clipper-PRB > frontend-exporter.build.log
Do not run make directly
time docker build --build-arg CODE_VERSION=3a84966c78             --build-arg REGISTRY=clippertesting --build-arg RPC_VERSION=py             -t clippertesting/py-rpc:3a84966c78             -f dockerfiles/Py2RPCDockerfile /home/jenkins/workspace/Clipper-PRB > py-rpc.build.log
time docker build --build-arg CODE_VERSION=3a84966c78             --build-arg REGISTRY=clippertesting --build-arg RPC_VERSION=py35             -t clippertesting/py35-rpc:3a84966c78             -f dockerfiles/Py35RPCDockerfile /home/jenkins/workspace/Clipper-PRB > py35-rpc.build.log
time docker build --build-arg CODE_VERSION=3a84966c78             --build-arg REGISTRY=clippertesting --build-arg RPC_VERSION=py36             -t clippertesting/py36-rpc:3a84966c78             -f dockerfiles/Py36RPCDockerfile /home/jenkins/workspace/Clipper-PRB > py36-rpc.build.log
0.53user 0.63system 0:15.61elapsed 7%CPU (0avgtext+0avgdata 35192maxresident)k
0inputs+16outputs (0major+3662minor)pagefaults 0swaps
0.60user 0.47system 0:15.62elapsed 6%CPU (0avgtext0.68+0uasvegrd a0.44tsay s35768tmeamx re0:15.61seildaepnste)dk
 07%iCnPpUu (ts0+a16voguttepxutt+s 0(a0vmgajdoatra+ 3708m36104imnaoxrr)epsaigdeefnatul)tks
 00isndocker tag clippertesting/py36-rpc:3a84966c78 clippertesting/py36-rpc:develop
wpauptss
+16outputs (0major+3703minor)pagefaults 0swaps
time docker build --build-arg CODE_VERSION=3a84966c78             --build-arg REGISTRY=clippertesting --build-arg RPC_VERSION=py36             -t clippertesting/mxnet36-container:3a84966c78             -f dockerfiles/MXNetContainerDockerfile /home/jenkins/workspace/Clipper-PRB > mxnet36-container.build.log
time docker build --build-arg CODE_VERSION=3a84966c78             --build-arg REGISTRY=clippertesting --build-arg RPC_VERSION=py36             -t clippertesting/pytorch36-container:3a84966c78             -f dockerfiles/PyTorchContainerDockerfile /home/jenkins/workspace/Clipper-PRB > pytorch36-container.build.log
time docker build --build-arg CODE_VERSION=3a84966c78             --build-arg REGISTRY=clippertesting --build-arg RPC_VERSION=py36             -t clippertesting/tf36-container:3a84966c78             -f dockerfiles/TensorFlowDockerfile /home/jenkins/workspace/Clipper-PRB > tf36-container.build.log
time docker build --build-arg CODE_VERSION=3a84966c78             --build-arg REGISTRY=clippertesting --build-arg RPC_VERSION=py             -t clippertesting/pyspark-container:3a84966c78             -f dockerfiles/PySparkContainerDockerfile /home/jenkins/workspace/Clipper-PRB > pyspark-container.build.log
time docker build --build-arg CODE_VERSION=3a84966c78             --build-arg REGISTRY=clippertesting --build-arg RPC_VERSION=py36             -t clippertesting/pyspark36-container:3a84966c78             -f dockerfiles/PySparkContainerDockerfile /home/jenkins/workspace/Clipper-PRB > pyspark36-container.build.log
time docker build --build-arg CODE_VERSION=3a84966c78             --build-arg REGISTRY=clippertesting --build-arg RPC_VERSION=py             -t clippertesting/python-closure-container:3a84966c78             -f dockerfiles/PyClosureContainerDockerfile /home/jenkins/workspace/Clipper-PRB > python-closure-container.build.log
time docker build --build-arg CODE_VERSION=3a84966c78             --build-arg REGISTRY=clippertesting --build-arg RPC_VERSION=py36             -t clippertesting/python36-closure-container:3a84966c78             -f dockerfiles/PyClosureContainerDockerfile /home/jenkins/workspace/Clipper-PRB > python36-closure-container.build.log
0.55user 0.57system 0:07.47elapsed 15%CPU (0avgtext+0avgdata 35592maxresident)k
0inputs+8outputs (0major+3663minor)pagefaults 0swaps
docker tag clippertesting/r-container-base:3a84966c78 clippertesting/r-container-base:develop
docker tag clippertesting/py-rpc:3a84966c78 clippertesting/py-rpc:develop
time docker build --build-arg CODE_VERSION=3a84966c78             --build-arg REGISTRY=clippertesting              -t clippertesting/sum-container:3a84966c78             -f dockerfiles/SumDockerfile  /home/jenkins/workspace/Clipper-PRB > sum-container.build.log
0.89user 0.90system 0:39.28elapsed 4%CPU (0avgtext+0avgdata 35804maxresident)k
0inputs+16outputs (0major+3756minor)pagefaults 0swaps
time docker build --build-arg CODE_VERSION=3a84966c78             --build-arg REGISTRY=clippertesting              -t clippertesting/noop-container:3a84966c78             -f dockerfiles/NoopDockerfile /home/jenkins/workspace/Clipper-PRB > noop-container.build.log
0.56user 0.60system 1:39.81elapsed 1%CPU (0avgtext+0avgdata 35780maxresident)k
0inputs+24outputs (0major+3725minor)pagefaults 0swaps
time docker build --build-arg CODE_VERSION=3a84966c78             --build-arg REGISTRY=clippertesting --build-arg RPC_VERSION=py             -t clippertesting/mxnet-container:3a84966c78             -f dockerfiles/MXNetContainerDockerfile /home/jenkins/workspace/Clipper-PRB > mxnet-container.build.log
0.70user 0.63system 1:35.95elapsed 1%CPU (0avgtext+0avgdata 36108maxresident)k
0inputs+24outputs (0major+3873minor)pagefaults 0swaps
time docker build --build-arg CODE_VERSION=3a84966c78             --build-arg REGISTRY=clippertesting --build-arg RPC_VERSION=py             -t clippertesting/pytorch-container:3a84966c78             -f dockerfiles/PyTorchContainerDockerfile /home/jenkins/workspace/Clipper-PRB > pytorch-container.build.log
0.51user 0.63system 2:40.99elapsed 0%CPU (0avgtext+0avgdata 35764maxresident)k
0inputs+32outputs (0major+3806minor)pagefaults 0swaps
time docker build --build-arg CODE_VERSION=3a84966c78             --build-arg REGISTRY=clippertesting --build-arg RPC_VERSION=py             -t clippertesting/tf-container:3a84966c78             -f dockerfiles/TensorFlowDockerfile /home/jenkins/workspace/Clipper-PRB > tf-container.build.log
0.65user 0.54system 2:26.11elapsed 0%CPU (0avgtext+0avgdata 35496maxresident)k
0inputs+40outputs (0major+3649minor)pagefaults 0swaps
docker tag clippertesting/python-closure-container:3a84966c78 clippertesting/python-closure-container:develop
docker tag clippertesting/python36-closure-container:3a84966c78 clippertesting/python36-closure-container:develop
0.67user 0.50system 2:26.56elapsed 0%CPU (0avgtext+0avgdata 35304maxresident)k
0inputs+32outputs (0major+3665minor)pagefaults 0swaps
docker tag clippertesting/frontend-exporter:3a84966c78 clippertesting/frontend-exporter:develop
docker tag clippertesting/sum-container:3a84966c78 clippertesting/sum-container:develop
docker tag clippertesting/noop-container:3a84966c78 clippertesting/noop-container:develop
docker tag clippertesting/pytorch36-container:3a84966c78 clippertesting/pytorch36-container:develop
docker tag clippertesting/tf36-container:3a84966c78 clippertesting/tf36-container:develop
0.72user 0.73system 0:08.93elapsed 16%CPU (0avgtext+0avgdata 35628maxresident)k
0inputs+8outputs (0major+3714minor)pagefaults 0swaps
docker tag clippertesting/tf-container:3a84966c78 clippertesting/tf-container:develop
0.65user 0.50system 3:44.67elapsed 0%CPU (0avgtext+0avgdata 36336maxresident)k
0inputs+40outputs (0major+3857minor)pagefaults 0swaps
docker tag clippertesting/mxnet36-container:3a84966c78 clippertesting/mxnet36-container:develop
0.73user 0.67system 2:13.64elapsed 1%CPU (0avgtext+0avgdata 36064maxresident)k
0inputs+32outputs (0major+3811minor)pagefaults 0swaps
docker tag clippertesting/mxnet-container:3a84966c78 clippertesting/mxnet-container:develop
0.66user 0.68system 1:33.14elapsed 1%CPU (0avgtext+0avgdata 35864maxresident)k
0inputs+24outputs (0major+3772minor)pagefaults 0swaps
docker tag clippertesting/pytorch-container:3a84966c78 clippertesting/pytorch-container:develop
0.70user 0.58system 7:17.88elapsed 0%CPU (0avgtext+0avgdata 35776maxresident)k
0inputs+216outputs (0major+3809minor)pagefaults 0swaps
docker tag clippertesting/py35-rpc:3a84966c78 clippertesting/py35-rpc:develop
time docker build --build-arg CODE_VERSION=3a84966c78             --build-arg REGISTRY=clippertesting --build-arg RPC_VERSION=py35             -t clippertesting/mxnet35-container:3a84966c78             -f dockerfiles/MXNetContainerDockerfile /home/jenkins/workspace/Clipper-PRB > mxnet35-container.build.log
time docker build --build-arg CODE_VERSION=3a84966c78             --build-arg REGISTRY=clippertesting --build-arg RPC_VERSION=py35             -t clippertesting/pytorch35-container:3a84966c78             -f dockerfiles/PyTorchContainerDockerfile /home/jenkins/workspace/Clipper-PRB > pytorch35-container.build.log
time docker build --build-arg CODE_VERSION=3a84966c78             --build-arg REGISTRY=clippertesting --build-arg RPC_VERSION=py35             -t clippertesting/tf35-container:3a84966c78             -f dockerfiles/TensorFlowDockerfile /home/jenkins/workspace/Clipper-PRB > tf35-container.build.log
time docker build --build-arg CODE_VERSION=3a84966c78             --build-arg REGISTRY=clippertesting --build-arg RPC_VERSION=py35             -t clippertesting/pyspark35-container:3a84966c78             -f dockerfiles/PySparkContainerDockerfile /home/jenkins/workspace/Clipper-PRB > pyspark35-container.build.log
time docker build --build-arg CODE_VERSION=3a84966c78             --build-arg REGISTRY=clippertesting --build-arg RPC_VERSION=py35             -t clippertesting/python35-closure-container:3a84966c78             -f dockerfiles/PyClosureContainerDockerfile /home/jenkins/workspace/Clipper-PRB > python35-closure-container.build.log
0.59user 0.44system 0:39.90elapsed 2%CPU (0avgtext+0avgdata 35624maxresident)k
0inputs+16outputs (0major+3737minor)pagefaults 0swaps
docker tag clippertesting/python35-closure-container:3a84966c78 clippertesting/python35-closure-container:develop
0.67user 0.47system 2:04.10elapsed 0%CPU (0avgtext+0avgdata 35364maxresident)k
0inputs+32outputs (0major+3704minor)pagefaults 0swaps
docker tag clippertesting/tf35-container:3a84966c78 clippertesting/tf35-container:develop
0.58user 0.47system 2:06.40elapsed 0%CPU (0avgtext+0avgdata 35604maxresident)k
0inputs+24outputs (0major+3707minor)pagefaults 0swaps
docker tag clippertesting/pytorch35-container:3a84966c78 clippertesting/pytorch35-container:develop
0.52user 0.54system 2:06.85elapsed 0%CPU (0avgtext+0avgdata 35312maxresident)k
0inputs+32outputs (0major+3642minor)pagefaults 0swaps
docker tag clippertesting/mxnet35-container:3a84966c78 clippertesting/mxnet35-container:develop
0.75user 0.69system 14:41.66elapsed 0%CPU (0avgtext+0avgdata 32868maxresident)k
0inputs+336outputs (0major+3756minor)pagefaults 0swaps
docker tag clippertesting/pyspark36-container:3a84966c78 clippertesting/pyspark36-container:develop
0.79user 0.61system 14:42.96elapsed 0%CPU (0avgtext+0avgdata 33324maxresident)k
0inputs+328outputs (0major+3801minor)pagefaults 0swaps
docker tag clippertesting/pyspark-container:3a84966c78 clippertesting/pyspark-container:develop
0.69user 0.66system 10:55.29elapsed 0%CPU (0avgtext+0avgdata 32024maxresident)k
0inputs+288outputs (0major+3749minor)pagefaults 0swaps
docker tag clippertesting/pyspark35-container:3a84966c78 clippertesting/pyspark35-container:develop
1.01user 0.87system 22:09.64elapsed 0%CPU (0avgtext+0avgdata 33568maxresident)k
0inputs+992outputs (0major+3925minor)pagefaults 0swaps
docker tag clippertesting/lib_base:3a84966c78 clippertesting/lib_base:develop
time docker build --build-arg CODE_VERSION=3a84966c78             --build-arg REGISTRY=clippertesting              -t clippertesting/query_frontend:3a84966c78             -f dockerfiles/QueryFrontendDockerfile /home/jenkins/workspace/Clipper-PRB > query_frontend.build.log
time docker build --build-arg CODE_VERSION=3a84966c78             --build-arg REGISTRY=clippertesting              -t clippertesting/management_frontend:3a84966c78             -f dockerfiles/ManagementFrontendDockerfile /home/jenkins/workspace/Clipper-PRB > management_frontend.build.log
time docker build --build-arg CODE_VERSION=3a84966c78             --build-arg REGISTRY=clippertesting              -t clippertesting/dev:3a84966c78             -f dockerfiles/ClipperDevDockerfile  /home/jenkins/workspace/Clipper-PRB > dev.build.log
time docker build --build-arg CODE_VERSION=3a84966c78             --build-arg REGISTRY=clippertesting              -t clippertesting/py35-dev:3a84966c78             -f dockerfiles/ClipperPy35DevDockerfile  /home/jenkins/workspace/Clipper-PRB > py35-dev.build.log
0.58user 0.63system 2:41.57elapsed 0%CPU (0avgtext+0avgdata 35588maxresident)k
0inputs+400outputs (0major+3828minor)pagefaults 0swaps
docker tag clippertesting/management_frontend:3a84966c78 clippertesting/management_frontend:develop
0.53user 0.56system 2:45.54elapsed 0%CPU (0avgtext+0avgdata 35676maxresident)k
0inputs+400outputs (0major+3753minor)pagefaults 0swaps
docker tag clippertesting/query_frontend:3a84966c78 clippertesting/query_frontend:develop
0.82user 0.85system 16:40.67elapsed 0%CPU (0avgtext+0avgdata 32536maxresident)k
0inputs+608outputs (0major+3828minor)pagefaults 0swaps
docker tag clippertesting/py35-dev:3a84966c78 clippertesting/py35-dev:develop
time docker build --build-arg CODE_VERSION=3a84966c78             --build-arg REGISTRY=clippertesting              -t clippertesting/py35tests:3a84966c78             -f dockerfiles/ClipperPy35TestsDockerfile  /home/jenkins/workspace/Clipper-PRB > py35tests.build.log
0.92user 0.72system 16:41.60elapsed 0%CPU (0avgtext+0avgdata 32972maxresident)k
0inputs+600outputs (0major+3848minor)pagefaults 0swaps
docker tag clippertesting/dev:3a84966c78 clippertesting/dev:develop
time docker build --build-arg CODE_VERSION=3a84966c78             --build-arg REGISTRY=clippertesting              -t clippertesting/unittests:3a84966c78             -f dockerfiles/ClipperTestsDockerfile  /home/jenkins/workspace/Clipper-PRB > unittests.build.log
0.64user 0.69system 1:14.96elapsed 1%CPU (0avgtext+0avgdata 35576maxresident)k
0inputs+32outputs (0major+3684minor)pagefaults 0swaps
docker tag clippertesting/unittests:3a84966c78 clippertesting/unittests:develop
0.76user 0.63system 2:07.00elapsed 1%CPU (0avgtext+0avgdata 35728maxresident)k
0inputs+40outputs (0major+3761minor)pagefaults 0swaps
docker tag clippertesting/py35tests:3a84966c78 clippertesting/py35tests:develop
+ docker run --rm --network=host -v /var/run/docker.sock:/var/run/docker.sock -v /tmp:/tmp -e CLIPPER_K8S_CERT_AUTH=**** -e CLIPPER_K8S_CLIENT_CERT=**** -e CLIPPER_K8S_CLIENT_KEY=**** -e CLIPPER_K8S_PASSWORD=**** -e AWS_ACCESS_KEY_ID=**** -e AWS_SECRET_ACCESS_KEY=**** -e CLIPPER_REGISTRY=clippertesting -e CLIPPER_TESTING_DOCKERHUB_PASSWORD=**** clippertesting/unittests:3a84966c78
+ set -e
+ set -u
+ set -o pipefail
+ run_all=true
+ unset CDPATH
+++ dirname /clipper/bin/ci_checks.sh
++ cd /clipper/bin
++ pwd
+ DIR=/clipper/bin
+ cd /clipper/bin/..
+ tag=3a84966c78
+ cd -
/
++ date +%Y%m%d%H%M%S
+ export KUBECONFIG=/root/kubeconfig_20181111070702
+ KUBECONFIG=/root/kubeconfig_20181111070702
+ trap clean_up SIGHUP SIGINT SIGTERM EXIT
+ python /clipper/bin/construct_kube_config.py /root/kubeconfig_20181111070702
Writing kube config to /root/kubeconfig_20181111070702
+ kubectl get nodes
NAME                                          STATUS   ROLES    AGE    VERSION
ip-172-20-51-85.us-west-1.compute.internal    Ready    node     186d   v1.9.3
ip-172-20-52-178.us-west-1.compute.internal   Ready    master   186d   v1.9.3
ip-172-20-59-225.us-west-1.compute.internal   Ready    node     186d   v1.9.3
+ docker login --username=clippertesting --password=****
+ kubectl proxy --port 8080
WARNING! Using --password via the CLI is insecure. Use --password-stdin.
Starting to serve on 127.0.0.1:8080
WARNING! Your password will be stored unencrypted in /root/.docker/config.json.
Configure a credential helper to remove this warning. See
https://docs.docker.com/engine/reference/commandline/login/#credentials-store

Login Succeeded
+ [[ true = \t\r\u\e ]]
+ /clipper/bin/check_format.sh
/clipper/bin/..
Passed C++ Clang-Format check
Passed Java Clang-Format check
Traceback (most recent call last):
  File "/usr/lib/python2.7/runpy.py", line 174, in _run_module_as_main
    "__main__", fname, loader, pkg_name)
  File "/usr/lib/python2.7/runpy.py", line 72, in _run_code
    exec code in run_globals
  File "/clipper/bin/yapf/yapf/__main__.py", line 18, in <module>
    yapf.run_main()
  File "/clipper/bin/yapf/yapf/__init__.py", line 309, in run_main
    sys.exit(main(sys.argv))
  File "/clipper/bin/yapf/yapf/__init__.py", line 197, in main
    verbose=args.verbose)
  File "/clipper/bin/yapf/yapf/__init__.py", line 247, in FormatFiles
    in_place, print_diff, verify, verbose)
  File "/clipper/bin/yapf/yapf/__init__.py", line 272, in _FormatFile
    logger=logging.warning)
  File "/clipper/bin/yapf/yapf/yapflib/yapf_api.py", line 90, in FormatFile
    verify=verify)
  File "/clipper/bin/yapf/yapf/yapflib/yapf_api.py", line 128, in FormatCode
    tree = pytree_utils.ParseCodeToTree(unformatted_source)
  File "/clipper/bin/yapf/yapf/yapflib/pytree_utils.py", line 115, in ParseCodeToTree
    raise e
  File "./bin/shipyard/shipyard.py", line 25
    """
      ^
SyntaxError: invalid syntax
Found 1 Python PEP8 format violations
Current yapf version
 d377549f52c46885b9987b2e611fa63b5c99eb99 bin/yapf (v0.20.1-2-gd377549)
Current python version
Python 2.7.13
Traceback (most recent call last):
  File "/usr/lib/python2.7/runpy.py", line 174, in _run_module_as_main
    "__main__", fname, loader, pkg_name)
  File "/usr/lib/python2.7/runpy.py", line 72, in _run_code
    exec code in run_globals
  File "/clipper/bin/yapf/yapf/__main__.py", line 18, in <module>
    yapf.run_main()
  File "/clipper/bin/yapf/yapf/__init__.py", line 309, in run_main
    sys.exit(main(sys.argv))
  File "/clipper/bin/yapf/yapf/__init__.py", line 197, in main
    verbose=args.verbose)
  File "/clipper/bin/yapf/yapf/__init__.py", line 247, in FormatFiles
    in_place, print_diff, verify, verbose)
  File "/clipper/bin/yapf/yapf/__init__.py", line 272, in _FormatFile
--- ./clipper_admin/setup.py	(original)
+++ ./clipper_admin/setup.py	(reformatted)
@@ -25,8 +25,8 @@
     install_requires=[
         'requests', 'numpy', 'subprocess32; python_version<"3"', 'pyyaml',
         'docker>=3.0', 'kubernetes>=6.0.0', 'prometheus_client',
-        'cloudpickle==0.5.3', 'enum34; python_version<"3.4"', 'redis', 'psutil',
-        'jsonschema', 'jinja2'
+        'cloudpickle==0.5.3', 'enum34; python_version<"3.4"', 'redis',
+        'psutil', 'jsonschema', 'jinja2'
     ],
     extras_require={
         'PySpark': ['pyspark'],
    logger=logging.warning)
  File "/clipper/bin/yapf/yapf/yapflib/yapf_api.py", line 90, in FormatFile
    verify=verify)
  File "/clipper/bin/yapf/yapf/yapflib/yapf_api.py", line 128, in FormatCode
    tree = pytree_utils.ParseCodeToTree(unformatted_source)
  File "/clipper/bin/yapf/yapf/yapflib/pytree_utils.py", line 115, in ParseCodeToTree
    raise e
  File "./bin/shipyard/shipyard.py", line 25
    """
      ^
SyntaxError: invalid syntax
+ clean_up
+ rm /root/kubeconfig_20181111070702
+ exit
Build step 'Execute shell' marked build as failure
Test FAILed.
Refer to this link for build results (access rights to CI server needed): 
https://amplab.cs.berkeley.edu/jenkins//job/Clipper-PRB/1663/
Test FAILed.
Finished: FAILURE