FailedConsole Output

GitHub pull request #578 of commit dc60ccdfab34e0be4fe76154911243e648085672.
[EnvInject] - Loading node environment variables.
Building remotely on amp-jenkins-staging-worker-02 (ubuntu staging-02 staging) in workspace /home/jenkins/workspace/e-mission-server-prb
 > git rev-parse --is-inside-work-tree # timeout=10
Fetching changes from the remote Git repository
 > git config remote.github-prb.url https://github.com/e-mission/e-mission-server.git # timeout=10
Cleaning workspace
 > git rev-parse --verify HEAD # timeout=10
Resetting working tree
 > git reset --hard # timeout=10
 > git clean -fdx # timeout=10
Fetching upstream changes from https://github.com/e-mission/e-mission-server.git
 > git --version # timeout=10
 > git fetch --tags --progress https://github.com/e-mission/e-mission-server.git +refs/pull/*:refs/remotes/origin/pr/*
 > git rev-parse dc60ccdfab34e0be4fe76154911243e648085672^{commit} # timeout=10
 > git branch -a -v --no-abbrev --contains dc60ccdfab34e0be4fe76154911243e648085672 # timeout=10
Checking out Revision dc60ccdfab34e0be4fe76154911243e648085672 (origin/pr/578/head)
 > git config core.sparsecheckout # timeout=10
 > git checkout -f dc60ccdfab34e0be4fe76154911243e648085672
First time build. Skipping changelog.
[e-mission-server-prb] $ /bin/bash /tmp/hudson642580789513576084.sh
Deploying environment in /tmp/tmp.jDNX00hyf1
Make sure you are running this with conda >=4.2
Check with 'conda -V'
Upgrade with 'conda update conda' from the *root* environment
Using Anaconda API: https://api.anaconda.org
Fetching package metadata .............
Solving package specifications: .
certifi-2019.3   0% |                              | ETA:  --:--:--   0.00  B/s
certifi-2019.3  10% |###                            | ETA:  0:00:00  10.94 MB/s
certifi-2019.3  21% |######                         | ETA:  0:00:00  14.37 MB/s
certifi-2019.3  32% |#########                      | ETA:  0:00:00  16.40 MB/s
certifi-2019.3  42% |#############                  | ETA:  0:00:00  17.88 MB/s
certifi-2019.3  53% |################               | ETA:  0:00:00  19.34 MB/s
certifi-2019.3  64% |###################            | ETA:  0:00:00  20.60 MB/s
certifi-2019.3  75% |#######################        | ETA:  0:00:00  21.60 MB/s
certifi-2019.3  85% |##########################     | ETA:  0:00:00  22.45 MB/s
certifi-2019.3  96% |#############################  | ETA:  0:00:00  23.16 MB/s
certifi-2019.3 100% |###############################| ETA:  0:00:00  22.42 MB/s
certifi-2019.3 100% |###############################| Time: 0:00:00  21.49 MB/s
setuptools-41.   0% |                              | ETA:  --:--:--   0.00  B/s
setuptools-41.   2% |                               | Time: 0:00:00  20.76 MB/s
setuptools-41.   5% |#                              | Time: 0:00:00  22.41 MB/s
setuptools-41.   7% |##                             | Time: 0:00:00  23.88 MB/s
setuptools-41.  10% |###                            | Time: 0:00:00  24.66 MB/s
setuptools-41.  13% |####                           | Time: 0:00:00  25.84 MB/s
setuptools-41.  15% |####                           | Time: 0:00:00  26.55 MB/s
setuptools-41.  18% |#####                          | Time: 0:00:00  27.38 MB/s
setuptools-41.  20% |######                         | Time: 0:00:00  27.89 MB/s
setuptools-41.  23% |#######                        | Time: 0:00:00  28.06 MB/s
setuptools-41.  26% |########                       | Time: 0:00:00  28.71 MB/s
setuptools-41.  28% |########                       | Time: 0:00:00  29.03 MB/s
setuptools-41.  31% |#########                      | Time: 0:00:00  29.46 MB/s
setuptools-41.  34% |##########                     | Time: 0:00:00  29.96 MB/s
setuptools-41.  36% |###########                    | Time: 0:00:00  30.30 MB/s
setuptools-41.  39% |############                   | Time: 0:00:00  30.20 MB/s
setuptools-41.  41% |############                   | Time: 0:00:00  30.46 MB/s
setuptools-41.  44% |#############                  | Time: 0:00:00  30.61 MB/s
setuptools-41.  47% |##############                 | Time: 0:00:00  30.95 MB/s
setuptools-41.  49% |###############                | Time: 0:00:00  31.07 MB/s
setuptools-41.  52% |################               | Time: 0:00:00  31.18 MB/s
setuptools-41.  54% |#################              | Time: 0:00:00  31.29 MB/s
setuptools-41.  57% |#################              | Time: 0:00:00  31.50 MB/s
setuptools-41.  60% |##################             | Time: 0:00:00  31.68 MB/s
setuptools-41.  62% |###################            | Time: 0:00:00  31.75 MB/s
setuptools-41.  65% |####################           | Time: 0:00:00  31.76 MB/s
setuptools-41.  68% |#####################          | Time: 0:00:00  31.80 MB/s
setuptools-41.  70% |#####################          | Time: 0:00:00  31.88 MB/s
setuptools-41.  73% |######################         | Time: 0:00:00  31.95 MB/s
setuptools-41.  75% |#######################        | Time: 0:00:00  32.04 MB/s
setuptools-41.  78% |########################       | Time: 0:00:00  32.04 MB/s
setuptools-41.  81% |#########################      | Time: 0:00:00  32.19 MB/s
setuptools-41.  83% |#########################      | Time: 0:00:00  32.32 MB/s
setuptools-41.  86% |##########################     | Time: 0:00:00  32.46 MB/s
setuptools-41.  88% |###########################    | Time: 0:00:00  32.55 MB/s
setuptools-41.  91% |############################   | Time: 0:00:00  32.73 MB/s
setuptools-41.  94% |#############################  | Time: 0:00:00  32.89 MB/s
setuptools-41.  96% |############################## | Time: 0:00:00  33.07 MB/s
setuptools-41.  99% |############################## | Time: 0:00:00  33.25 MB/s
setuptools-41. Collecting jwcrypto==0.4.2
  Using cached https://files.pythonhosted.org/packages/08/58/39cd800f07535025a01a3b85839a11b51f42ef4ea7380dd513f9046b779c/jwcrypto-0.4.2-py2.py3-none-any.whl
Collecting pyfcm==1.4.3
Collecting pygeocoder==1.2.5
Collecting pykml==0.1.3
Collecting pymongo==3.5.1
  Using cached https://files.pythonhosted.org/packages/10/b3/2a3dd782a8bc51d6a715ed1db8d1851271ab454a8da67c462f7ecab16356/pymongo-3.5.1-cp36-cp36m-manylinux1_x86_64.whl
Collecting cryptography>=1.5 (from jwcrypto==0.4.2)
  Using cached https://files.pythonhosted.org/packages/5b/12/b0409a94dad366d98a8eee2a77678c7a73aafd8c0e4b835abea634ea3896/cryptography-2.6.1-cp34-abi3-manylinux1_x86_64.whl
Collecting requests-toolbelt (from pyfcm==1.4.3)
  Using cached https://files.pythonhosted.org/packages/60/ef/7681134338fc097acef8d9b2f8abe0458e4d87559c689a8c306d0957ece5/requests_toolbelt-0.9.1-py2.py3-none-any.whl
Requirement already satisfied: requests in /tmp/tmp.jDNX00hyf1/lib/python3.6/site-packages (from pyfcm==1.4.3)
Collecting lxml>=2.2.6 (from pykml==0.1.3)
  Cache entry deserialization failed, entry ignored
  Using cached https://files.pythonhosted.org/packages/35/8a/5e066949f2b40caac32c7b2a77da63ad304b5fbe869036cc3fe4a198f724/lxml-4.3.3-cp36-cp36m-manylinux1_x86_64.whl
Collecting cffi!=1.11.3,>=1.8 (from cryptography>=1.5->jwcrypto==0.4.2)
  Using cached https://files.pythonhosted.org/packages/5f/bf/6aa1925384c23ffeb579e97a5569eb9abce41b6310b329352b8252cee1c3/cffi-1.12.3-cp36-cp36m-manylinux1_x86_64.whl
Requirement already satisfied: six>=1.4.1 in /tmp/tmp.jDNX00hyf1/lib/python3.6/site-packages (from cryptography>=1.5->jwcrypto==0.4.2)
Collecting asn1crypto>=0.21.0 (from cryptography>=1.5->jwcrypto==0.4.2)
  Using cached https://files.pythonhosted.org/packages/ea/cd/35485615f45f30a510576f1a56d1e0a7ad7bd8ab5ed7cdc600ef7cd06222/asn1crypto-0.24.0-py2.py3-none-any.whl
Collecting pycparser (from cffi!=1.11.3,>=1.8->cryptography>=1.5->jwcrypto==0.4.2)
Installing collected packages: pycparser, cffi, asn1crypto, cryptography, jwcrypto, requests-toolbelt, pyfcm, pygeocoder, lxml, pykml, pymongo
Successfully installed asn1crypto-0.24.0 cffi-1.12.3 cryptography-2.6.1 jwcrypto-0.4.2 lxml-4.3.3 pycparser-2.19 pyfcm-1.4.3 pygeocoder-1.2.5 pykml-0.1.3 pymongo-3.5.1 requests-toolbelt-0.9.1
100% |###############################| Time: 0:00:00  32.92 MB/s
setuptools-41. 100% |###############################| Time: 0:00:00  32.46 MB/s
wheel-0.33.4-p   0% |                              | ETA:  --:--:--   0.00  B/s
wheel-0.33.4-p  46% |##############                 | Time: 0:00:00  24.75 MB/s
wheel-0.33.4-p  92% |############################   | Time: 0:00:00  27.82 MB/s
wheel-0.33.4-p 100% |###############################| Time: 0:00:00  22.66 MB/s
wheel-0.33.4-p 100% |###############################| Time: 0:00:00  18.98 MB/s
#
# To activate this environment, use:
# > source activate /tmp/tmp.jDNX00hyf1
#
# To deactivate an active environment, use:
# > source deactivate
#

WARNING:root:No user defined overrides for 2a4eb29d-ec30-4d0c-bcc7-903489acb43c, early return
WARNING:root:No user defined overrides for 2a4eb29d-ec30-4d0c-bcc7-903489acb43c, early return
WARNING:root:No user defined overrides for 2a4eb29d-ec30-4d0c-bcc7-903489acb43c, early return
./home/jenkins/workspace/e-mission-server-prb/emission/tests/analysisTests/configTests/TestSaveAllConfigs.py:86: DeprecationWarning: insert is deprecated. Use insert_one or insert_many instead.
  edb.get_timeseries_db().insert(cfg_1)
/home/jenkins/workspace/e-mission-server-prb/emission/tests/analysisTests/configTests/TestSaveAllConfigs.py:90: DeprecationWarning: insert is deprecated. Use insert_one or insert_many instead.
  edb.get_timeseries_db().insert(cfg_2)
WARNING:root:No user defined overrides for b68e211b-90e5-40f7-915b-fa941a7e917e, early return
WARNING:root:No user defined overrides for b68e211b-90e5-40f7-915b-fa941a7e917e, early return
WARNING:root:No user defined overrides for b68e211b-90e5-40f7-915b-fa941a7e917e, early return
./home/jenkins/workspace/e-mission-server-prb/emission/tests/analysisTests/configTests/TestSaveAllConfigs.py:57: DeprecationWarning: insert is deprecated. Use insert_one or insert_many instead.
  edb.get_timeseries_db().insert(cfg_1)
/home/jenkins/workspace/e-mission-server-prb/emission/net/usercache/builtin_usercache.py:106: DeprecationWarning: update is deprecated. Use replace_one, update_one or update_many instead.
  upsert=True)
WARNING:root:No user defined overrides for 2300aa55-6c38-49bb-89fd-a35d1957fd79, early return
WARNING:root:No user defined overrides for 2300aa55-6c38-49bb-89fd-a35d1957fd79, early return
./home/jenkins/workspace/e-mission-server-prb/emission/tests/analysisTests/configTests/TestSaveAllConfigs.py:69: DeprecationWarning: insert is deprecated. Use insert_one or insert_many instead.
  edb.get_timeseries_db().insert(cfg_1)
/home/jenkins/workspace/e-mission-server-prb/emission/tests/analysisTests/configTests/TestSaveAllConfigs.py:74: DeprecationWarning: insert is deprecated. Use insert_one or insert_many instead.
  edb.get_timeseries_db().insert(cfg_2)
WARNING:root:No user defined overrides for 1e238472-9c4a-4cfa-8a4f-b57002b01dc8, early return
WARNING:root:No user defined overrides for 1e238472-9c4a-4cfa-8a4f-b57002b01dc8, early return
./home/jenkins/workspace/e-mission-server-prb/emission/core/get_database.py:268: DeprecationWarning: save is deprecated. Use insert_one or replace_one instead
  db.save(entry)
/tmp/tmp.jDNX00hyf1/lib/python3.6/site-packages/pandas/core/frame.py:891: UserWarning: DataFrame columns are not unique, some columns will be omitted.
  "columns will be omitted.", UserWarning)
/home/jenkins/workspace/e-mission-server-prb/emission/tests/analysisTests/intakeTests/TestCleanAndResample.py:44: DeprecationWarning: remove is deprecated. Use delete_one or delete_many instead.
  edb.get_timeseries_db().remove({"user_id": self.testUUID})
F./home/jenkins/workspace/e-mission-server-prb/emission/analysis/config.py:18: ResourceWarning: unclosed file <_io.TextIOWrapper name='conf/analysis/debug.conf.json' mode='r' encoding='UTF-8'>
  config_data = get_config_data()
./home/jenkins/workspace/e-mission-server-prb/emission/tests/analysisTests/intakeTests/TestFilterAccuracy.py:92: DeprecationWarning: Please use assertEqual instead.
  self.assertEquals(entry_copy["metadata"]["key"], "background/filtered_location")
./home/jenkins/workspace/e-mission-server-prb/emission/tests/analysisTests/intakeTests/TestFilterAccuracy.py:64: DeprecationWarning: remove is deprecated. Use delete_one or delete_many instead.
  edb.get_timeseries_db().remove({"user_id": self.testUUID})
..../home/jenkins/workspace/e-mission-server-prb/emission/tests/analysisTests/intakeTests/TestLocationSmoothing.py:50: ResourceWarning: unclosed file <_io.TextIOWrapper name='emission/tests/data/smoothing_data/trip_list.txt' mode='r' encoding='UTF-8'>
  object_hook=bju.object_hook)
/home/jenkins/workspace/e-mission-server-prb/emission/tests/analysisTests/intakeTests/TestLocationSmoothing.py:58: ResourceWarning: unclosed file <_io.TextIOWrapper name='emission/tests/data/smoothing_data/section_list.txt' mode='r' encoding='UTF-8'>
  object_hook=bju.object_hook)
/home/jenkins/workspace/e-mission-server-prb/emission/tests/analysisTests/intakeTests/TestLocationSmoothing.py:74: ResourceWarning: unclosed file <_io.TextIOWrapper name='emission/tests/data/smoothing_data/56081ad3f6858f3a71f65e1f' mode='r' encoding='UTF-8'>
  object_hook=bju.object_hook)
/home/jenkins/workspace/e-mission-server-prb/emission/tests/analysisTests/intakeTests/TestLocationSmoothing.py:74: ResourceWarning: unclosed file <_io.TextIOWrapper name='emission/tests/data/smoothing_data/5608285df6858f3c7580c931' mode='r' encoding='UTF-8'>
  object_hook=bju.object_hook)
/home/jenkins/workspace/e-mission-server-prb/emission/tests/analysisTests/intakeTests/TestLocationSmoothing.py:74: ResourceWarning: unclosed file <_io.TextIOWrapper name='emission/tests/data/smoothing_data/5608285df6858f3c7580c94f' mode='r' encoding='UTF-8'>
  object_hook=bju.object_hook)
/home/jenkins/workspace/e-mission-server-prb/emission/tests/analysisTests/intakeTests/TestLocationSmoothing.py:67: DeprecationWarning: remove is deprecated. Use delete_one or delete_many instead.
  edb.get_timeseries_db().remove({"user_id": self.testUUID})
/home/jenkins/workspace/e-mission-server-prb/emission/tests/analysisTests/intakeTests/TestLocationSmoothing.py:68: DeprecationWarning: remove is deprecated. Use delete_one or delete_many instead.
  edb.get_analysis_timeseries_db().remove({"user_id": self.testUUID})
..../home/jenkins/workspace/e-mission-server-prb/emission/tests/analysisTests/intakeTests/TestPipelineRealData.py:347: ResourceWarning: unclosed file <_io.TextIOWrapper name='emission/tests/data/real_examples/shankari_2016-08-05.ground_truth' mode='r' encoding='UTF-8'>
  ground_truth = json.load(open(dataFile+".ground_truth"), object_hook=bju.object_hook)
/tmp/tmp.jDNX00hyf1/lib/python3.6/importlib/_bootstrap.py:205: ImportWarning: can't resolve package from __spec__ or __package__, falling back on __name__ and __path__
  return f(*args, **kwds)
/home/jenkins/workspace/e-mission-server-prb/emission/analysis/classification/inference/mode/pipeline.py:101: ResourceWarning: unclosed file <_io.TextIOWrapper name='seed_model.json' mode='r' encoding='UTF-8'>
  self.model = seedp.ModeInferencePipelineMovesFormat.loadModel()
F/home/jenkins/workspace/e-mission-server-prb/emission/analysis/intake/segmentation/section_segmentation_methods/flip_flop_detection.py:57: RuntimeWarning: invalid value encountered in double_scalars
  sm.update({"trip_pct": (curr_section_time * 100)/total_trip_time})
.F./home/jenkins/workspace/e-mission-server-prb/emission/tests/analysisTests/intakeTests/TestPipelineRealData.py:495: ResourceWarning: unclosed file <_io.TextIOWrapper name='emission/tests/data/real_examples/shankari_2016-08-910.ground_truth' mode='r' encoding='UTF-8'>
  object_hook=bju.object_hook)
./home/jenkins/workspace/e-mission-server-prb/emission/tests/analysisTests/intakeTests/TestPipelineRealData.py:573: ResourceWarning: unclosed file <_io.TextIOWrapper name='emission/tests/data/real_examples/shankari_2016-08-910.ground_truth' mode='r' encoding='UTF-8'>
  object_hook=bju.object_hook)
/home/jenkins/workspace/e-mission-server-prb/emission/tests/analysisTests/intakeTests/TestPipelineRealData.py:576: ResourceWarning: unclosed file <_io.TextIOWrapper name='emission/tests/data/real_examples/shankari_2016-08-10' mode='r' encoding='UTF-8'>
  all_entries = json.load(open(dataFile), object_hook = bju.object_hook)
.F/home/jenkins/workspace/e-mission-server-prb/emission/tests/analysisTests/intakeTests/TestPipelineRealData.py:535: ResourceWarning: unclosed file <_io.TextIOWrapper name='emission/tests/data/real_examples/iphone_2016-02-22.ground_truth' mode='r' encoding='UTF-8'>
  ground_truth = json.load(open(dataFile+".ground_truth"), object_hook=bju.object_hook)
/home/jenkins/workspace/e-mission-server-prb/emission/tests/analysisTests/intakeTests/TestPipelineRealData.py:538: ResourceWarning: unclosed file <_io.TextIOWrapper name='emission/tests/data/real_examples/iphone_2016-02-22' mode='r' encoding='UTF-8'>
  all_entries = json.load(open(dataFile), object_hook = bju.object_hook)
F/home/jenkins/workspace/e-mission-server-prb/emission/tests/analysisTests/intakeTests/TestPipelineRealData.py:638: ResourceWarning: unclosed file <_io.TextIOWrapper name='emission/tests/data/real_examples/iphone_2016-02-22.ground_truth' mode='r' encoding='UTF-8'>
  ground_truth = json.load(open(dataFile+".ground_truth"), object_hook=bju.object_hook)
/home/jenkins/workspace/e-mission-server-prb/emission/tests/analysisTests/intakeTests/TestPipelineRealData.py:641: ResourceWarning: unclosed file <_io.TextIOWrapper name='emission/tests/data/real_examples/iphone_2016-02-22' mode='r' encoding='UTF-8'>
  all_entries = json.load(open(dataFile), object_hook = bju.object_hook)
FF/home/jenkins/workspace/e-mission-server-prb/emission/tests/analysisTests/intakeTests/TestPipelineRealData.py:374: ResourceWarning: unclosed file <_io.TextIOWrapper name='emission/tests/data/real_examples/gabe_2016-06-15.ground_truth' mode='r' encoding='UTF-8'>
  ground_truth = json.load(open(dataFile+".ground_truth"), object_hook=bju.object_hook)
./home/jenkins/workspace/e-mission-server-prb/emission/tests/analysisTests/intakeTests/TestPipelineRealData.py:431: ResourceWarning: unclosed file <_io.TextIOWrapper name='emission/tests/data/real_examples/shankari_2015-08-23.ground_truth' mode='r' encoding='UTF-8'>
  ground_truth = json.load(open("emission/tests/data/real_examples/shankari_2015-08-23.ground_truth"), object_hook=bju.object_hook)
F/home/jenkins/workspace/e-mission-server-prb/emission/tests/analysisTests/intakeTests/TestPipelineRealData.py:476: ResourceWarning: unclosed file <_io.TextIOWrapper name='emission/tests/data/real_examples/sunil_2016-07-20.ground_truth' mode='r' encoding='UTF-8'>
  ground_truth = json.load(open("emission/tests/data/real_examples/sunil_2016-07-20.ground_truth"), object_hook=bju.object_hook)
F/home/jenkins/workspace/e-mission-server-prb/emission/tests/analysisTests/intakeTests/TestPipelineRealData.py:792: ResourceWarning: unclosed file <_io.TextIOWrapper name='emission/tests/data/real_examples/another_speed_assertion_failure.jan-16.ground_truth' mode='r' encoding='UTF-8'>
  ground_truth = json.load(open("emission/tests/data/real_examples/another_speed_assertion_failure.jan-16.ground_truth"), object_hook=bju.object_hook)
/home/jenkins/workspace/e-mission-server-prb/emission/analysis/intake/segmentation/section_segmentation_methods/flip_flop_detection.py:57: RuntimeWarning: invalid value encountered in long_scalars
  sm.update({"trip_pct": (curr_section_time * 100)/total_trip_time})
F/home/jenkins/workspace/e-mission-server-prb/emission/tests/analysisTests/intakeTests/TestPipelineRealData.py:611: ResourceWarning: unclosed file <_io.TextIOWrapper name='emission/tests/data/real_examples/shankari_2016-07-22.ground_truth' mode='r' encoding='UTF-8'>
  ground_truth_1 = json.load(open(dataFile_1+".ground_truth"), object_hook=bju.object_hook)
/home/jenkins/workspace/e-mission-server-prb/emission/tests/analysisTests/intakeTests/TestPipelineRealData.py:612: ResourceWarning: unclosed file <_io.TextIOWrapper name='emission/tests/data/real_examples/shankari_2016-07-25.ground_truth' mode='r' encoding='UTF-8'>
  ground_truth_2 = json.load(open(dataFile_2+".ground_truth"), object_hook=bju.object_hook)
/home/jenkins/workspace/e-mission-server-prb/emission/tests/analysisTests/intakeTests/TestPipelineRealData.py:616: ResourceWarning: unclosed file <_io.TextIOWrapper name='emission/tests/data/real_examples/shankari_2016-07-25' mode='r' encoding='UTF-8'>
  self.entries = json.load(open(dataFile_2), object_hook = bju.object_hook)
F/home/jenkins/workspace/e-mission-server-prb/emission/tests/analysisTests/intakeTests/TestPipelineRealData.py:388: ResourceWarning: unclosed file <_io.TextIOWrapper name='emission/tests/data/real_examples/shankari_2016-independence_day.ground_truth' mode='r' encoding='UTF-8'>
  ground_truth = json.load(open("emission/tests/data/real_examples/shankari_2016-independence_day.ground_truth"), object_hook=bju.object_hook)
F/home/jenkins/workspace/e-mission-server-prb/emission/tests/analysisTests/intakeTests/TestPipelineRealData.py:416: ResourceWarning: unclosed file <_io.TextIOWrapper name='emission/tests/data/real_examples/shankari_2016-independence_day.ground_truth' mode='r' encoding='UTF-8'>
  ground_truth = json.load(open("emission/tests/data/real_examples/shankari_2016-independence_day.ground_truth"), object_hook=bju.object_hook)
F/home/jenkins/workspace/e-mission-server-prb/emission/tests/analysisTests/intakeTests/TestPipelineRealData.py:402: ResourceWarning: unclosed file <_io.TextIOWrapper name='emission/tests/data/real_examples/shankari_2016-independence_day.ground_truth' mode='r' encoding='UTF-8'>
  ground_truth = json.load(open("emission/tests/data/real_examples/shankari_2016-independence_day.ground_truth"), object_hook=bju.object_hook)
FFF/home/jenkins/workspace/e-mission-server-prb/emission/tests/analysisTests/intakeTests/TestPipelineRealData.py:676: ResourceWarning: unclosed file <_io.TextIOWrapper name='emission/tests/data/real_examples/issue_436_assertion_error.ground_truth' mode='r' encoding='UTF-8'>
  ground_truth = json.load(open(dataFile+".ground_truth"), object_hook=bju.object_hook)
/home/jenkins/workspace/e-mission-server-prb/emission/tests/analysisTests/intakeTests/TestPipelineRealData.py:679: ResourceWarning: unclosed file <_io.TextIOWrapper name='emission/tests/data/real_examples/issue_436_assertion_error' mode='r' encoding='UTF-8'>
  all_entries = json.load(open(dataFile), object_hook = bju.object_hook)
F/home/jenkins/workspace/e-mission-server-prb/emission/tests/analysisTests/intakeTests/TestPipelineRealData.py:778: ResourceWarning: unclosed file <_io.TextIOWrapper name='emission/tests/data/real_examples/test_overriden_mode_hack.jul-31.ground_truth' mode='r' encoding='UTF-8'>
  ground_truth = json.load(open("emission/tests/data/real_examples/test_overriden_mode_hack.jul-31.ground_truth"), object_hook=bju.object_hook)
./home/jenkins/workspace/e-mission-server-prb/emission/tests/analysisTests/intakeTests/TestPipelineRealData.py:446: ResourceWarning: unclosed file <_io.TextIOWrapper name='emission/tests/data/real_examples/shankari_2015-07-22.ground_truth' mode='r' encoding='UTF-8'>
  ground_truth = json.load(open("emission/tests/data/real_examples/shankari_2015-07-22.ground_truth"), object_hook=bju.object_hook)
F/home/jenkins/workspace/e-mission-server-prb/emission/tests/analysisTests/intakeTests/TestPipelineRealData.py:361: ResourceWarning: unclosed file <_io.TextIOWrapper name='emission/tests/data/real_examples/sunil_2016-07-27.ground_truth' mode='r' encoding='UTF-8'>
  ground_truth = json.load(open(dataFile+".ground_truth"), object_hook=bju.object_hook)
./home/jenkins/workspace/e-mission-server-prb/emission/tests/analysisTests/intakeTests/TestPipelineRealData.py:764: ResourceWarning: unclosed file <_io.TextIOWrapper name='emission/tests/data/real_examples/shankari_single_positional_indexer.dec-12.ground_truth' mode='r' encoding='UTF-8'>
  ground_truth = json.load(open("emission/tests/data/real_examples/shankari_single_positional_indexer.dec-12.ground_truth"), object_hook=bju.object_hook)
F/home/jenkins/workspace/e-mission-server-prb/emission/tests/analysisTests/intakeTests/TestPipelineRealData.py:461: ResourceWarning: unclosed file <_io.TextIOWrapper name='emission/tests/data/real_examples/shankari_2016-09-03.ground_truth' mode='r' encoding='UTF-8'>
  ground_truth = json.load(open("emission/tests/data/real_examples/shankari_2016-09-03.ground_truth"), object_hook=bju.object_hook)
./home/jenkins/workspace/e-mission-server-prb/emission/tests/analysisTests/intakeTests/TestPipelineRealData.py:740: ResourceWarning: unclosed file <_io.TextIOWrapper name='emission/tests/data/real_examples/shankari_2016-01-12.ground_truth' mode='r' encoding='UTF-8'>
  ground_truth_1 = json.load(open(dataFile_1+".ground_truth"), object_hook=bju.object_hook)
/home/jenkins/workspace/e-mission-server-prb/emission/tests/analysisTests/intakeTests/TestPipelineRealData.py:741: ResourceWarning: unclosed file <_io.TextIOWrapper name='emission/tests/data/real_examples/shankari_2016-01-13.ground_truth' mode='r' encoding='UTF-8'>
  ground_truth_2 = json.load(open(dataFile_2+".ground_truth"), object_hook=bju.object_hook)
/home/jenkins/workspace/e-mission-server-prb/emission/tests/analysisTests/intakeTests/TestPipelineRealData.py:745: ResourceWarning: unclosed file <_io.TextIOWrapper name='emission/tests/data/real_examples/shankari_2016-01-13' mode='r' encoding='UTF-8'>
  self.entries = json.load(open(dataFile_2), object_hook = bju.object_hook)
F/home/jenkins/workspace/e-mission-server-prb/emission/tests/analysisTests/intakeTests/TestPipelineRealData.py:714: ResourceWarning: unclosed file <_io.TextIOWrapper name='emission/tests/data/real_examples/shankari_2016-01-12.ground_truth' mode='r' encoding='UTF-8'>
  ground_truth_1 = json.load(open(dataFile_1+".ground_truth"), object_hook=bju.object_hook)
/home/jenkins/workspace/e-mission-server-prb/emission/tests/analysisTests/intakeTests/TestPipelineRealData.py:715: ResourceWarning: unclosed file <_io.TextIOWrapper name='emission/tests/data/real_examples/shankari_2016-01-13.ground_truth' mode='r' encoding='UTF-8'>
  ground_truth_2 = json.load(open(dataFile_2+".ground_truth"), object_hook=bju.object_hook)
/home/jenkins/workspace/e-mission-server-prb/emission/tests/analysisTests/intakeTests/TestPipelineRealData.py:718: ResourceWarning: unclosed file <_io.TextIOWrapper name='emission/tests/data/real_examples/shankari_2016-01-13' mode='r' encoding='UTF-8'>
  self.entries = json.load(open(dataFile_2), object_hook = bju.object_hook)
F/home/jenkins/workspace/e-mission-server-prb/emission/tests/analysisTests/intakeTests/TestSectionSegmentation.py:53: ResourceWarning: unclosed file <_io.TextIOWrapper name='emission/tests/data/real_examples/iphone_2015-11-06' mode='r' encoding='UTF-8'>
  self.entries = json.load(open("emission/tests/data/real_examples/iphone_2015-11-06"), object_hook = bju.object_hook)
/home/jenkins/workspace/e-mission-server-prb/emission/tests/analysisTests/intakeTests/TestSectionSegmentation.py:63: DeprecationWarning: remove is deprecated. Use delete_one or delete_many instead.
  edb.get_timeseries_db().remove({"user_id": self.androidUUID})
/home/jenkins/workspace/e-mission-server-prb/emission/tests/analysisTests/intakeTests/TestSectionSegmentation.py:64: DeprecationWarning: remove is deprecated. Use delete_one or delete_many instead.
  edb.get_analysis_timeseries_db().remove({"user_id": self.androidUUID})
/home/jenkins/workspace/e-mission-server-prb/emission/tests/analysisTests/intakeTests/TestSectionSegmentation.py:65: DeprecationWarning: remove is deprecated. Use delete_one or delete_many instead.
  edb.get_pipeline_state_db().remove({"user_id": self.androidUUID})
/home/jenkins/workspace/e-mission-server-prb/emission/tests/analysisTests/intakeTests/TestSectionSegmentation.py:66: DeprecationWarning: remove is deprecated. Use delete_one or delete_many instead.
  edb.get_timeseries_db().remove({"user_id": self.iosUUID})
/home/jenkins/workspace/e-mission-server-prb/emission/tests/analysisTests/intakeTests/TestSectionSegmentation.py:67: DeprecationWarning: remove is deprecated. Use delete_one or delete_many instead.
  edb.get_analysis_timeseries_db().remove({"user_id": self.iosUUID})
/home/jenkins/workspace/e-mission-server-prb/emission/tests/analysisTests/intakeTests/TestSectionSegmentation.py:68: DeprecationWarning: remove is deprecated. Use delete_one or delete_many instead.
  edb.get_pipeline_state_db().remove({"user_id": self.iosUUID})
F.F.EEEEE/home/jenkins/workspace/e-mission-server-prb/emission/tests/analysisTests/intakeTests/TestTripSegmentation.py:46: ResourceWarning: unclosed file <_io.TextIOWrapper name='emission/tests/data/real_examples/iphone_2015-11-06' mode='r' encoding='UTF-8'>
  self.entries = json.load(open("emission/tests/data/real_examples/iphone_2015-11-06"), object_hook = bju.object_hook)
/home/jenkins/workspace/e-mission-server-prb/emission/tests/analysisTests/intakeTests/TestTripSegmentation.py:54: DeprecationWarning: remove is deprecated. Use delete_one or delete_many instead.
  edb.get_timeseries_db().remove({"user_id": self.androidUUID})
/home/jenkins/workspace/e-mission-server-prb/emission/tests/analysisTests/intakeTests/TestTripSegmentation.py:55: DeprecationWarning: remove is deprecated. Use delete_one or delete_many instead.
  edb.get_timeseries_db().remove({"user_id": self.iosUUID})
/home/jenkins/workspace/e-mission-server-prb/emission/tests/analysisTests/intakeTests/TestTripSegmentation.py:56: DeprecationWarning: remove is deprecated. Use delete_one or delete_many instead.
  edb.get_pipeline_state_db().remove({"user_id": self.androidUUID})
/home/jenkins/workspace/e-mission-server-prb/emission/tests/analysisTests/intakeTests/TestTripSegmentation.py:57: DeprecationWarning: remove is deprecated. Use delete_one or delete_many instead.
  edb.get_pipeline_state_db().remove({"user_id": self.iosUUID})
/home/jenkins/workspace/e-mission-server-prb/emission/tests/analysisTests/intakeTests/TestTripSegmentation.py:58: DeprecationWarning: remove is deprecated. Use delete_one or delete_many instead.
  edb.get_analysis_timeseries_db().remove({"user_id": self.androidUUID})
/home/jenkins/workspace/e-mission-server-prb/emission/tests/analysisTests/intakeTests/TestTripSegmentation.py:59: DeprecationWarning: remove is deprecated. Use delete_one or delete_many instead.
  edb.get_analysis_timeseries_db().remove({"user_id": self.iosUUID})
.............../home/jenkins/workspace/e-mission-server-prb/emission/analysis/classification/inference/mode/reset.py:57: DeprecationWarning: remove is deprecated. Use delete_one or delete_many instead.
  result = edb.get_analysis_timeseries_db().remove(del_query)
......../home/jenkins/workspace/e-mission-server-prb/emission/tests/common.py:59: ResourceWarning: unclosed file <_io.TextIOWrapper name='emission/tests/data/modes.json' mode='r' encoding='UTF-8'>
  dataJSON = json.load(open(fileName))
/home/jenkins/workspace/e-mission-server-prb/emission/tests/common.py:61: DeprecationWarning: insert is deprecated. Use insert_one or insert_many instead.
  tableColl.insert(row)
/home/jenkins/workspace/e-mission-server-prb/emission/tests/common.py:59: ResourceWarning: unclosed file <_io.TextIOWrapper name='emission/tests/data/testModeInferSeedFile' mode='r' encoding='UTF-8'>
  dataJSON = json.load(open(fileName))
/home/jenkins/workspace/e-mission-server-prb/emission/tests/analysisTests/modeinferTests/TestPipelineSeed.py:62: DeprecationWarning: save is deprecated. Use insert_one or replace_one instead
  self.SectionsColl.save(section)
/home/jenkins/workspace/e-mission-server-prb/emission/tests/analysisTests/modeinferTests/TestPipelineSeed.py:133: DeprecationWarning: insert is deprecated. Use insert_one or insert_many instead.
  self.SectionsColl.insert(runSec)
/home/jenkins/workspace/e-mission-server-prb/emission/tests/analysisTests/modeinferTests/TestPipelineSeed.py:140: DeprecationWarning: insert is deprecated. Use insert_one or insert_many instead.
  self.SectionsColl.insert(longTripSec)
/home/jenkins/workspace/e-mission-server-prb/emission/tests/analysisTests/modeinferTests/TestPipelineSeed.py:146: DeprecationWarning: insert is deprecated. Use insert_one or insert_many instead.
  self.SectionsColl.insert(unknownTripSec)
./home/jenkins/workspace/e-mission-server-prb/emission/tests/common.py:59: ResourceWarning: unclosed file <_io.TextIOWrapper name='emission/tests/data/modes.json' mode='r' encoding='UTF-8'>
  dataJSON = json.load(open(fileName))
/home/jenkins/workspace/e-mission-server-prb/emission/tests/common.py:61: DeprecationWarning: insert is deprecated. Use insert_one or insert_many instead.
  tableColl.insert(row)
/home/jenkins/workspace/e-mission-server-prb/emission/tests/common.py:59: ResourceWarning: unclosed file <_io.TextIOWrapper name='emission/tests/data/testModeInferSeedFile' mode='r' encoding='UTF-8'>
  dataJSON = json.load(open(fileName))
/home/jenkins/workspace/e-mission-server-prb/emission/tests/analysisTests/modeinferTests/TestPipelineSeed.py:62: DeprecationWarning: save is deprecated. Use insert_one or replace_one instead
  self.SectionsColl.save(section)
/home/jenkins/workspace/e-mission-server-prb/emission/tests/analysisTests/modeinferTests/TestPipelineSeed.py:133: DeprecationWarning: insert is deprecated. Use insert_one or insert_many instead.
  self.SectionsColl.insert(runSec)
/home/jenkins/workspace/e-mission-server-prb/emission/tests/analysisTests/modeinferTests/TestPipelineSeed.py:140: DeprecationWarning: insert is deprecated. Use insert_one or insert_many instead.
  self.SectionsColl.insert(longTripSec)
/home/jenkins/workspace/e-mission-server-prb/emission/tests/analysisTests/modeinferTests/TestPipelineSeed.py:146: DeprecationWarning: insert is deprecated. Use insert_one or insert_many instead.
  self.SectionsColl.insert(unknownTripSec)
./home/jenkins/workspace/e-mission-server-prb/emission/tests/common.py:59: ResourceWarning: unclosed file <_io.TextIOWrapper name='emission/tests/data/modes.json' mode='r' encoding='UTF-8'>
  dataJSON = json.load(open(fileName))
/home/jenkins/workspace/e-mission-server-prb/emission/tests/common.py:61: DeprecationWarning: insert is deprecated. Use insert_one or insert_many instead.
  tableColl.insert(row)
/home/jenkins/workspace/e-mission-server-prb/emission/tests/common.py:59: ResourceWarning: unclosed file <_io.TextIOWrapper name='emission/tests/data/testModeInferSeedFile' mode='r' encoding='UTF-8'>
  dataJSON = json.load(open(fileName))
/home/jenkins/workspace/e-mission-server-prb/emission/tests/analysisTests/modeinferTests/TestPipelineSeed.py:62: DeprecationWarning: save is deprecated. Use insert_one or replace_one instead
  self.SectionsColl.save(section)
/home/jenkins/workspace/e-mission-server-prb/emission/tests/analysisTests/modeinferTests/TestPipelineSeed.py:193: DeprecationWarning: insert is deprecated. Use insert_one or insert_many instead.
  self.SectionsColl.insert(test_id_1)
/home/jenkins/workspace/e-mission-server-prb/emission/tests/analysisTests/modeinferTests/TestPipelineSeed.py:199: DeprecationWarning: insert is deprecated. Use insert_one or insert_many instead.
  self.SectionsColl.insert(test_id_2)
/tmp/tmp.jDNX00hyf1/lib/python3.6/site-packages/jsonpickle/ext/numpy.py:245: UserWarning: ndarray is defined by reference to an object we do not know how to serialize. A deep copy is serialized instead, breaking memory aliasing.
  warnings.warn(msg)
/home/jenkins/workspace/e-mission-server-prb/emission/tests/analysisTests/modeinferTests/TestPipelineSeed.py:213: ResourceWarning: unclosed file <_io.TextIOWrapper name='seed_model.json' mode='r' encoding='UTF-8'>
  self.pipeline.model = pipeline.ModeInferencePipelineMovesFormat.loadModel()
./home/jenkins/workspace/e-mission-server-prb/emission/tests/common.py:59: ResourceWarning: unclosed file <_io.TextIOWrapper name='emission/tests/data/modes.json' mode='r' encoding='UTF-8'>
  dataJSON = json.load(open(fileName))
/home/jenkins/workspace/e-mission-server-prb/emission/tests/common.py:61: DeprecationWarning: insert is deprecated. Use insert_one or insert_many instead.
  tableColl.insert(row)
/home/jenkins/workspace/e-mission-server-prb/emission/tests/common.py:59: ResourceWarning: unclosed file <_io.TextIOWrapper name='emission/tests/data/testModeInferSeedFile' mode='r' encoding='UTF-8'>
  dataJSON = json.load(open(fileName))
/home/jenkins/workspace/e-mission-server-prb/emission/tests/analysisTests/modeinferTests/TestPipelineSeed.py:62: DeprecationWarning: save is deprecated. Use insert_one or replace_one instead
  self.SectionsColl.save(section)
/home/jenkins/workspace/e-mission-server-prb/emission/analysis/classification/inference/mode/seed/pipeline.py:229: FutureWarning: comparison to `None` will result in an elementwise object comparison in the future.
  if speeds != None and len(speeds) > 0:
../home/jenkins/workspace/e-mission-server-prb/emission/tests/common.py:59: ResourceWarning: unclosed file <_io.TextIOWrapper name='emission/tests/data/modes.json' mode='r' encoding='UTF-8'>
  dataJSON = json.load(open(fileName))
/home/jenkins/workspace/e-mission-server-prb/emission/tests/common.py:61: DeprecationWarning: insert is deprecated. Use insert_one or insert_many instead.
  tableColl.insert(row)
/home/jenkins/workspace/e-mission-server-prb/emission/tests/common.py:59: ResourceWarning: unclosed file <_io.TextIOWrapper name='emission/tests/data/testModeInferSeedFile' mode='r' encoding='UTF-8'>
  dataJSON = json.load(open(fileName))
/home/jenkins/workspace/e-mission-server-prb/emission/tests/analysisTests/modeinferTests/TestPipelineSeed.py:62: DeprecationWarning: save is deprecated. Use insert_one or replace_one instead
  self.SectionsColl.save(section)
./home/jenkins/workspace/e-mission-server-prb/emission/tests/common.py:59: ResourceWarning: unclosed file <_io.TextIOWrapper name='emission/tests/data/modes.json' mode='r' encoding='UTF-8'>
  dataJSON = json.load(open(fileName))
/home/jenkins/workspace/e-mission-server-prb/emission/tests/common.py:61: DeprecationWarning: insert is deprecated. Use insert_one or insert_many instead.
  tableColl.insert(row)
/home/jenkins/workspace/e-mission-server-prb/emission/tests/common.py:59: ResourceWarning: unclosed file <_io.TextIOWrapper name='emission/tests/data/testModeInferSeedFile' mode='r' encoding='UTF-8'>
  dataJSON = json.load(open(fileName))
/home/jenkins/workspace/e-mission-server-prb/emission/tests/analysisTests/modeinferTests/TestPipelineSeed.py:62: DeprecationWarning: save is deprecated. Use insert_one or replace_one instead
  self.SectionsColl.save(section)
/home/jenkins/workspace/e-mission-server-prb/emission/tests/analysisTests/modeinferTests/TestPipelineSeed.py:133: DeprecationWarning: insert is deprecated. Use insert_one or insert_many instead.
  self.SectionsColl.insert(runSec)
/home/jenkins/workspace/e-mission-server-prb/emission/tests/analysisTests/modeinferTests/TestPipelineSeed.py:140: DeprecationWarning: insert is deprecated. Use insert_one or insert_many instead.
  self.SectionsColl.insert(longTripSec)
/home/jenkins/workspace/e-mission-server-prb/emission/tests/analysisTests/modeinferTests/TestPipelineSeed.py:146: DeprecationWarning: insert is deprecated. Use insert_one or insert_many instead.
  self.SectionsColl.insert(unknownTripSec)
/tmp/tmp.jDNX00hyf1/lib/python3.6/site-packages/jsonpickle/ext/numpy.py:245: UserWarning: ndarray is defined by reference to an object we do not know how to serialize. A deep copy is serialized instead, breaking memory aliasing.
  warnings.warn(msg)
/home/jenkins/workspace/e-mission-server-prb/emission/tests/analysisTests/modeinferTests/TestPipelineSeed.py:182: ResourceWarning: unclosed file <_io.TextIOWrapper name='seed_model.json' mode='r' encoding='UTF-8'>
  self.pipeline.model = pipeline.ModeInferencePipelineMovesFormat.loadModel()
./home/jenkins/workspace/e-mission-server-prb/emission/tests/common.py:59: ResourceWarning: unclosed file <_io.TextIOWrapper name='emission/tests/data/modes.json' mode='r' encoding='UTF-8'>
  dataJSON = json.load(open(fileName))
/home/jenkins/workspace/e-mission-server-prb/emission/tests/common.py:61: DeprecationWarning: insert is deprecated. Use insert_one or insert_many instead.
  tableColl.insert(row)
/home/jenkins/workspace/e-mission-server-prb/emission/tests/common.py:59: ResourceWarning: unclosed file <_io.TextIOWrapper name='emission/tests/data/testModeInferSeedFile' mode='r' encoding='UTF-8'>
  dataJSON = json.load(open(fileName))
/home/jenkins/workspace/e-mission-server-prb/emission/tests/analysisTests/modeinferTests/TestPipelineSeed.py:62: DeprecationWarning: save is deprecated. Use insert_one or replace_one instead
  self.SectionsColl.save(section)
./home/jenkins/workspace/e-mission-server-prb/emission/tests/analysisTests/modeinferTests/TestPipelineSeed.py:133: DeprecationWarning: insert is deprecated. Use insert_one or insert_many instead.
  self.SectionsColl.insert(runSec)
/home/jenkins/workspace/e-mission-server-prb/emission/tests/analysisTests/modeinferTests/TestPipelineSeed.py:140: DeprecationWarning: insert is deprecated. Use insert_one or insert_many instead.
  self.SectionsColl.insert(longTripSec)
/home/jenkins/workspace/e-mission-server-prb/emission/tests/analysisTests/modeinferTests/TestPipelineSeed.py:146: DeprecationWarning: insert is deprecated. Use insert_one or insert_many instead.
  self.SectionsColl.insert(unknownTripSec)
/tmp/tmp.jDNX00hyf1/lib/python3.6/site-packages/jsonpickle/ext/numpy.py:245: UserWarning: ndarray is defined by reference to an object we do not know how to serialize. A deep copy is serialized instead, breaking memory aliasing.
  warnings.warn(msg)
./home/jenkins/workspace/e-mission-server-prb/emission/tests/common.py:59: ResourceWarning: unclosed file <_io.TextIOWrapper name='emission/tests/data/modes.json' mode='r' encoding='UTF-8'>
  dataJSON = json.load(open(fileName))
/home/jenkins/workspace/e-mission-server-prb/emission/tests/common.py:61: DeprecationWarning: insert is deprecated. Use insert_one or insert_many instead.
  tableColl.insert(row)
/home/jenkins/workspace/e-mission-server-prb/emission/tests/common.py:59: ResourceWarning: unclosed file <_io.TextIOWrapper name='emission/tests/data/testModeInferSeedFile' mode='r' encoding='UTF-8'>
  dataJSON = json.load(open(fileName))
/home/jenkins/workspace/e-mission-server-prb/emission/tests/analysisTests/modeinferTests/TestPipelineSeed.py:62: DeprecationWarning: save is deprecated. Use insert_one or replace_one instead
  self.SectionsColl.save(section)
/home/jenkins/workspace/e-mission-server-prb/emission/tests/analysisTests/modeinferTests/TestPipelineSeed.py:133: DeprecationWarning: insert is deprecated. Use insert_one or insert_many instead.
  self.SectionsColl.insert(runSec)
/home/jenkins/workspace/e-mission-server-prb/emission/tests/analysisTests/modeinferTests/TestPipelineSeed.py:140: DeprecationWarning: insert is deprecated. Use insert_one or insert_many instead.
  self.SectionsColl.insert(longTripSec)
/home/jenkins/workspace/e-mission-server-prb/emission/tests/analysisTests/modeinferTests/TestPipelineSeed.py:146: DeprecationWarning: insert is deprecated. Use insert_one or insert_many instead.
  self.SectionsColl.insert(unknownTripSec)
./home/jenkins/workspace/e-mission-server-prb/emission/core/get_database.py:268: DeprecationWarning: save is deprecated. Use insert_one or replace_one instead
  db.save(entry)
/tmp/tmp.jDNX00hyf1/lib/python3.6/site-packages/pandas/core/frame.py:891: UserWarning: DataFrame columns are not unique, some columns will be omitted.
  "columns will be omitted.", UserWarning)
/home/jenkins/workspace/e-mission-server-prb/emission/tests/analysisTests/plottingTests/TestGeojsonFeatureConverter.py:59: DeprecationWarning: Please use assertEqual instead.
  self.assertEquals(len(tl.trips), 9)
/home/jenkins/workspace/e-mission-server-prb/emission/analysis/classification/inference/mode/pipeline.py:101: ResourceWarning: unclosed file <_io.TextIOWrapper name='seed_model.json' mode='r' encoding='UTF-8'>
  self.model = seedp.ModeInferencePipelineMovesFormat.loadModel()
./home/jenkins/workspace/e-mission-server-prb/emission/tests/analysisTests/resultTests/TestTimeGrouping.py:47: DeprecationWarning: remove is deprecated. Use delete_one or delete_many instead.
  edb.get_analysis_timeseries_db().remove({'user_id': self.testUUID})
........./home/jenkins/workspace/e-mission-server-prb/emission/tests/coreTests/TestBase.py:64: DeprecationWarning: Please use assertEqual instead.
  self.assertEquals(test_tw.valid, TestEnum.B)
../home/jenkins/workspace/e-mission-server-prb/emission/tests/coreTests/TestBase.py:124: DeprecationWarning: Please use assertRaisesRegex instead.
  with self.assertRaisesRegexp(AttributeError, ".*read-only.*"):
............./home/jenkins/workspace/e-mission-server-prb/emission/tests/coreTests/TestEntry.py:74: DeprecationWarning: Please use assertEqual instead.
  self.assertEquals(entry.metadata.key, 'background/motion_activity')
.../home/jenkins/workspace/e-mission-server-prb/emission/tests/common.py:59: ResourceWarning: unclosed file <_io.TextIOWrapper name='emission/tests/data/modes.json' mode='r' encoding='UTF-8'>
  dataJSON = json.load(open(fileName))
/home/jenkins/workspace/e-mission-server-prb/emission/tests/common.py:61: DeprecationWarning: insert is deprecated. Use insert_one or insert_many instead.
  tableColl.insert(row)
/home/jenkins/workspace/e-mission-server-prb/emission/core/wrapper/client.py:58: ResourceWarning: unclosed file <_io.TextIOWrapper name='conf/clients/testclient.settings.json' mode='r' encoding='UTF-8'>
  newEntry = json.load(open(self.settings_filename))
/home/jenkins/workspace/e-mission-server-prb/emission/core/wrapper/client.py:53: DeprecationWarning: update is deprecated. Use replace_one, update_one or update_many instead.
  get_client_db().update({'name': self.clientName}, newEntry, upsert = True)
../home/jenkins/workspace/e-mission-server-prb/emission/core/wrapper/client.py:58: ResourceWarning: unclosed file <_io.TextIOWrapper name='emission/tests/coreTests/wrapperTests/testclient/testclient_settings_update.json' mode='r' encoding='UTF-8'>
  newEntry = json.load(open(self.settings_filename))
./home/jenkins/workspace/e-mission-server-prb/emission/core/wrapper/user.py:108: DeprecationWarning: update is deprecated. Use replace_one, update_one or update_many instead.
  get_profile_db().update({'user_id': self.uuid}, {'$set': {'update_ts': newTs}})
./home/jenkins/workspace/e-mission-server-prb/emission/tests/coreTests/wrapperTests/TestUser.py:40: DeprecationWarning: Please use assertEqual instead.
  self.assertEquals(user.getAvgMpg(), 42)
../home/jenkins/workspace/e-mission-server-prb/emission/tests/coreTests/wrapperTests/TestUser.py:72: DeprecationWarning: Please use assertRegex instead.
  self.assertRegexpMatches(user.getSettings()['result_url'], ".*/compare")
....../home/jenkins/workspace/e-mission-server-prb/emission/tests/netTests/TestAuthSelection.py:31: ResourceWarning: unclosed file <_io.TextIOWrapper name='conf/net/auth/token_list.json' mode='w' encoding='UTF-8'>
  etc.setupTokenListAuth(self)
/home/jenkins/workspace/e-mission-server-prb/emission/tests/netTests/TestAuthSelection.py:31: ResourceWarning: unclosed file <_io.TextIOWrapper name='conf/net/auth/token_list' mode='w' encoding='UTF-8'>
  etc.setupTokenListAuth(self)
/home/jenkins/workspace/e-mission-server-prb/emission/tests/netTests/TestAuthSelection.py:39: ResourceWarning: unclosed file <_io.TextIOWrapper name='conf/net/auth/openid_auth.json' mode='w' encoding='UTF-8'>
  "clientID": "123456"
/home/jenkins/workspace/e-mission-server-prb/emission/net/auth/token_list.py:19: ResourceWarning: unclosed file <_io.TextIOWrapper name='conf/net/auth/token_list' mode='r' encoding='UTF-8'>
  raw_token_list = open(self.token_list_file).readlines()
/home/jenkins/workspace/e-mission-server-prb/emission/net/auth/auth.py:30: ResourceWarning: unclosed file <_io.TextIOWrapper name='conf/net/auth/token_list.json' mode='r' encoding='UTF-8'>
  return enat.TokenListMethod()
......./home/jenkins/workspace/e-mission-server-prb/emission/net/api/usercache.py:56: DeprecationWarning: update is deprecated. Use replace_one, update_one or update_many instead.
  upsert=True)
/home/jenkins/workspace/e-mission-server-prb/emission/net/usercache/builtin_usercache.py:154: DeprecationWarning: remove is deprecated. Use delete_one or delete_many instead.
  del_result = self.db.remove(del_query)
./home/jenkins/workspace/e-mission-server-prb/emission/net/usercache/builtin_usercache.py:106: DeprecationWarning: update is deprecated. Use replace_one, update_one or update_many instead.
  upsert=True)
/home/jenkins/workspace/e-mission-server-prb/emission/net/usercache/builtin_usercache.py:180: DeprecationWarning: remove is deprecated. Use delete_one or delete_many instead.
  result = self.db.remove(queryDoc)
..../home/jenkins/workspace/e-mission-server-prb/emission/tests/netTests/TestBuiltinUserCache.py:374: DeprecationWarning: Please use assertEqual instead.
  self.assertEquals(uuid_list, [self.testUserUUID])
..../home/jenkins/workspace/e-mission-server-prb/emission/tests/netTests/TestBuiltinUserCacheHandlerInput.py:41: ResourceWarning: unclosed file <_io.TextIOWrapper name='emission/tests/data/netTests/android.activity.txt' mode='r' encoding='UTF-8'>
  self.activity_entry = json.load(open("emission/tests/data/netTests/android.activity.txt"))
/home/jenkins/workspace/e-mission-server-prb/emission/tests/netTests/TestBuiltinUserCacheHandlerInput.py:42: ResourceWarning: unclosed file <_io.TextIOWrapper name='emission/tests/data/netTests/android.location.raw.txt' mode='r' encoding='UTF-8'>
  self.location_entry = json.load(open("emission/tests/data/netTests/android.location.raw.txt"))
/home/jenkins/workspace/e-mission-server-prb/emission/tests/netTests/TestBuiltinUserCacheHandlerInput.py:43: ResourceWarning: unclosed file <_io.TextIOWrapper name='emission/tests/data/netTests/android.transition.txt' mode='r' encoding='UTF-8'>
  self.transition_entry = json.load(open("emission/tests/data/netTests/android.transition.txt"))
/home/jenkins/workspace/e-mission-server-prb/emission/tests/netTests/TestBuiltinUserCacheHandlerInput.py:70: ResourceWarning: unclosed file <_io.TextIOWrapper name='emission/tests/data/netTests/ios.activity.txt' mode='r' encoding='UTF-8'>
  self.ios_activity_entry = json.load(open("emission/tests/data/netTests/ios.activity.txt"))
/home/jenkins/workspace/e-mission-server-prb/emission/tests/netTests/TestBuiltinUserCacheHandlerInput.py:71: ResourceWarning: unclosed file <_io.TextIOWrapper name='emission/tests/data/netTests/ios.location.txt' mode='r' encoding='UTF-8'>
  self.ios_location_entry = json.load(open("emission/tests/data/netTests/ios.location.txt"))
/home/jenkins/workspace/e-mission-server-prb/emission/tests/netTests/TestBuiltinUserCacheHandlerInput.py:72: ResourceWarning: unclosed file <_io.TextIOWrapper name='emission/tests/data/netTests/ios.transition.txt' mode='r' encoding='UTF-8'>
  self.ios_transition_entry = json.load(open("emission/tests/data/netTests/ios.transition.txt"))
/home/jenkins/workspace/e-mission-server-prb/emission/tests/netTests/TestBuiltinUserCacheHandlerInput.py:182: DeprecationWarning: insert is deprecated. Use insert_one or insert_many instead.
  edb.get_usercache_db().insert(entries_before_move)
/home/jenkins/workspace/e-mission-server-prb/emission/tests/netTests/TestBuiltinUserCacheHandlerInput.py:189: DeprecationWarning: update is deprecated. Use replace_one, update_one or update_many instead.
  multi=True)
/home/jenkins/workspace/e-mission-server-prb/emission/tests/netTests/TestBuiltinUserCacheHandlerInput.py:196: DeprecationWarning: remove is deprecated. Use delete_one or delete_many instead.
  edb.get_pipeline_state_db().remove({"user_id": self.testUserUUID1})
/home/jenkins/workspace/e-mission-server-prb/emission/tests/netTests/TestBuiltinUserCacheHandlerInput.py:85: DeprecationWarning: remove is deprecated. Use delete_one or delete_many instead.
  edb.get_usercache_db().remove({"user_id": self.testUserUUID1})
/home/jenkins/workspace/e-mission-server-prb/emission/tests/netTests/TestBuiltinUserCacheHandlerInput.py:86: DeprecationWarning: remove is deprecated. Use delete_one or delete_many instead.
  edb.get_usercache_db().remove({"user_id": self.testUserUUID2})
/home/jenkins/workspace/e-mission-server-prb/emission/tests/netTests/TestBuiltinUserCacheHandlerInput.py:87: DeprecationWarning: remove is deprecated. Use delete_one or delete_many instead.
  edb.get_usercache_db().remove({"user_id": self.testUserUUIDios})
../home/jenkins/workspace/e-mission-server-prb/emission/tests/netTests/TestBuiltinUserCacheHandlerInput.py:152: DeprecationWarning: insert is deprecated. Use insert_one or insert_many instead.
  'type': u'message'}})
WARNING:root:Got error None while saving entry AttrDict({'_id': ObjectId('572d3621d282b8f30def7e85'), 'user_id': UUID('d4dc4cc0-9985-4970-b27b-7c2f725aef11'), 'data': {'transition': None, 'currState': 'STATE_ONGOING_TRIP'}, 'metadata': {'plugin': 'none', 'write_ts': 1557734684, 'time_zone': 'America/Los_Angeles', 'platform': 'ios', 'key': 'statemachine/transition', 'read_ts': 1557734682, 'type': 'message'}}) -> None
/home/jenkins/workspace/e-mission-server-prb/emission/storage/timeseries/builtin_timeseries.py:373: DeprecationWarning: insert is deprecated. Use insert_one or insert_many instead.
  edb.get_timeseries_error_db().insert(entry)
../home/jenkins/workspace/e-mission-server-prb/emission/tests/netTests/TestBuiltinUserCacheHandlerOutput.py:42: ResourceWarning: unclosed file <_io.TextIOWrapper name='emission/tests/data/netTests/android.activity.txt' mode='r' encoding='UTF-8'>
  self.activity_entry = json.load(open("emission/tests/data/netTests/android.activity.txt"))
/home/jenkins/workspace/e-mission-server-prb/emission/tests/netTests/TestBuiltinUserCacheHandlerOutput.py:43: ResourceWarning: unclosed file <_io.TextIOWrapper name='emission/tests/data/netTests/android.location.raw.txt' mode='r' encoding='UTF-8'>
  self.location_entry = json.load(open("emission/tests/data/netTests/android.location.raw.txt"))
/home/jenkins/workspace/e-mission-server-prb/emission/tests/netTests/TestBuiltinUserCacheHandlerOutput.py:44: ResourceWarning: unclosed file <_io.TextIOWrapper name='emission/tests/data/netTests/android.transition.txt' mode='r' encoding='UTF-8'>
  self.transition_entry = json.load(open("emission/tests/data/netTests/android.transition.txt"))
/home/jenkins/workspace/e-mission-server-prb/emission/tests/netTests/TestBuiltinUserCacheHandlerOutput.py:71: ResourceWarning: unclosed file <_io.TextIOWrapper name='emission/tests/data/netTests/ios.activity.txt' mode='r' encoding='UTF-8'>
  self.ios_activity_entry = json.load(open("emission/tests/data/netTests/ios.activity.txt"))
/home/jenkins/workspace/e-mission-server-prb/emission/tests/netTests/TestBuiltinUserCacheHandlerOutput.py:72: ResourceWarning: unclosed file <_io.TextIOWrapper name='emission/tests/data/netTests/ios.location.txt' mode='r' encoding='UTF-8'>
  self.ios_location_entry = json.load(open("emission/tests/data/netTests/ios.location.txt"))
/home/jenkins/workspace/e-mission-server-prb/emission/tests/netTests/TestBuiltinUserCacheHandlerOutput.py:73: ResourceWarning: unclosed file <_io.TextIOWrapper name='emission/tests/data/netTests/ios.transition.txt' mode='r' encoding='UTF-8'>
  self.ios_transition_entry = json.load(open("emission/tests/data/netTests/ios.transition.txt"))
...../home/jenkins/workspace/e-mission-server-prb/emission/tests/netTests/TestFormatters.py:37: ResourceWarning: unclosed file <_io.TextIOWrapper name='emission/tests/data/netTests/android.location.raw.txt' mode='r' encoding='UTF-8'>
  entry = json.load(open("emission/tests/data/netTests/android.location.raw.txt"))
/home/jenkins/workspace/e-mission-server-prb/emission/tests/netTests/TestFormatters.py:39: DeprecationWarning: Please use assertEqual instead.
  self.assertEquals(formatted_entry.data.accuracy, 52.5)
./home/jenkins/workspace/e-mission-server-prb/emission/tests/netTests/TestFormatters.py:96: ResourceWarning: unclosed file <_io.TextIOWrapper name='emission/tests/data/netTests/ios.location.txt' mode='r' encoding='UTF-8'>
  entry = json.load(open("emission/tests/data/netTests/ios.location.txt"))
./home/jenkins/workspace/e-mission-server-prb/emission/tests/netTests/TestFormatters.py:28: ResourceWarning: unclosed file <_io.TextIOWrapper name='emission/tests/data/netTests/android.activity.txt' mode='r' encoding='UTF-8'>
  entry = json.load(open("emission/tests/data/netTests/android.activity.txt"))
./home/jenkins/workspace/e-mission-server-prb/emission/tests/netTests/TestFormatters.py:88: ResourceWarning: unclosed file <_io.TextIOWrapper name='emission/tests/data/netTests/ios.activity.txt' mode='r' encoding='UTF-8'>
  entry = json.load(open("emission/tests/data/netTests/ios.activity.txt"))
./home/jenkins/workspace/e-mission-server-prb/emission/tests/netTests/TestFormatters.py:49: ResourceWarning: unclosed file <_io.TextIOWrapper name='emission/tests/data/netTests/android.transition.txt' mode='r' encoding='UTF-8'>
  entry = json.load(open("emission/tests/data/netTests/android.transition.txt"))
./home/jenkins/workspace/e-mission-server-prb/emission/tests/netTests/TestFormatters.py:108: ResourceWarning: unclosed file <_io.TextIOWrapper name='emission/tests/data/netTests/ios.transition.txt' mode='r' encoding='UTF-8'>
  entry = json.load(open("emission/tests/data/netTests/ios.transition.txt"))
./home/jenkins/workspace/e-mission-server-prb/emission/tests/netTests/TestFormatters.py:82: ResourceWarning: unclosed file <_io.TextIOWrapper name='emission/tests/data/netTests/ios.activity.none.txt' mode='r' encoding='UTF-8'>
  entry = json.load(open("emission/tests/data/netTests/ios.activity.none.txt"))
./home/jenkins/workspace/e-mission-server-prb/emission/tests/netTests/TestFormatters.py:58: ResourceWarning: unclosed file <_io.TextIOWrapper name='emission/tests/data/netTests/ios.activity.txt' mode='r' encoding='UTF-8'>
  entry = json.load(open("emission/tests/data/netTests/ios.activity.txt"))
./home/jenkins/workspace/e-mission-server-prb/emission/tests/netTests/TestFormatters.py:65: ResourceWarning: unclosed file <_io.TextIOWrapper name='emission/tests/data/netTests/ios.activity.txt' mode='r' encoding='UTF-8'>
  entry = json.load(open("emission/tests/data/netTests/ios.activity.txt"))
./home/jenkins/workspace/e-mission-server-prb/emission/tests/netTests/TestFormatters.py:73: ResourceWarning: unclosed file <_io.TextIOWrapper name='emission/tests/data/netTests/ios.activity.txt' mode='r' encoding='UTF-8'>
  entry = json.load(open("emission/tests/data/netTests/ios.activity.txt"))
/home/jenkins/workspace/e-mission-server-prb/emission/tests/netTests/TestFormatters.py:76: DeprecationWarning: Please use assertRaisesRegex instead.
  with self.assertRaisesRegexp(RuntimeError, ".*two modes.*"):
./home/jenkins/workspace/e-mission-server-prb/emission/net/ext_service/habitica/proxy.py:91: DeprecationWarning: insert is deprecated. Use insert_one or insert_many instead.
  habitica_user_table.insert(insert_doc)
/home/jenkins/workspace/e-mission-server-prb/emission/tests/netTests/TestHabiticaAutocheck.py:57: DeprecationWarning: remove is deprecated. Use delete_one or delete_many instead.
  edb.get_analysis_timeseries_db().remove({'user_id': self.testUUID})
/home/jenkins/workspace/e-mission-server-prb/emission/tests/netTests/TestHabiticaAutocheck.py:61: DeprecationWarning: remove is deprecated. Use delete_one or delete_many instead.
  edb.get_habitica_db().remove({'user_id': self.testUUID})
.../home/jenkins/workspace/e-mission-server-prb/emission/tests/netTests/TestHabiticaRegister.py:37: DeprecationWarning: remove is deprecated. Use delete_one or delete_many instead.
  edb.get_habitica_db().remove({'user_id': self.testUserUUID})
../home/jenkins/workspace/e-mission-server-prb/emission/tests/netTests/TestHabiticaRegister.py:86: DeprecationWarning: remove is deprecated. Use delete_one or delete_many instead.
  edb.get_habitica_db().remove({'user_id': inviterUUID})
../home/jenkins/workspace/e-mission-server-prb/emission/analysis/config.py:18: ResourceWarning: unclosed file <_io.TextIOWrapper name='conf/analysis/debug.conf.json' mode='r' encoding='UTF-8'>
  config_data = get_config_data()
ERROR:root:Error while inferring modes, timestamp is unchanged
Traceback (most recent call last):
  File "/home/jenkins/workspace/e-mission-server-prb/emission/analysis/classification/inference/mode/pipeline.py", line 41, in predict_mode
    mip.runPredictionPipeline(user_id, time_query)
  File "/home/jenkins/workspace/e-mission-server-prb/emission/analysis/classification/inference/mode/pipeline.py", line 84, in runPredictionPipeline
    self.loadModelStage()
  File "/home/jenkins/workspace/e-mission-server-prb/emission/analysis/classification/inference/mode/pipeline.py", line 101, in loadModelStage
    self.model = seedp.ModeInferencePipelineMovesFormat.loadModel()
  File "/home/jenkins/workspace/e-mission-server-prb/emission/analysis/classification/inference/mode/seed/pipeline.py", line 93, in loadModel
    fd = open(SAVED_MODEL_FILENAME, "r")
FileNotFoundError: [Errno 2] No such file or directory: 'seed_model.json'
ERROR:root:Error while inferring modes, timestamp is unchanged
Traceback (most recent call last):
  File "/home/jenkins/workspace/e-mission-server-prb/emission/analysis/classification/inference/mode/pipeline.py", line 41, in predict_mode
    mip.runPredictionPipeline(user_id, time_query)
  File "/home/jenkins/workspace/e-mission-server-prb/emission/analysis/classification/inference/mode/pipeline.py", line 84, in runPredictionPipeline
    self.loadModelStage()
  File "/home/jenkins/workspace/e-mission-server-prb/emission/analysis/classification/inference/mode/pipeline.py", line 101, in loadModelStage
    self.model = seedp.ModeInferencePipelineMovesFormat.loadModel()
  File "/home/jenkins/workspace/e-mission-server-prb/emission/analysis/classification/inference/mode/seed/pipeline.py", line 93, in loadModel
    fd = open(SAVED_MODEL_FILENAME, "r")
FileNotFoundError: [Errno 2] No such file or directory: 'seed_model.json'
FERROR:root:Error while inferring modes, timestamp is unchanged
Traceback (most recent call last):
  File "/home/jenkins/workspace/e-mission-server-prb/emission/analysis/classification/inference/mode/pipeline.py", line 41, in predict_mode
    mip.runPredictionPipeline(user_id, time_query)
  File "/home/jenkins/workspace/e-mission-server-prb/emission/analysis/classification/inference/mode/pipeline.py", line 84, in runPredictionPipeline
    self.loadModelStage()
  File "/home/jenkins/workspace/e-mission-server-prb/emission/analysis/classification/inference/mode/pipeline.py", line 101, in loadModelStage
    self.model = seedp.ModeInferencePipelineMovesFormat.loadModel()
  File "/home/jenkins/workspace/e-mission-server-prb/emission/analysis/classification/inference/mode/seed/pipeline.py", line 93, in loadModel
    fd = open(SAVED_MODEL_FILENAME, "r")
FileNotFoundError: [Errno 2] No such file or directory: 'seed_model.json'
ERROR:root:Error while inferring modes, timestamp is unchanged
Traceback (most recent call last):
  File "/home/jenkins/workspace/e-mission-server-prb/emission/analysis/classification/inference/mode/pipeline.py", line 41, in predict_mode
    mip.runPredictionPipeline(user_id, time_query)
  File "/home/jenkins/workspace/e-mission-server-prb/emission/analysis/classification/inference/mode/pipeline.py", line 84, in runPredictionPipeline
    self.loadModelStage()
  File "/home/jenkins/workspace/e-mission-server-prb/emission/analysis/classification/inference/mode/pipeline.py", line 101, in loadModelStage
    self.model = seedp.ModeInferencePipelineMovesFormat.loadModel()
  File "/home/jenkins/workspace/e-mission-server-prb/emission/analysis/classification/inference/mode/seed/pipeline.py", line 93, in loadModel
    fd = open(SAVED_MODEL_FILENAME, "r")
FileNotFoundError: [Errno 2] No such file or directory: 'seed_model.json'
.ERROR:root:Error while inferring modes, timestamp is unchanged
Traceback (most recent call last):
  File "/home/jenkins/workspace/e-mission-server-prb/emission/analysis/classification/inference/mode/pipeline.py", line 41, in predict_mode
    mip.runPredictionPipeline(user_id, time_query)
  File "/home/jenkins/workspace/e-mission-server-prb/emission/analysis/classification/inference/mode/pipeline.py", line 84, in runPredictionPipeline
    self.loadModelStage()
  File "/home/jenkins/workspace/e-mission-server-prb/emission/analysis/classification/inference/mode/pipeline.py", line 101, in loadModelStage
    self.model = seedp.ModeInferencePipelineMovesFormat.loadModel()
  File "/home/jenkins/workspace/e-mission-server-prb/emission/analysis/classification/inference/mode/seed/pipeline.py", line 93, in loadModel
    fd = open(SAVED_MODEL_FILENAME, "r")
FileNotFoundError: [Errno 2] No such file or directory: 'seed_model.json'
ERROR:root:Error while inferring modes, timestamp is unchanged
Traceback (most recent call last):
  File "/home/jenkins/workspace/e-mission-server-prb/emission/analysis/classification/inference/mode/pipeline.py", line 41, in predict_mode
    mip.runPredictionPipeline(user_id, time_query)
  File "/home/jenkins/workspace/e-mission-server-prb/emission/analysis/classification/inference/mode/pipeline.py", line 84, in runPredictionPipeline
    self.loadModelStage()
  File "/home/jenkins/workspace/e-mission-server-prb/emission/analysis/classification/inference/mode/pipeline.py", line 101, in loadModelStage
    self.model = seedp.ModeInferencePipelineMovesFormat.loadModel()
  File "/home/jenkins/workspace/e-mission-server-prb/emission/analysis/classification/inference/mode/seed/pipeline.py", line 93, in loadModel
    fd = open(SAVED_MODEL_FILENAME, "r")
FileNotFoundError: [Errno 2] No such file or directory: 'seed_model.json'
F/home/jenkins/workspace/e-mission-server-prb/emission/net/ext_service/push/notify_interface_impl/firebase.py:84: DeprecationWarning: insert is deprecated. Use insert_one or insert_many instead.
  "mapped_token": result["registration_token"]})
WARNING:root:Got error {'status': 'no_matching_token', 'apns_token': 'device_token_ios_1'} while mapping iOS token at index 5
WARNING:root:Got error {'status': 'no_matching_token', 'apns_token': 'device_token_ios_3'} while mapping iOS token at index 6
WARNING:root:Got error {'status': 'no_matching_token', 'apns_token': 'device_token_ios_5'} while mapping iOS token at index 7
WARNING:root:Got error {'status': 'no_matching_token', 'apns_token': 'device_token_ios_7'} while mapping iOS token at index 8
WARNING:root:Got error {'status': 'no_matching_token', 'apns_token': 'device_token_ios_9'} while mapping iOS token at index 9
WARNING:root:Got error {'status': 'no_matching_token', 'apns_token': 'device_token_ios_3'} while mapping iOS token at index 3
WARNING:root:Got error {'status': 'no_matching_token', 'apns_token': 'device_token_ios_7'} while mapping iOS token at index 4
....ERROR:root:Error while inferring modes, timestamp is unchanged
Traceback (most recent call last):
  File "/home/jenkins/workspace/e-mission-server-prb/emission/analysis/classification/inference/mode/pipeline.py", line 41, in predict_mode
    mip.runPredictionPipeline(user_id, time_query)
  File "/home/jenkins/workspace/e-mission-server-prb/emission/analysis/classification/inference/mode/pipeline.py", line 84, in runPredictionPipeline
    self.loadModelStage()
  File "/home/jenkins/workspace/e-mission-server-prb/emission/analysis/classification/inference/mode/pipeline.py", line 101, in loadModelStage
    self.model = seedp.ModeInferencePipelineMovesFormat.loadModel()
  File "/home/jenkins/workspace/e-mission-server-prb/emission/analysis/classification/inference/mode/seed/pipeline.py", line 93, in loadModel
    fd = open(SAVED_MODEL_FILENAME, "r")
FileNotFoundError: [Errno 2] No such file or directory: 'seed_model.json'
/home/jenkins/workspace/e-mission-server-prb/emission/tests/netTests/TestVisualize.py:57: DeprecationWarning: remove is deprecated. Use delete_one or delete_many instead.
  edb.get_timeseries_db().remove({"user_id": self.testUUID})
/home/jenkins/workspace/e-mission-server-prb/emission/tests/netTests/TestVisualize.py:58: DeprecationWarning: remove is deprecated. Use delete_one or delete_many instead.
  edb.get_analysis_timeseries_db().remove({"user_id": self.testUUID})
.ERROR:root:Error while inferring modes, timestamp is unchanged
Traceback (most recent call last):
  File "/home/jenkins/workspace/e-mission-server-prb/emission/analysis/classification/inference/mode/pipeline.py", line 41, in predict_mode
    mip.runPredictionPipeline(user_id, time_query)
  File "/home/jenkins/workspace/e-mission-server-prb/emission/analysis/classification/inference/mode/pipeline.py", line 84, in runPredictionPipeline
    self.loadModelStage()
  File "/home/jenkins/workspace/e-mission-server-prb/emission/analysis/classification/inference/mode/pipeline.py", line 101, in loadModelStage
    self.model = seedp.ModeInferencePipelineMovesFormat.loadModel()
  File "/home/jenkins/workspace/e-mission-server-prb/emission/analysis/classification/inference/mode/seed/pipeline.py", line 93, in loadModel
    fd = open(SAVED_MODEL_FILENAME, "r")
FileNotFoundError: [Errno 2] No such file or directory: 'seed_model.json'
.ERROR:root:Error while inferring modes, timestamp is unchanged
Traceback (most recent call last):
  File "/home/jenkins/workspace/e-mission-server-prb/emission/analysis/classification/inference/mode/pipeline.py", line 41, in predict_mode
    mip.runPredictionPipeline(user_id, time_query)
  File "/home/jenkins/workspace/e-mission-server-prb/emission/analysis/classification/inference/mode/pipeline.py", line 84, in runPredictionPipeline
    self.loadModelStage()
  File "/home/jenkins/workspace/e-mission-server-prb/emission/analysis/classification/inference/mode/pipeline.py", line 101, in loadModelStage
    self.model = seedp.ModeInferencePipelineMovesFormat.loadModel()
  File "/home/jenkins/workspace/e-mission-server-prb/emission/analysis/classification/inference/mode/seed/pipeline.py", line 93, in loadModel
    fd = open(SAVED_MODEL_FILENAME, "r")
FileNotFoundError: [Errno 2] No such file or directory: 'seed_model.json'
storage not configured, falling back to sample, default configuration
Connecting to database URL localhost
analysis.debug.conf.json not configured, falling back to sample, default configuration
google maps key not configured, falling back to nominatim
nominatim not configured either, place decoding must happen on the client
Setting up real example for 8f2f54bc-f3bf-46ce-8246-7128bb1cfabe
Setting up real example for cf52ff4a-52db-45f7-bdb0-a1d9cd989bcd
Setting up real example for 380051bd-ab54-4243-82dd-acbbb46b672a
Setting up real example for 863a66f8-1c98-4ed4-b3b8-bf337d440afc
Setting up real example for 2f778a04-d849-4f4a-8295-ced64b6798f0
Setting up real example for 9957155c-9a8c-418f-89d9-b293d97fced0
Setting up real example for a2ad9ccd-b649-4264-8a05-ec44f7b262c2
Setting up real example for 521b4726-fea4-4559-9822-4b09a89b7c5a
Setting up real example for b99a39e1-e9ce-4108-84f5-3c72da2d4a57
Setting up real example for bd598dfe-4e9e-4546-87c1-20adb7d20539
Setting up real example for f1572835-025a-4eb9-8526-32953ce9e314
Setting up real example for 9f711a8b-853c-4cac-af7c-1cb3c8637565
Setting up real example for b37460bb-d7a8-49ca-af81-c74bd81ee4aa
Setting up real example for 3a742e66-b860-4cb5-9d46-cc2cc13fa954
Setting up real example for 2de65123-7d94-4dc3-b929-4368c91e8fd9
Setting up real example for 726dda79-6fb1-4f68-82ae-74646f8d5f3f
Setting up real example for 61e91dc7-6662-424e-9529-aeaa4846cb2a
Setting up real example for 109096cf-9fd7-4a58-a3ff-39e3f8c8caae
Setting up real example for b49d15a6-d691-42b1-8b7e-4c6cfc02f7c2
Setting up real example for 5c632f95-6f2e-4c1e-8576-30bbd052e8f6
Setting up real example for 8fcd7c9f-4226-4dcf-9e23-3cfef9c850cf
Setting up real example for 40e91adf-f226-40f7-803e-e6b2777aef4b
Setting up real example for 29204239-e881-4ff6-be2a-4b507e885273
Setting up real example for 08954f89-5855-4142-ac57-189820aeb693
Setting up real example for bfe37644-3eec-4d8b-871c-9a28b039200d
Setting up real example for 2b1bf5af-95db-4687-89b3-ae7c319748f7
Setting up real example for 94ad0f1e-751c-4d33-9f59-1bc07a39ef3c
Setting up real example for 70486728-42f7-4461-b8c4-c2833c297270
Setting up real example for 2f75f4c6-ab0b-445c-8467-25bed14ad577
Setting up real example for defcb7e3-74f3-4d0b-8bf0-fbb719f469e2
Setting up real example for d89c88ef-4d7b-473a-a735-defc3fda0391
Setting up real example for 454e363f-4ba1-45b2-8d16-ed1094f192e3
Setting up real example for be56a053-ec66-42b5-a4d9-dd6eed9b953a
Setting up real example for 1a9edf22-8e34-4795-82b8-1361cf0b6421
Setting up real example for eaa3888e-11c6-49eb-baf3-ab843c8b2797
Setting up real example for 0e99178d-12b7-439f-bfb6-0ab9d63a2a7b
Setting up real example for aea5d969-6038-49f6-a1f2-b88c2d66a140
Setting up real example for 296091b7-e218-429c-a812-f2a487d17e7c
Setting up real example for 7666925d-9a1e-4e5a-a1f7-27881c9e64c2
Setting up real example for b78b8509-102c-41ba-b47d-9ef62be67ed8
Setting up real example for 23c28ce3-eba7-493b-bcf6-40104f6ab202
[ 0.1  0.1]
Setting up real example for fce2e1d5-9f74-4ae3-90d4-cee2f82e1463
Setting up real example for 19eb6c61-3552-4d93-847b-f37e25e6fb06
Setting up real example for 0d410cf4-f354-4f2f-8a08-424388f26995
Setting up real example for 05b9fb7a-48af-4cf1-abce-c794a60764ea
Setting up real example for 61ab065a-823b-48d1-9031-c56d5a89e895
Setting up real example for e1cc9b15-ba99-414d-9ba5-6818e954f036
Setting up real example for fd8a86eb-83cb-4c07-920c-7c19a5ed85e4
Setting up real example for ef84432d-0d90-4a26-9a7f-e3d57bf0d056
Setting up real example for 6da1f8d7-672e-4ed2-8dee-9089c7ff6ffd
collections = ['Stage_user_habitica_access', 'Stage_uuids', 'Stage_Modes', 'Stage_analysis_timeseries', 'Stage_Sections', 'Test_Trips', 'Stage_Profiles', 'Stage_pipeline_state', 'Stage_push_token_mapping', 'Stage_timeseries', 'Stage_usercache']
Dropping collection Stage_user_habitica_access
Dropping collection Stage_uuids
Dropping collection Stage_Modes
Dropping collection Stage_analysis_timeseries
Dropping collection Stage_Sections
Dropping collection Test_Trips
Dropping collection Stage_Profiles
Dropping collection Stage_pipeline_state
Dropping collection Stage_push_token_mapping
Dropping collection Stage_timeseries
Dropping collection Stage_usercache
{'result_url': 'https://e-mission.eecs.berkeley.edu/test/test/test'}
collections = ['Stage_Modes', 'Stage_clients']
Dropping collection Stage_Modes
Dropping collection Stage_clients
collections = ['Stage_Modes']
Dropping collection Stage_Modes
collections = ['Stage_Modes', 'Stage_clients']
Dropping collection Stage_Modes
Dropping collection Stage_clients
collections = ['Stage_uuids', 'Stage_Profiles']
Dropping collection Stage_uuids
Dropping collection Stage_Profiles
Returning total = 126, len = 3, avg = 42
collections = ['Stage_uuids', 'Stage_Profiles']
Dropping collection Stage_uuids
Dropping collection Stage_Profiles
Returning total = 126, len = 3, avg = 42
collections = ['Stage_uuids', 'Stage_Profiles']
Dropping collection Stage_uuids
Dropping collection Stage_Profiles
collections = ['Stage_uuids', 'Stage_Profiles']
Dropping collection Stage_uuids
Dropping collection Stage_Profiles
collections = []
collections = []
collections = ['Stage_uuids', 'Stage_Profiles']
Dropping collection Stage_uuids
Dropping collection Stage_Profiles
collections = ['Stage_uuids', 'Stage_Profiles']
Dropping collection Stage_uuids
Dropping collection Stage_Profiles
collections = ['Stage_uuids', 'Stage_Profiles']
Dropping collection Stage_uuids
Dropping collection Stage_Profiles
collections = ['Stage_usercache']
Dropping collection Stage_usercache
collections = []
collections = ['Stage_usercache']
Dropping collection Stage_usercache
collections = []
collections = ['Stage_usercache']
Dropping collection Stage_usercache
collections = []
collections = ['Stage_usercache']
Dropping collection Stage_usercache
collections = []
collections = ['Stage_usercache']
Dropping collection Stage_usercache
collections = []
collections = ['Stage_usercache']
Dropping collection Stage_usercache
collections = []
collections = ['Stage_usercache']
Dropping collection Stage_usercache
collections = []
collections = ['Stage_usercache']
Dropping collection Stage_usercache
collections = []
collections = ['Stage_usercache']
Dropping collection Stage_usercache
collections = []
collections = ['Stage_pipeline_state', 'Stage_timeseries', 'Stage_usercache']
Dropping collection Stage_pipeline_state
Dropping collection Stage_timeseries
Dropping collection Stage_usercache
collections = ['Stage_pipeline_state', 'Stage_timeseries', 'Stage_usercache']
Dropping collection Stage_pipeline_state
Dropping collection Stage_timeseries
Dropping collection Stage_usercache
collections = ['Stage_timeseries_error', 'Stage_pipeline_state', 'Stage_timeseries', 'Stage_usercache']
Dropping collection Stage_timeseries_error
Dropping collection Stage_pipeline_state
Dropping collection Stage_timeseries
Dropping collection Stage_usercache
collections = ['Stage_pipeline_state', 'Stage_timeseries', 'Stage_usercache']
Dropping collection Stage_pipeline_state
Dropping collection Stage_timeseries
Dropping collection Stage_usercache
collections = ['Stage_usercache']
Dropping collection Stage_usercache
collections = ['Stage_usercache']
Dropping collection Stage_usercache
collections = ['Stage_usercache']
Dropping collection Stage_usercache
collections = ['Stage_usercache']
Dropping collection Stage_usercache
Test setup called
Test setup called
Test setup called
Test setup called
Setting up real example for ae16acf6-19ff-42ef-b3e8-f3b01dae01bd
Setting up real example for 741a4227-cf7b-414c-a030-5583e4a636cd
Setting up real example for d18d8e46-6a6d-4a42-bc5c-468825935f0a
Setting up real example for fd919437-e374-4d6d-97b0-7007a28d2889
Setting up real example for 61a88b34-9c45-4dae-b289-6e78fbc79209
Setting up real example for 42258fb4-80cb-4a42-8b78-c0c3ea90146b
Setting up real example for 75eebc7c-96bc-4870-975d-91bbcec27d73
Setting up real example for aa553c34-e8a4-4e48-b38d-e5eefadf0027
Setting up real example for 4eea54c3-1ff3-4089-8fed-bd1c463b6573
[[-122.0846749, 37.393415], [-122.08367716219298, 37.3948067779213], [-122.08310408579901, 37.3956920043855], [-122.08303055467863, 37.39583125008914], [-122.08297393900254, 37.39593205132939], [-122.08287328402464, 37.39603598782679], [-122.08217139950614, 37.39586915745068], [-122.08121687635078, 37.39662502176472], [-122.08083540229008, 37.397986347667576], [-122.0807141489917, 37.39929928253347], [-122.0805674333962, 37.39999204611759], [-122.08069534712718, 37.39996179457042], [-122.08142813111742, 37.39994239741808], [-122.08307863820072, 37.400177859918735], [-122.08468667951159, 37.40064209653733], [-122.08484181367525, 37.401718181087354], [-122.08479822727575, 37.40260859261417], [-122.08471328637039, 37.403095985737], [-122.0847081, 37.4033491], [-122.0835641, 37.4034802], [-122.08282280273268, 37.40293660127847], [-122.08224288196845, 37.402563610419435], [-122.08081367928679, 37.40224280420781], [-122.07951847863096, 37.40175516150331], [-122.07913567653107, 37.40157647293474], [-122.07878205997541, 37.401486598800304], [-122.07824375563241, 37.400424445146975], [-122.07770984730595, 37.39885544897658], [-122.07695069264065, 37.39806999638753], [-122.076315, 37.3978536], [-122.0775389, 37.3955742], [-122.0775389, 37.3955742], [-122.0778743890013, 37.39585160519531], [-122.07777166147916, 37.39602468480209], [-122.07781936620978, 37.39588375744433], [-122.07774623302022, 37.39567438136265], [-122.0769704624862, 37.39697778728607], [-122.07623392092252, 37.397837993922785], [-122.07671235571091, 37.398075608158834], [-122.07784619592879, 37.39896157228979], [-122.07846320892637, 37.401129825909145], [-122.07865517669589, 37.40156991194349], [-122.07964567295954, 37.40212085562004], [-122.0796973, 37.4021489], [-122.0804791, 37.3959724], [-122.08297204509547, 37.3959456445923], [-122.08297270839385, 37.39598051606153], [-122.0836783940137, 37.39483405888615], [-122.08441549613816, 37.39375391129058], [-122.08488551380876, 37.393052509223544], [-122.08547548499102, 37.3920663815419], [-122.08607344217683, 37.39113822877281], [-122.08622899782469, 37.39095885504853], [-122.08622857893772, 37.39099206421023], [-122.08626055360769, 37.39097112682174], [-122.0862609, 37.3909709]].ERROR:root:Error while inferring modes, timestamp is unchanged
Traceback (most recent call last):
  File "/home/jenkins/workspace/e-mission-server-prb/emission/analysis/classification/inference/mode/pipeline.py", line 41, in predict_mode
    mip.runPredictionPipeline(user_id, time_query)
  File "/home/jenkins/workspace/e-mission-server-prb/emission/analysis/classification/inference/mode/pipeline.py", line 84, in runPredictionPipeline
    self.loadModelStage()
  File "/home/jenkins/workspace/e-mission-server-prb/emission/analysis/classification/inference/mode/pipeline.py", line 101, in loadModelStage
    self.model = seedp.ModeInferencePipelineMovesFormat.loadModel()
  File "/home/jenkins/workspace/e-mission-server-prb/emission/analysis/classification/inference/mode/seed/pipeline.py", line 93, in loadModel
    fd = open(SAVED_MODEL_FILENAME, "r")
FileNotFoundError: [Errno 2] No such file or directory: 'seed_model.json'
./home/jenkins/workspace/e-mission-server-prb/emission/tests/storageTests/TestAnalysisTimeseries.py:31: DeprecationWarning: remove is deprecated. Use delete_one or delete_many instead.
  edb.get_analysis_timeseries_db().remove({'user_id': self.testUserId})
..../home/jenkins/workspace/e-mission-server-prb/emission/tests/storageTests/TestLocalDateQueries.py:37: DeprecationWarning: remove is deprecated. Use delete_one or delete_many instead.
  edb.get_timeseries_db().remove({'user_id': self.testUUID})
/home/jenkins/workspace/e-mission-server-prb/emission/tests/storageTests/TestLocalDateQueries.py:38: DeprecationWarning: remove is deprecated. Use delete_one or delete_many instead.
  edb.get_analysis_timeseries_db().remove({'user_id': self.testUUID})
./home/jenkins/workspace/e-mission-server-prb/emission/tests/storageTests/TestLocalDateQueries.py:108: DeprecationWarning: Please use assertEqual instead.
  self.assertEquals(20, entries_docs.count())
.../home/jenkins/workspace/e-mission-server-prb/emission/tests/storageTests/TestMongoGeoJSONQueries.py:116: DeprecationWarning: insert is deprecated. Use insert_one or insert_many instead.
  self.Sections.insert(test)
/home/jenkins/workspace/e-mission-server-prb/emission/tests/storageTests/TestMongoGeoJSONQueries.py:123: DeprecationWarning: Please use assertEqual instead.
  self.assertEquals(len(retVal), 1)
/home/jenkins/workspace/e-mission-server-prb/emission/tests/storageTests/TestMongoGeoJSONQueries.py:20: DeprecationWarning: remove is deprecated. Use delete_one or delete_many instead.
  get_test_db().remove()
./home/jenkins/workspace/e-mission-server-prb/emission/tests/storageTests/TestMongoGeoJSONQueries.py:131: DeprecationWarning: insert is deprecated. Use insert_one or insert_many instead.
  self.Sections.insert(test)
/home/jenkins/workspace/e-mission-server-prb/emission/tests/storageTests/TestMongoGeoJSONQueries.py:134: DeprecationWarning: insert is deprecated. Use insert_one or insert_many instead.
  self.Sections.insert(library)
/home/jenkins/workspace/e-mission-server-prb/emission/tests/storageTests/TestMongoGeoJSONQueries.py:137: DeprecationWarning: insert is deprecated. Use insert_one or insert_many instead.
  self.Sections.insert(mclaughlin)
/home/jenkins/workspace/e-mission-server-prb/emission/tests/storageTests/TestMongoGeoJSONQueries.py:140: DeprecationWarning: insert is deprecated. Use insert_one or insert_many instead.
  self.Sections.insert(soda)
/home/jenkins/workspace/e-mission-server-prb/emission/tests/storageTests/TestMongoGeoJSONQueries.py:143: DeprecationWarning: insert is deprecated. Use insert_one or insert_many instead.
  self.Sections.insert(wurster)
./home/jenkins/workspace/e-mission-server-prb/emission/tests/storageTests/TestMongoGeoJSONQueries.py:47: DeprecationWarning: insert is deprecated. Use insert_one or insert_many instead.
  self.Sections.insert(sec1)
./home/jenkins/workspace/e-mission-server-prb/emission/tests/storageTests/TestMongoGeoJSONQueries.py:83: DeprecationWarning: insert is deprecated. Use insert_one or insert_many instead.
  self.Sections.insert(sec1)
./home/jenkins/workspace/e-mission-server-prb/emission/tests/storageTests/TestMongoGeoJSONQueries.py:27: DeprecationWarning: insert is deprecated. Use insert_one or insert_many instead.
  self.Sections.insert(post1)
/home/jenkins/workspace/e-mission-server-prb/emission/tests/storageTests/TestMongoGeoJSONQueries.py:32: DeprecationWarning: insert is deprecated. Use insert_one or insert_many instead.
  self.Sections.insert(post2)
..../home/jenkins/workspace/e-mission-server-prb/emission/tests/storageTests/TestPipelineQueries.py:133: DeprecationWarning: Please use assertEqual instead.
  self.assertEquals(new_state.last_ts_run, uc_ts)
../home/jenkins/workspace/e-mission-server-prb/emission/tests/storageTests/TestPlaceQueries.py:29: DeprecationWarning: remove is deprecated. Use delete_one or delete_many instead.
  edb.get_analysis_timeseries_db().remove({'user_id': self.testUserId})
./home/jenkins/workspace/e-mission-server-prb/emission/tests/storageTests/TestSectionQueries.py:30: DeprecationWarning: remove is deprecated. Use delete_one or delete_many instead.
  edb.get_analysis_timeseries_db().remove({'user_id': self.testUserId})
./home/jenkins/workspace/e-mission-server-prb/emission/tests/storageTests/TestStopQueries.py:31: DeprecationWarning: remove is deprecated. Use delete_one or delete_many instead.
  edb.get_analysis_timeseries_db().remove({'user_id': self.testUserId})
./home/jenkins/workspace/e-mission-server-prb/emission/tests/storageTests/TestTimeSeries.py:34: DeprecationWarning: remove is deprecated. Use delete_one or delete_many instead.
  edb.get_timeseries_db().remove({"user_id": self.testUUID})
......./home/jenkins/workspace/e-mission-server-prb/emission/tests/storageTests/TestTimeline.py:50: DeprecationWarning: remove is deprecated. Use delete_one or delete_many instead.
  edb.get_timeseries_db().remove({"user_id": self.testUUID})
/home/jenkins/workspace/e-mission-server-prb/emission/tests/storageTests/TestTimeline.py:51: DeprecationWarning: remove is deprecated. Use delete_one or delete_many instead.
  edb.get_analysis_timeseries_db().remove({"user_id": self.testUUID})
.........ERROR:root:Error while inferring modes, timestamp is unchanged
Traceback (most recent call last):
  File "/home/jenkins/workspace/e-mission-server-prb/emission/analysis/classification/inference/mode/pipeline.py", line 41, in predict_mode
    mip.runPredictionPipeline(user_id, time_query)
  File "/home/jenkins/workspace/e-mission-server-prb/emission/analysis/classification/inference/mode/pipeline.py", line 84, in runPredictionPipeline
    self.loadModelStage()
  File "/home/jenkins/workspace/e-mission-server-prb/emission/analysis/classification/inference/mode/pipeline.py", line 101, in loadModelStage
    self.model = seedp.ModeInferencePipelineMovesFormat.loadModel()
  File "/home/jenkins/workspace/e-mission-server-prb/emission/analysis/classification/inference/mode/seed/pipeline.py", line 93, in loadModel
    fd = open(SAVED_MODEL_FILENAME, "r")
FileNotFoundError: [Errno 2] No such file or directory: 'seed_model.json'
/home/jenkins/workspace/e-mission-server-prb/emission/tests/storageTests/TestTripQueries.py:164: ResourceWarning: unclosed file <_io.TextIOWrapper name='emission/tests/data/real_examples/shankari_single_positional_indexer.dec-12.mode_confirm' mode='r' encoding='UTF-8'>
  object_hook=bju.object_hook)
/home/jenkins/workspace/e-mission-server-prb/emission/tests/storageTests/TestTripQueries.py:168: ResourceWarning: unclosed file <_io.TextIOWrapper name='emission/tests/data/real_examples/shankari_single_positional_indexer.dec-12.purpose_confirm' mode='r' encoding='UTF-8'>
  object_hook=bju.object_hook)
./home/jenkins/workspace/e-mission-server-prb/emission/tests/storageTests/TestUsefulQueries.py:19: DeprecationWarning: remove is deprecated. Use delete_one or delete_many instead.
  get_section_db().remove({"_id": "foo_1"})
/home/jenkins/workspace/e-mission-server-prb/emission/tests/storageTests/TestUsefulQueries.py:20: DeprecationWarning: remove is deprecated. Use delete_one or delete_many instead.
  get_section_db().remove({"_id": "foo_2"})
/home/jenkins/workspace/e-mission-server-prb/emission/tests/storageTests/TestUsefulQueries.py:21: DeprecationWarning: remove is deprecated. Use delete_one or delete_many instead.
  get_section_db().remove({"_id": "foo_3"})
/home/jenkins/workspace/e-mission-server-prb/emission/tests/storageTests/TestUsefulQueries.py:32: DeprecationWarning: insert is deprecated. Use insert_one or insert_many instead.
  get_section_db().insert({"_id": "foo_1", "trip_id": "bar"})
/home/jenkins/workspace/e-mission-server-prb/emission/tests/storageTests/TestUsefulQueries.py:33: DeprecationWarning: insert is deprecated. Use insert_one or insert_many instead.
  get_section_db().insert({"_id": "foo_2", "trip_id": "bar"})
/home/jenkins/workspace/e-mission-server-prb/emission/tests/storageTests/TestUsefulQueries.py:34: DeprecationWarning: insert is deprecated. Use insert_one or insert_many instead.
  get_section_db().insert({"_id": "foo_3", "trip_id": "baz"})
/home/jenkins/workspace/e-mission-server-prb/emission/tests/storageTests/TestUsefulQueries.py:24: DeprecationWarning: remove is deprecated. Use delete_one or delete_many instead.
  get_section_db().remove({"_id": "foo_1"})
/home/jenkins/workspace/e-mission-server-prb/emission/tests/storageTests/TestUsefulQueries.py:25: DeprecationWarning: remove is deprecated. Use delete_one or delete_many instead.
  get_section_db().remove({"_id": "foo_2"})
/home/jenkins/workspace/e-mission-server-prb/emission/tests/storageTests/TestUsefulQueries.py:26: DeprecationWarning: remove is deprecated. Use delete_one or delete_many instead.
  get_section_db().remove({"_id": "foo_3"})
./home/jenkins/workspace/e-mission-server-prb/emission/tests/storageTests/TestUsefulQueries.py:46: DeprecationWarning: insert is deprecated. Use insert_one or insert_many instead.
  "section_end_datetime": dt2})
/home/jenkins/workspace/e-mission-server-prb/emission/tests/storageTests/TestUsefulQueries.py:51: DeprecationWarning: insert is deprecated. Use insert_one or insert_many instead.
  "section_end_datetime": dt3})
/home/jenkins/workspace/e-mission-server-prb/emission/tests/storageTests/TestUsefulQueries.py:56: DeprecationWarning: insert is deprecated. Use insert_one or insert_many instead.
  "section_start_datetime": dt3})
../home/jenkins/workspace/e-mission-server-prb/emission/tests/storageTests/TestUsefulQueries.py:68: DeprecationWarning: insert is deprecated. Use insert_one or insert_many instead.
  "section_end_datetime": dt2})
/home/jenkins/workspace/e-mission-server-prb/emission/tests/storageTests/TestUsefulQueries.py:73: DeprecationWarning: insert is deprecated. Use insert_one or insert_many instead.
  "section_end_datetime": dt3})
/home/jenkins/workspace/e-mission-server-prb/emission/tests/storageTests/TestUsefulQueries.py:78: DeprecationWarning: insert is deprecated. Use insert_one or insert_many instead.
  "section_start_datetime": dt3})
.
======================================================================
ERROR: test_GetStreakLast (analysisTests.intakeTests.TestSectionSegmentation.TestSectionSegmentation)
----------------------------------------------------------------------
Traceback (most recent call last):
  File "/home/jenkins/workspace/e-mission-server-prb/emission/tests/analysisTests/intakeTests/TestSectionSegmentation.py", line 247, in test_GetStreakLast
    ffd = eaissf.FlipFlopDetection([], None)
  File "/home/jenkins/workspace/e-mission-server-prb/emission/analysis/intake/segmentation/section_segmentation_methods/flip_flop_detection.py", line 50, in __init__
    self.add_trip_percentages()
  File "/home/jenkins/workspace/e-mission-server-prb/emission/analysis/intake/segmentation/section_segmentation_methods/flip_flop_detection.py", line 53, in add_trip_percentages
    total_trip_time = self.motion_changes[-1][1].ts - self.motion_changes[0][0].ts
IndexError: list index out of range

======================================================================
ERROR: test_GetStreakMixed (analysisTests.intakeTests.TestSectionSegmentation.TestSectionSegmentation)
----------------------------------------------------------------------
Traceback (most recent call last):
  File "/home/jenkins/workspace/e-mission-server-prb/emission/tests/analysisTests/intakeTests/TestSectionSegmentation.py", line 241, in test_GetStreakMixed
    ffd = eaissf.FlipFlopDetection([], None)
  File "/home/jenkins/workspace/e-mission-server-prb/emission/analysis/intake/segmentation/section_segmentation_methods/flip_flop_detection.py", line 50, in __init__
    self.add_trip_percentages()
  File "/home/jenkins/workspace/e-mission-server-prb/emission/analysis/intake/segmentation/section_segmentation_methods/flip_flop_detection.py", line 53, in add_trip_percentages
    total_trip_time = self.motion_changes[-1][1].ts - self.motion_changes[0][0].ts
IndexError: list index out of range

======================================================================
ERROR: test_GetStreakOne (analysisTests.intakeTests.TestSectionSegmentation.TestSectionSegmentation)
----------------------------------------------------------------------
Traceback (most recent call last):
  File "/home/jenkins/workspace/e-mission-server-prb/emission/tests/analysisTests/intakeTests/TestSectionSegmentation.py", line 235, in test_GetStreakOne
    ffd = eaissf.FlipFlopDetection([], None)
  File "/home/jenkins/workspace/e-mission-server-prb/emission/analysis/intake/segmentation/section_segmentation_methods/flip_flop_detection.py", line 50, in __init__
    self.add_trip_percentages()
  File "/home/jenkins/workspace/e-mission-server-prb/emission/analysis/intake/segmentation/section_segmentation_methods/flip_flop_detection.py", line 53, in add_trip_percentages
    total_trip_time = self.motion_changes[-1][1].ts - self.motion_changes[0][0].ts
IndexError: list index out of range

======================================================================
ERROR: test_MergeStreaksPass1 (analysisTests.intakeTests.TestSectionSegmentation.TestSectionSegmentation)
----------------------------------------------------------------------
Traceback (most recent call last):
  File "/home/jenkins/workspace/e-mission-server-prb/emission/tests/analysisTests/intakeTests/TestSectionSegmentation.py", line 253, in test_MergeStreaksPass1
    ffd = eaissf.FlipFlopDetection([], None)
  File "/home/jenkins/workspace/e-mission-server-prb/emission/analysis/intake/segmentation/section_segmentation_methods/flip_flop_detection.py", line 50, in __init__
    self.add_trip_percentages()
  File "/home/jenkins/workspace/e-mission-server-prb/emission/analysis/intake/segmentation/section_segmentation_methods/flip_flop_detection.py", line 53, in add_trip_percentages
    total_trip_time = self.motion_changes[-1][1].ts - self.motion_changes[0][0].ts
IndexError: list index out of range

======================================================================
ERROR: test_MergeStreaksPass2 (analysisTests.intakeTests.TestSectionSegmentation.TestSectionSegmentation)
----------------------------------------------------------------------
Traceback (most recent call last):
  File "/home/jenkins/workspace/e-mission-server-prb/emission/tests/analysisTests/intakeTests/TestSectionSegmentation.py", line 274, in test_MergeStreaksPass2
    ffd = eaissf.FlipFlopDetection([], None)
  File "/home/jenkins/workspace/e-mission-server-prb/emission/analysis/intake/segmentation/section_segmentation_methods/flip_flop_detection.py", line 50, in __init__
    self.add_trip_percentages()
  File "/home/jenkins/workspace/e-mission-server-prb/emission/analysis/intake/segmentation/section_segmentation_methods/flip_flop_detection.py", line 53, in add_trip_percentages
    total_trip_time = self.motion_changes[-1][1].ts - self.motion_changes[0][0].ts
IndexError: list index out of range

======================================================================
FAIL: testRemoveAllOutliers (analysisTests.intakeTests.TestCleanAndResample.TestCleanAndResample)
----------------------------------------------------------------------
Traceback (most recent call last):
  File "/home/jenkins/workspace/e-mission-server-prb/emission/tests/analysisTests/intakeTests/TestCleanAndResample.py", line 92, in testRemoveAllOutliers
    self.assertEqual(len(cleaned_trips_df), 1)
AssertionError: 2 != 1

======================================================================
FAIL: testAirTripFromHawaii (analysisTests.intakeTests.TestPipelineRealData.TestPipelineRealData)
----------------------------------------------------------------------
Traceback (most recent call last):
  File "/home/jenkins/workspace/e-mission-server-prb/emission/tests/analysisTests/intakeTests/TestPipelineRealData.py", line 355, in testAirTripFromHawaii
    ad.AttrDict(ground_truth).data)
  File "/home/jenkins/workspace/e-mission-server-prb/emission/tests/analysisTests/intakeTests/TestPipelineRealData.py", line 91, in compare_result
    self.assertAlmostEqual(rt.properties.distance, et.properties.distance, places=2)
AssertionError: 519095.1982507284 != 519037.97998908034 within 2 places

======================================================================
FAIL: testAirTripToHawaii (analysisTests.intakeTests.TestPipelineRealData.TestPipelineRealData)
----------------------------------------------------------------------
Traceback (most recent call last):
  File "/home/jenkins/workspace/e-mission-server-prb/emission/tests/analysisTests/intakeTests/TestPipelineRealData.py", line 326, in testAirTripToHawaii
    ad.AttrDict(ground_truth).data)
  File "/home/jenkins/workspace/e-mission-server-prb/emission/tests/analysisTests/intakeTests/TestPipelineRealData.py", line 91, in compare_result
    self.assertAlmostEqual(rt.properties.distance, et.properties.distance, places=2)
AssertionError: 22943.044593830287 != 22922.132877971715 within 2 places

======================================================================
FAIL: testAug11 (analysisTests.intakeTests.TestPipelineRealData.TestPipelineRealData)
----------------------------------------------------------------------
Traceback (most recent call last):
  File "/home/jenkins/workspace/e-mission-server-prb/emission/tests/analysisTests/intakeTests/TestPipelineRealData.py", line 280, in testAug11
    ad.AttrDict(ground_truth).data)
  File "/home/jenkins/workspace/e-mission-server-prb/emission/tests/analysisTests/intakeTests/TestPipelineRealData.py", line 91, in compare_result
    self.assertAlmostEqual(rt.properties.distance, et.properties.distance, places=2)
AssertionError: 57736.27974961613 != 57581.75293207684 within 2 places

======================================================================
FAIL: testFeb22MultiSyncEndDetected (analysisTests.intakeTests.TestPipelineRealData.TestPipelineRealData)
----------------------------------------------------------------------
Traceback (most recent call last):
  File "/home/jenkins/workspace/e-mission-server-prb/emission/tests/analysisTests/intakeTests/TestPipelineRealData.py", line 562, in testFeb22MultiSyncEndDetected
    ad.AttrDict(ground_truth).data, time_fuzz=60, distance_fuzz=100)
  File "/home/jenkins/workspace/e-mission-server-prb/emission/tests/analysisTests/intakeTests/TestPipelineRealData.py", line 144, in compare_approx_result
    self.assertEqual(len(rt.features), len(et.features))
AssertionError: 5 != 13

======================================================================
FAIL: testFeb22MultiSyncEndNotDetected (analysisTests.intakeTests.TestPipelineRealData.TestPipelineRealData)
----------------------------------------------------------------------
Traceback (most recent call last):
  File "/home/jenkins/workspace/e-mission-server-prb/emission/tests/analysisTests/intakeTests/TestPipelineRealData.py", line 666, in testFeb22MultiSyncEndNotDetected
    ad.AttrDict(ground_truth).data, time_fuzz=60, distance_fuzz=100)
  File "/home/jenkins/workspace/e-mission-server-prb/emission/tests/analysisTests/intakeTests/TestPipelineRealData.py", line 144, in compare_approx_result
    self.assertEqual(len(rt.features), len(et.features))
AssertionError: 5 != 13

======================================================================
FAIL: testFeb22ShortTripsDistance (analysisTests.intakeTests.TestPipelineRealData.TestPipelineRealData)
----------------------------------------------------------------------
Traceback (most recent call last):
  File "/home/jenkins/workspace/e-mission-server-prb/emission/tests/analysisTests/intakeTests/TestPipelineRealData.py", line 296, in testFeb22ShortTripsDistance
    ad.AttrDict(ground_truth).data)
  File "/home/jenkins/workspace/e-mission-server-prb/emission/tests/analysisTests/intakeTests/TestPipelineRealData.py", line 91, in compare_result
    self.assertAlmostEqual(rt.properties.distance, et.properties.distance, places=2)
AssertionError: 695.3253933494584 != 695.7502440472699 within 2 places

======================================================================
FAIL: testIndexLengthChange (analysisTests.intakeTests.TestPipelineRealData.TestPipelineRealData)
----------------------------------------------------------------------
Traceback (most recent call last):
  File "/home/jenkins/workspace/e-mission-server-prb/emission/tests/analysisTests/intakeTests/TestPipelineRealData.py", line 439, in testIndexLengthChange
    ad.AttrDict(ground_truth).data)
  File "/home/jenkins/workspace/e-mission-server-prb/emission/tests/analysisTests/intakeTests/TestPipelineRealData.py", line 88, in compare_result
    self.assertEqual(rt.properties.end_ts, et.properties.end_ts)
AssertionError: 1440358454.493 != 1440358303.969

======================================================================
FAIL: testIosJumpsAndUntrackedSquishing (analysisTests.intakeTests.TestPipelineRealData.TestPipelineRealData)
----------------------------------------------------------------------
Traceback (most recent call last):
  File "/home/jenkins/workspace/e-mission-server-prb/emission/tests/analysisTests/intakeTests/TestPipelineRealData.py", line 484, in testIosJumpsAndUntrackedSquishing
    ad.AttrDict(ground_truth).data)
  File "/home/jenkins/workspace/e-mission-server-prb/emission/tests/analysisTests/intakeTests/TestPipelineRealData.py", line 91, in compare_result
    self.assertAlmostEqual(rt.properties.distance, et.properties.distance, places=2)
AssertionError: 2152.2792876477065 != 2154.0034409535274 within 2 places

======================================================================
FAIL: testJan16SpeedAssert (analysisTests.intakeTests.TestPipelineRealData.TestPipelineRealData)
----------------------------------------------------------------------
Traceback (most recent call last):
  File "/home/jenkins/workspace/e-mission-server-prb/emission/tests/analysisTests/intakeTests/TestPipelineRealData.py", line 799, in testJan16SpeedAssert
    ad.AttrDict(ground_truth).data)
  File "/home/jenkins/workspace/e-mission-server-prb/emission/tests/analysisTests/intakeTests/TestPipelineRealData.py", line 110, in compare_result
    self.assertEqual(rs.properties.exit_fmt_time, es.properties.exit_fmt_time)
AssertionError: '2016-01-16T14:22:03.766051-08:00' != '2016-01-16T14:22:09.435320-08:00'
- 2016-01-16T14:22:03.766051-08:00
?                    ^^^^ --
+ 2016-01-16T14:22:09.435320-08:00
?                   +++ ^^^


======================================================================
FAIL: testJul22SplitAroundReboot (analysisTests.intakeTests.TestPipelineRealData.TestPipelineRealData)
----------------------------------------------------------------------
Traceback (most recent call last):
  File "/home/jenkins/workspace/e-mission-server-prb/emission/tests/analysisTests/intakeTests/TestPipelineRealData.py", line 623, in testJul22SplitAroundReboot
    ad.AttrDict(ground_truth_1).data)
  File "/home/jenkins/workspace/e-mission-server-prb/emission/tests/analysisTests/intakeTests/TestPipelineRealData.py", line 91, in compare_result
    self.assertAlmostEqual(rt.properties.distance, et.properties.distance, places=2)
AssertionError: 79010.45554149842 != 78703.13870911207 within 2 places

======================================================================
FAIL: testJumpSmoothingSectionEnd (analysisTests.intakeTests.TestPipelineRealData.TestPipelineRealData)
----------------------------------------------------------------------
Traceback (most recent call last):
  File "/home/jenkins/workspace/e-mission-server-prb/emission/tests/analysisTests/intakeTests/TestPipelineRealData.py", line 396, in testJumpSmoothingSectionEnd
    ad.AttrDict(ground_truth).data)
  File "/home/jenkins/workspace/e-mission-server-prb/emission/tests/analysisTests/intakeTests/TestPipelineRealData.py", line 91, in compare_result
    self.assertAlmostEqual(rt.properties.distance, et.properties.distance, places=2)
AssertionError: 58380.10275843949 != 58527.862425664294 within 2 places

======================================================================
FAIL: testJumpSmoothingSectionStart (analysisTests.intakeTests.TestPipelineRealData.TestPipelineRealData)
----------------------------------------------------------------------
Traceback (most recent call last):
  File "/home/jenkins/workspace/e-mission-server-prb/emission/tests/analysisTests/intakeTests/TestPipelineRealData.py", line 424, in testJumpSmoothingSectionStart
    ad.AttrDict(ground_truth).data)
  File "/home/jenkins/workspace/e-mission-server-prb/emission/tests/analysisTests/intakeTests/TestPipelineRealData.py", line 91, in compare_result
    self.assertAlmostEqual(rt.properties.distance, et.properties.distance, places=2)
AssertionError: 58380.10275843949 != 58527.862425664294 within 2 places

======================================================================
FAIL: testJumpSmoothingSectionsStraddle (analysisTests.intakeTests.TestPipelineRealData.TestPipelineRealData)
----------------------------------------------------------------------
Traceback (most recent call last):
  File "/home/jenkins/workspace/e-mission-server-prb/emission/tests/analysisTests/intakeTests/TestPipelineRealData.py", line 410, in testJumpSmoothingSectionsStraddle
    ad.AttrDict(ground_truth).data)
  File "/home/jenkins/workspace/e-mission-server-prb/emission/tests/analysisTests/intakeTests/TestPipelineRealData.py", line 91, in compare_result
    self.assertAlmostEqual(rt.properties.distance, et.properties.distance, places=2)
AssertionError: 58380.10275843949 != 58527.862425664294 within 2 places

======================================================================
FAIL: testJun20 (analysisTests.intakeTests.TestPipelineRealData.TestPipelineRealData)
----------------------------------------------------------------------
Traceback (most recent call last):
  File "/home/jenkins/workspace/e-mission-server-prb/emission/tests/analysisTests/intakeTests/TestPipelineRealData.py", line 200, in testJun20
    ad.AttrDict(ground_truth).data)
  File "/home/jenkins/workspace/e-mission-server-prb/emission/tests/analysisTests/intakeTests/TestPipelineRealData.py", line 110, in compare_result
    self.assertEqual(rs.properties.exit_fmt_time, es.properties.exit_fmt_time)
AssertionError: '2016-06-20T16:49:49.371023-07:00' != '2016-06-20T16:49:44.046170-07:00'
- 2016-06-20T16:49:49.371023-07:00
?                   ^ ^ - --
+ 2016-06-20T16:49:44.046170-07:00
?                   ^ ^^^^


======================================================================
FAIL: testJun21 (analysisTests.intakeTests.TestPipelineRealData.TestPipelineRealData)
----------------------------------------------------------------------
Traceback (most recent call last):
  File "/home/jenkins/workspace/e-mission-server-prb/emission/tests/analysisTests/intakeTests/TestPipelineRealData.py", line 226, in testJun21
    ad.AttrDict(ground_truth).data)
  File "/home/jenkins/workspace/e-mission-server-prb/emission/tests/analysisTests/intakeTests/TestPipelineRealData.py", line 91, in compare_result
    self.assertAlmostEqual(rt.properties.distance, et.properties.distance, places=2)
AssertionError: 2892.6472331637024 != 3089.5905101433705 within 2 places

======================================================================
FAIL: testOct07MultiSyncSpuriousEndDetected (analysisTests.intakeTests.TestPipelineRealData.TestPipelineRealData)
----------------------------------------------------------------------
Traceback (most recent call last):
  File "/home/jenkins/workspace/e-mission-server-prb/emission/tests/analysisTests/intakeTests/TestPipelineRealData.py", line 704, in testOct07MultiSyncSpuriousEndDetected
    ad.AttrDict(ground_truth).data, time_fuzz=60, distance_fuzz=100)
  File "/home/jenkins/workspace/e-mission-server-prb/emission/tests/analysisTests/intakeTests/TestPipelineRealData.py", line 162, in compare_approx_result
    self.assertAlmostEqual(rs.properties.exit_ts, es.properties.exit_ts, delta=time_fuzz)
AssertionError: 1475878866.6778822 != 1475878747.3956094 within 60 delta

======================================================================
FAIL: testSquishedMismatchForUntrackedTime (analysisTests.intakeTests.TestPipelineRealData.TestPipelineRealData)
----------------------------------------------------------------------
Traceback (most recent call last):
  File "/home/jenkins/workspace/e-mission-server-prb/emission/tests/analysisTests/intakeTests/TestPipelineRealData.py", line 454, in testSquishedMismatchForUntrackedTime
    ad.AttrDict(ground_truth).data)
  File "/home/jenkins/workspace/e-mission-server-prb/emission/tests/analysisTests/intakeTests/TestPipelineRealData.py", line 91, in compare_result
    self.assertAlmostEqual(rt.properties.distance, et.properties.distance, places=2)
AssertionError: 25687.688636975377 != 25699.693505320178 within 2 places

======================================================================
FAIL: testTsMismatch (analysisTests.intakeTests.TestPipelineRealData.TestPipelineRealData)
----------------------------------------------------------------------
Traceback (most recent call last):
  File "/home/jenkins/workspace/e-mission-server-prb/emission/tests/analysisTests/intakeTests/TestPipelineRealData.py", line 771, in testTsMismatch
    ad.AttrDict(ground_truth).data)
  File "/home/jenkins/workspace/e-mission-server-prb/emission/tests/analysisTests/intakeTests/TestPipelineRealData.py", line 110, in compare_result
    self.assertEqual(rs.properties.exit_fmt_time, es.properties.exit_fmt_time)
AssertionError: '2016-12-12T09:33:12.972867-08:00' != '2016-12-12T09:33:16.632910-08:00'
- 2016-12-12T09:33:12.972867-08:00
?                    - ^^^^^
+ 2016-12-12T09:33:16.632910-08:00
?                   ++++  ^^


======================================================================
FAIL: testZeroDurationPlaceInterpolationMultiSync (analysisTests.intakeTests.TestPipelineRealData.TestPipelineRealData)
----------------------------------------------------------------------
Traceback (most recent call last):
  File "/home/jenkins/workspace/e-mission-server-prb/emission/tests/analysisTests/intakeTests/TestPipelineRealData.py", line 752, in testZeroDurationPlaceInterpolationMultiSync
    ad.AttrDict(ground_truth_1).data)
  File "/home/jenkins/workspace/e-mission-server-prb/emission/tests/analysisTests/intakeTests/TestPipelineRealData.py", line 110, in compare_result
    self.assertEqual(rs.properties.exit_fmt_time, es.properties.exit_fmt_time)
AssertionError: '2016-01-12T08:34:22.824999-08:00' != '2016-01-12T08:33:59.698828-08:00'
- 2016-01-12T08:34:22.824999-08:00
?                ^ ^^   ^^^^
+ 2016-01-12T08:33:59.698828-08:00
?                ^ ^^ +++  ^


======================================================================
FAIL: testZeroDurationPlaceInterpolationSingleSync (analysisTests.intakeTests.TestPipelineRealData.TestPipelineRealData)
----------------------------------------------------------------------
Traceback (most recent call last):
  File "/home/jenkins/workspace/e-mission-server-prb/emission/tests/analysisTests/intakeTests/TestPipelineRealData.py", line 725, in testZeroDurationPlaceInterpolationSingleSync
    ad.AttrDict(ground_truth_1).data)
  File "/home/jenkins/workspace/e-mission-server-prb/emission/tests/analysisTests/intakeTests/TestPipelineRealData.py", line 110, in compare_result
    self.assertEqual(rs.properties.exit_fmt_time, es.properties.exit_fmt_time)
AssertionError: '2016-01-12T08:34:22.824999-08:00' != '2016-01-12T08:33:59.698828-08:00'
- 2016-01-12T08:34:22.824999-08:00
?                ^ ^^   ^^^^
+ 2016-01-12T08:33:59.698828-08:00
?                ^ ^^ +++  ^


======================================================================
FAIL: testIOSSegmentationWrapperWithAutoTrip (analysisTests.intakeTests.TestSectionSegmentation.TestSectionSegmentation)
----------------------------------------------------------------------
Traceback (most recent call last):
  File "/home/jenkins/workspace/e-mission-server-prb/emission/tests/analysisTests/intakeTests/TestSectionSegmentation.py", line 232, in testIOSSegmentationWrapperWithAutoTrip
    [(0, 0), (11, 10)])
AssertionError: Lists differ: [(0, 0), (8, 7)] != [(0, 0), (11, 10)]

First differing element 1:
(8, 7)
(11, 10)

- [(0, 0), (8, 7)]
?           ^  ^

+ [(0, 0), (11, 10)]
?           ^^  ^^


======================================================================
FAIL: testSegmentationWrapperWithAutoTrip (analysisTests.intakeTests.TestSectionSegmentation.TestSectionSegmentation)
----------------------------------------------------------------------
Traceback (most recent call last):
  File "/home/jenkins/workspace/e-mission-server-prb/emission/tests/analysisTests/intakeTests/TestSectionSegmentation.py", line 203, in testSegmentationWrapperWithAutoTrip
    (4, 3), (2, 1)])
AssertionError: Lists differ: [(2, 1), (2, 1), (2, 1), (2, 1), (1, 0), (2, 1), (4, 3), (2, 1)] != [(2, 1), (1, 0), (2, 1), (2, 1), (1, 0), (2, 1), (4, 3), (2, 1)]

First differing element 1:
(2, 1)
(1, 0)

- [(2, 1), (2, 1), (2, 1), (2, 1), (1, 0), (2, 1), (4, 3), (2, 1)]
+ [(2, 1), (1, 0), (2, 1), (2, 1), (1, 0), (2, 1), (4, 3), (2, 1)]

======================================================================
FAIL: testCountLocalDateMetrics (netTests.TestMetricsCleanedSections.TestMetrics)
----------------------------------------------------------------------
Traceback (most recent call last):
  File "/home/jenkins/workspace/e-mission-server-prb/emission/tests/netTests/TestMetricsCleanedSections.py", line 107, in testCountLocalDateMetrics
    self.assertEqual(user_met_result[0].IN_VEHICLE, 5)
AssertionError: 6 != 5

======================================================================
FAIL: testCountTimestampMetrics (netTests.TestMetricsCleanedSections.TestMetrics)
----------------------------------------------------------------------
Traceback (most recent call last):
  File "/home/jenkins/workspace/e-mission-server-prb/emission/tests/netTests/TestMetricsCleanedSections.py", line 73, in testCountTimestampMetrics
    self.assertEqual(user_met_result[0].IN_VEHICLE, 4)
AssertionError: 5 != 4

----------------------------------------------------------------------
Ran 221 tests in 985.509s

FAILED (failures=25, errors=5)

Setting up real example for eb24710e-2c24-4538-8f4f-61061eac9c7d
Setting up real example for d9946925-f5bd-440a-ab7d-e00e99e2ea08
Setting up real example for e1673b4c-846d-44a6-afec-3fdf60d93c4d
Setting up real example for ef8009df-eede-40f4-81ef-62e875136aaa
Setting up real example for d99a1dbf-a32b-43d0-83c0-36e6bc2e8ff1
Found match for {'_id': ObjectId('5cd925e7f6ec1c124c459ff3'), 'track_location': {'type': 'Point', 'coordinates': [-122.5, 37.5]}}
Found match for {'_id': ObjectId('5cd925e7f6ec1c124c459ff6'), 'track_location': {'type': 'Point', 'coordinates': [-122.5, 37.5]}}
Found match for {'_id': ObjectId('5cd925e7f6ec1c124c459ff7'), 'track_location': {'type': 'Point', 'coordinates': [-122.259475, 37.87237]}}
Found match for {'_id': ObjectId('5cd925e7f6ec1c124c459ff8'), 'track_location': {'type': 'Point', 'coordinates': [-122.259169, 37.873873]}}
Found match for {'_id': ObjectId('5cd925e7f6ec1c124c459ff9'), 'track_location': {'type': 'Point', 'coordinates': [-122.25874, 37.875711]}}
Found match for {'_id': ObjectId('5cd925e7f6ec1c124c459ffa'), 'track_location': {'type': 'Point', 'coordinates': [-122.254577, 37.870352]}}
Found match for {'_id': ObjectId('5cd925e7f6ec1c124c459ff6'), 'track_location': {'type': 'Point', 'coordinates': [-122.5, 37.5]}}
Found match for {'_id': ObjectId('5cd925e7f6ec1c124c459ff7'), 'track_location': {'type': 'Point', 'coordinates': [-122.259475, 37.87237]}}
Found match for {'_id': ObjectId('5cd925e7f6ec1c124c459ff8'), 'track_location': {'type': 'Point', 'coordinates': [-122.259169, 37.873873]}}
Found match for {'_id': ObjectId('5cd925e7f6ec1c124c459ff9'), 'track_location': {'type': 'Point', 'coordinates': [-122.25874, 37.875711]}}
Found match for {'_id': ObjectId('5cd925e7f6ec1c124c459ffa'), 'track_location': {'type': 'Point', 'coordinates': [-122.254577, 37.870352]}}
Setting up real example for 7d7097ab-2d62-4aeb-a87d-92504d7e7f30
Setting up real example for 89ae20c3-35bc-4f33-b2e8-608337f5d410
Setting up real example for e71f1293-acc3-4d9d-a1c5-71c86791d720
Setting up real example for c9443ce0-3569-4967-9fd1-09ea3a164fe0
Setting up real example for fe3b90ae-c8ee-4d94-bd3a-627d329ac117
Setting up real example for c9ddf46c-2adb-4fbe-ac86-37639f975189
Setting up real example for 6756cc1b-e2b0-4f36-b1ba-a1a9de6b83c5
Setting up real example for 22289062-7571-4930-8c64-4f27bcf8b659
Setting up real example for c6f2c8ce-943e-4d8e-b97b-2f31c9d0057d
Setting up real example for 4b176f94-3ff4-48e3-91e7-ca15d6787a22
Setting up real example for b064d6ce-a04b-4c9f-ae9f-4075fe2a2599
Setting up real example for 2695f536-9886-43e2-ad27-4c68642467d7
Setting up real example for fe6d58b2-4946-46e0-b5e9-6f2cb81e3227
Setting up real example for e9e32057-114f-464f-99c7-940309c69670
Setting up real example for dbb7f3c0-e431-4709-8732-e7b2d2cfa07f
Setting up real example for 99669223-fb62-408b-8fa9-718780775fd5
Setting up real example for 228faf05-cce2-4ecf-b12d-7da48213d67d
Setting up real example for bfe45e1d-f45e-416a-81ab-cb019678b86c
sys:1: ResourceWarning: unclosed file <_io.TextIOWrapper name='conf/storage/db.conf.sample' mode='r' encoding='UTF-8'>
sys:1: ResourceWarning: unclosed file <_io.TextIOWrapper name='conf/net/ext_service/habitica.json' mode='r' encoding='UTF-8'>
sys:1: ResourceWarning: unclosed file <_io.TextIOWrapper name='conf/net/ext_service/push.json' mode='r' encoding='UTF-8'>
Removing environment from /tmp/tmp.jDNX00hyf1

Package plan for package removal in environment /tmp/tmp.jDNX00hyf1:

The following packages will be REMOVED:

    arrow:           0.12.1-py36_1002     conda-forge
    attrdict:        2.0.0-py_1           conda-forge
    blas:            1.0-mkl                         
    ca-certificates: 2019.3.9-hecc5488_0  conda-forge
    cachetools:      2.1.0-py_0           conda-forge
    certifi:         2019.3.9-py36_0      conda-forge
    cheroot:         6.2.4-py36_0         conda-forge
    future:          0.16.0-py36_1002     conda-forge
    geojson:         2.3.0-py_0           conda-forge
    google-auth:     1.2.1-py_0           conda-forge
    intel-openmp:    2019.3-199                      
    jsonpickle:      0.9.6-py_1           conda-forge
    libgcc-ng:       8.2.0-hdf63c60_1                
    libgfortran:     3.0.0-1              conda-forge
    mkl:             2017.0.4-h4c4d0af_0             
    more-itertools:  4.3.0-py36_1000      conda-forge
    ncurses:         5.9-10               conda-forge
    numpy:           1.12.1-py36_0                   
    openssl:         1.0.2r-h14c3975_0    conda-forge
    pandas:          0.20.1-np112py36_0   conda-forge
    pip:             9.0.1-py36_1         conda-forge
    pyasn1:          0.4.4-py_1           conda-forge
    pyasn1-modules:  0.2.4-py_0           conda-forge
    python:          3.6.1-2              conda-forge
    python-dateutil: 2.6.0-py36_0         conda-forge
    pytz:            2017.2-py36_0        conda-forge
    readline:        6.2-0                conda-forge
    requests:        2.14.2-py36_0                   
    rsa:             3.4.2-py_1           conda-forge
    scikit-learn:    0.18.1-np112py36_1              
    scipy:           0.19.0-np112py36_0              
    setuptools:      41.0.1-py36_0        conda-forge
    six:             1.12.0-py36_1000     conda-forge
    sqlite:          3.13.0-1             conda-forge
    tk:              8.5.19-2             conda-forge
    utm:             0.4.2-py36_0         conda-forge
    wheel:           0.33.4-py36_0        conda-forge
    xmltodict:       0.11.0-py_1          conda-forge
    xz:              5.2.4-h14c3975_1001  conda-forge
    zlib:            1.2.11-h14c3975_1004 conda-forge

rm: cannot remove 'conf/net/int_service/giles_conf.json': No such file or directory
rm: cannot remove 'conf/net/ext_service/push.json': No such file or directory
Build step 'Execute shell' marked build as failure
Sending e-mails to: shankari@eecs.berkeley.edu
Test FAILed.
Refer to this link for build results (access rights to CI server needed): 
https://amplab.cs.berkeley.edu/jenkins//job/e-mission-server-prb/1115/
Test FAILed.
Finished: FAILURE