FailedConsole Output

GitHub pull request #728 of commit 6408319bb83b687ea6059f5f328ef4fb274f7fd7 automatically merged.
[EnvInject] - Loading node environment variables.
Building remotely on research-jenkins-worker-07 (research-07 ubuntu) in workspace /home/jenkins/workspace/e-mission-server-prb
 > git rev-parse --is-inside-work-tree # timeout=10
Fetching changes from the remote Git repository
 > git config remote.github-prb.url https://github.com/e-mission/e-mission-server.git # timeout=10
Cleaning workspace
 > git rev-parse --verify HEAD # timeout=10
Resetting working tree
 > git reset --hard # timeout=10
 > git clean -fdx # timeout=10
Fetching upstream changes from https://github.com/e-mission/e-mission-server.git
 > git --version # timeout=10
 > git fetch --tags --progress https://github.com/e-mission/e-mission-server.git +refs/pull/*:refs/remotes/origin/pr/*
 > git rev-parse origin/pr/728/merge^{commit} # timeout=10
 > git branch -a -v --no-abbrev --contains 1a0f582b719fd7295a8ddc8781e703419febda11 # timeout=10
Checking out Revision 1a0f582b719fd7295a8ddc8781e703419febda11 (origin/pr/728/merge)
 > git config core.sparsecheckout # timeout=10
 > git checkout -f 1a0f582b719fd7295a8ddc8781e703419febda11
 > git rev-list 69f77a6d9a00d961ff4b70821aa4f2ea790e015b # timeout=10
First time build. Skipping changelog.
[e-mission-server-prb] $ /bin/bash /tmp/hudson611324220591900186.sh
Setting up blank environment
setup/setup_tests.sh: line 4: conda: command not found
setup/setup_tests.sh: line 5: activate: No such file or directory
Downloading packages
  % Total    % Received % Xferd  Average Speed   Time    Time     Time  Current
                                 Dload  Upload   Total   Spent    Left  Speed

  0     0    0     0    0     0      0      0 --:--:-- --:--:-- --:--:--     0
  0     0    0     0    0     0      0      0 --:--:-- --:--:-- --:--:--     0
100  3813    0  3813    0     0   8272      0 --:--:-- --:--:-- --:--:--  8271

100 10521  100 10521    0     0  10329      0  0:00:01  0:00:01 --:--:-- 10329
  % Total    % Received % Xferd  Average Speed   Time    Time     Time  Current
                                 Dload  Upload   Total   Spent    Left  Speed

  0     0    0     0    0     0      0      0 --:--:-- --:--:-- --:--:--     0
  0     0    0     0    0     0      0      0 --:--:-- --:--:-- --:--:--     0
100  3789    0  3789    0     0   8354      0 --:--:-- --:--:-- --:--:--  8345

100 13732  100 13732    0     0  14763      0 --:--:-- --:--:-- --:--:-- 14763
  % Total    % Received % Xferd  Average Speed   Time    Time     Time  Current
                                 Dload  Upload   Total   Spent    Left  Speed

  0     0    0     0    0     0      0      0 --:--:-- --:--:-- --:--:--     0
  0     0    0     0    0     0      0      0 --:--:-- --:--:-- --:--:--     0
100  3813    0  3813    0     0   9013      0 --:--:-- --:--:-- --:--:--  9014

100 24446  100 24446    0     0  26905      0 --:--:-- --:--:-- --:--:-- 26905
  % Total    % Received % Xferd  Average Speed   Time    Time     Time  Current
                                 Dload  Upload   Total   Spent    Left  Speed

  0     0    0     0    0     0      0      0 --:--:-- --:--:-- --:--:--     0
  0     0    0     0    0     0      0      0 --:--:-- --:--:-- --:--:--     0
100  3773    0  3773    0     0   8603      0 --:--:-- --:--:-- --:--:--  8594

100 35976  100 35976    0     0  38421      0 --:--:-- --:--:-- --:--:-- 38421
  % Total    % Received % Xferd  Average Speed   Time    Time     Time  Current
                                 Dload  Upload   Total   Spent    Left  Speed

  0     0    0     0    0     0      0      0 --:--:-- --:--:-- --:--:--     0
100  3741    0  3741    0     0   9163      0 --:--:-- --:--:-- --:--:--  9169

  0     0    0     0    0     0      0      0 --:--:-- --:--:-- --:--:--     0
100 54333  100 54333    0     0  55627      0 --:--:-- --:--:-- --:--:--  105k
  % Total    % Received % Xferd  Average Speed   Time    Time     Time  Current
                                 Dload  Upload   Total   Spent    Left  Speed

  0     0    0     0    0     0      0      0 --:--:-- --:--:-- --:--:--     0
  0     0    0     0    0     0      0      0 --:--:-- --:--:-- --:--:--     0
100  3829    0  3829    0     0   8538      0 --:--:-- --:--:-- --:--:--  8527

100 61345  100 61345    0     0  61518      0 --:--:-- --:--:-- --:--:-- 61518
Installing manually downloaded packages
setup/setup_tests.sh: line 16: conda: command not found
setup/setup_tests.sh: line 18: conda: command not found
Traceback (most recent call last):
  File "bin/deploy/push_conf.py", line 5, in <module>
    from future import standard_library
ImportError: No module named future
EEEEEEEEEEEEEEEEEEEEEEEEEEEEEEEEEEE
======================================================================
ERROR: storageTests.TestUsefulQueries (unittest.loader.ModuleImportFailure)
----------------------------------------------------------------------
ImportError: Failed to import test module: storageTests.TestUsefulQueries
Traceback (most recent call last):
  File "/usr/lib/python2.7/unittest/loader.py", line 254, in _find_tests
    module = self._get_module_from_name(name)
  File "/usr/lib/python2.7/unittest/loader.py", line 232, in _get_module_from_name
    __import__(name)
  File "/home/jenkins/workspace/e-mission-server-prb/emission/tests/storageTests/TestUsefulQueries.py", line 6, in <module>
    from future import standard_library
ImportError: No module named future


======================================================================
ERROR: storageTests.TestTimeSeries (unittest.loader.ModuleImportFailure)
----------------------------------------------------------------------
ImportError: Failed to import test module: storageTests.TestTimeSeries
Traceback (most recent call last):
  File "/usr/lib/python2.7/unittest/loader.py", line 254, in _find_tests
    module = self._get_module_from_name(name)
  File "/usr/lib/python2.7/unittest/loader.py", line 232, in _get_module_from_name
    __import__(name)
  File "/home/jenkins/workspace/e-mission-server-prb/emission/tests/storageTests/TestTimeSeries.py", line 6, in <module>
    from future import standard_library
ImportError: No module named future


======================================================================
ERROR: storageTests.TestTripQueries (unittest.loader.ModuleImportFailure)
----------------------------------------------------------------------
ImportError: Failed to import test module: storageTests.TestTripQueries
Traceback (most recent call last):
  File "/usr/lib/python2.7/unittest/loader.py", line 254, in _find_tests
    module = self._get_module_from_name(name)
  File "/usr/lib/python2.7/unittest/loader.py", line 232, in _get_module_from_name
    __import__(name)
  File "/home/jenkins/workspace/e-mission-server-prb/emission/tests/storageTests/TestTripQueries.py", line 6, in <module>
    from future import standard_library
ImportError: No module named future


======================================================================
ERROR: storageTests.TestSectionQueries (unittest.loader.ModuleImportFailure)
----------------------------------------------------------------------
ImportError: Failed to import test module: storageTests.TestSectionQueries
Traceback (most recent call last):
  File "/usr/lib/python2.7/unittest/loader.py", line 254, in _find_tests
    module = self._get_module_from_name(name)
  File "/usr/lib/python2.7/unittest/loader.py", line 232, in _get_module_from_name
    __import__(name)
  File "/home/jenkins/workspace/e-mission-server-prb/emission/tests/storageTests/TestSectionQueries.py", line 6, in <module>
    from future import standard_library
ImportError: No module named future


======================================================================
ERROR: storageTests.TestStopQueries (unittest.loader.ModuleImportFailure)
----------------------------------------------------------------------
ImportError: Failed to import test module: storageTests.TestStopQueries
Traceback (most recent call last):
  File "/usr/lib/python2.7/unittest/loader.py", line 254, in _find_tests
    module = self._get_module_from_name(name)
  File "/usr/lib/python2.7/unittest/loader.py", line 232, in _get_module_from_name
    __import__(name)
  File "/home/jenkins/workspace/e-mission-server-prb/emission/tests/storageTests/TestStopQueries.py", line 6, in <module>
    from future import standard_library
ImportError: No module named future


======================================================================
ERROR: storageTests.TestPipelineQueries (unittest.loader.ModuleImportFailure)
----------------------------------------------------------------------
ImportError: Failed to import test module: storageTests.TestPipelineQueries
Traceback (most recent call last):
  File "/usr/lib/python2.7/unittest/loader.py", line 254, in _find_tests
    module = self._get_module_from_name(name)
  File "/usr/lib/python2.7/unittest/loader.py", line 232, in _get_module_from_name
    __import__(name)
  File "/home/jenkins/workspace/e-mission-server-prb/emission/tests/storageTests/TestPipelineQueries.py", line 6, in <module>
    from future import standard_library
ImportError: No module named future


======================================================================
ERROR: storageTests.TestPlaceQueries (unittest.loader.ModuleImportFailure)
----------------------------------------------------------------------
ImportError: Failed to import test module: storageTests.TestPlaceQueries
Traceback (most recent call last):
  File "/usr/lib/python2.7/unittest/loader.py", line 254, in _find_tests
    module = self._get_module_from_name(name)
  File "/usr/lib/python2.7/unittest/loader.py", line 232, in _get_module_from_name
    __import__(name)
  File "/home/jenkins/workspace/e-mission-server-prb/emission/tests/storageTests/TestPlaceQueries.py", line 6, in <module>
    from future import standard_library
ImportError: No module named future


======================================================================
ERROR: storageTests.TestMongoGeoJSONQueries (unittest.loader.ModuleImportFailure)
----------------------------------------------------------------------
ImportError: Failed to import test module: storageTests.TestMongoGeoJSONQueries
Traceback (most recent call last):
  File "/usr/lib/python2.7/unittest/loader.py", line 254, in _find_tests
    module = self._get_module_from_name(name)
  File "/usr/lib/python2.7/unittest/loader.py", line 232, in _get_module_from_name
    __import__(name)
  File "/home/jenkins/workspace/e-mission-server-prb/emission/tests/storageTests/TestMongoGeoJSONQueries.py", line 6, in <module>
    from future import standard_library
ImportError: No module named future


======================================================================
ERROR: storageTests.TestTimeline (unittest.loader.ModuleImportFailure)
----------------------------------------------------------------------
ImportError: Failed to import test module: storageTests.TestTimeline
Traceback (most recent call last):
  File "/usr/lib/python2.7/unittest/loader.py", line 254, in _find_tests
    module = self._get_module_from_name(name)
  File "/usr/lib/python2.7/unittest/loader.py", line 232, in _get_module_from_name
    __import__(name)
  File "/home/jenkins/workspace/e-mission-server-prb/emission/tests/storageTests/TestTimeline.py", line 6, in <module>
    from future import standard_library
ImportError: No module named future


======================================================================
ERROR: storageTests.TestLocalDateQueries (unittest.loader.ModuleImportFailure)
----------------------------------------------------------------------
ImportError: Failed to import test module: storageTests.TestLocalDateQueries
Traceback (most recent call last):
  File "/usr/lib/python2.7/unittest/loader.py", line 254, in _find_tests
    module = self._get_module_from_name(name)
  File "/usr/lib/python2.7/unittest/loader.py", line 232, in _get_module_from_name
    __import__(name)
  File "/home/jenkins/workspace/e-mission-server-prb/emission/tests/storageTests/TestLocalDateQueries.py", line 6, in <module>
    from future import standard_library
ImportError: No module named future


======================================================================
ERROR: storageTests.TestAnalysisTimeseries (unittest.loader.ModuleImportFailure)
----------------------------------------------------------------------
ImportError: Failed to import test module: storageTests.TestAnalysisTimeseries
Traceback (most recent call last):
  File "/usr/lib/python2.7/unittest/loader.py", line 254, in _find_tests
    module = self._get_module_from_name(name)
  File "/usr/lib/python2.7/unittest/loader.py", line 232, in _get_module_from_name
    __import__(name)
  File "/home/jenkins/workspace/e-mission-server-prb/emission/tests/storageTests/TestAnalysisTimeseries.py", line 6, in <module>
    from future import standard_library
ImportError: No module named future


======================================================================
ERROR: netTests.TestFormatters (unittest.loader.ModuleImportFailure)
----------------------------------------------------------------------
ImportError: Failed to import test module: netTests.TestFormatters
Traceback (most recent call last):
  File "/usr/lib/python2.7/unittest/loader.py", line 254, in _find_tests
    module = self._get_module_from_name(name)
  File "/usr/lib/python2.7/unittest/loader.py", line 232, in _get_module_from_name
    __import__(name)
  File "/home/jenkins/workspace/e-mission-server-prb/emission/tests/netTests/TestFormatters.py", line 6, in <module>
    from future import standard_library
ImportError: No module named future


======================================================================
ERROR: netTests.TestMetricsCleanedSections (unittest.loader.ModuleImportFailure)
----------------------------------------------------------------------
ImportError: Failed to import test module: netTests.TestMetricsCleanedSections
Traceback (most recent call last):
  File "/usr/lib/python2.7/unittest/loader.py", line 254, in _find_tests
    module = self._get_module_from_name(name)
  File "/usr/lib/python2.7/unittest/loader.py", line 232, in _get_module_from_name
    __import__(name)
  File "/home/jenkins/workspace/e-mission-server-prb/emission/tests/netTests/TestMetricsCleanedSections.py", line 5, in <module>
    from future import standard_library
ImportError: No module named future


======================================================================
ERROR: netTests.TestPush (unittest.loader.ModuleImportFailure)
----------------------------------------------------------------------
ImportError: Failed to import test module: netTests.TestPush
Traceback (most recent call last):
  File "/usr/lib/python2.7/unittest/loader.py", line 254, in _find_tests
    module = self._get_module_from_name(name)
  File "/usr/lib/python2.7/unittest/loader.py", line 232, in _get_module_from_name
    __import__(name)
  File "/home/jenkins/workspace/e-mission-server-prb/emission/tests/netTests/TestPush.py", line 6, in <module>
    from future import standard_library
ImportError: No module named future


======================================================================
ERROR: netTests.TestBuiltinUserCache (unittest.loader.ModuleImportFailure)
----------------------------------------------------------------------
ImportError: Failed to import test module: netTests.TestBuiltinUserCache
Traceback (most recent call last):
  File "/usr/lib/python2.7/unittest/loader.py", line 254, in _find_tests
    module = self._get_module_from_name(name)
  File "/usr/lib/python2.7/unittest/loader.py", line 232, in _get_module_from_name
    __import__(name)
  File "/home/jenkins/workspace/e-mission-server-prb/emission/tests/netTests/TestBuiltinUserCache.py", line 6, in <module>
    from future import standard_library
ImportError: No module named future


======================================================================
ERROR: netTests.TestVisualize (unittest.loader.ModuleImportFailure)
----------------------------------------------------------------------
ImportError: Failed to import test module: netTests.TestVisualize
Traceback (most recent call last):
  File "/usr/lib/python2.7/unittest/loader.py", line 254, in _find_tests
    module = self._get_module_from_name(name)
  File "/usr/lib/python2.7/unittest/loader.py", line 232, in _get_module_from_name
    __import__(name)
  File "/home/jenkins/workspace/e-mission-server-prb/emission/tests/netTests/TestVisualize.py", line 6, in <module>
    from future import standard_library
ImportError: No module named future


======================================================================
ERROR: netTests.TestBuiltinUserCacheHandlerOutput (unittest.loader.ModuleImportFailure)
----------------------------------------------------------------------
ImportError: Failed to import test module: netTests.TestBuiltinUserCacheHandlerOutput
Traceback (most recent call last):
  File "/usr/lib/python2.7/unittest/loader.py", line 254, in _find_tests
    module = self._get_module_from_name(name)
  File "/usr/lib/python2.7/unittest/loader.py", line 232, in _get_module_from_name
    __import__(name)
  File "/home/jenkins/workspace/e-mission-server-prb/emission/tests/netTests/TestBuiltinUserCacheHandlerOutput.py", line 6, in <module>
    from future import standard_library
ImportError: No module named future


======================================================================
ERROR: netTests.TestBuiltinUserCacheHandlerInput (unittest.loader.ModuleImportFailure)
----------------------------------------------------------------------
ImportError: Failed to import test module: netTests.TestBuiltinUserCacheHandlerInput
Traceback (most recent call last):
  File "/usr/lib/python2.7/unittest/loader.py", line 254, in _find_tests
    module = self._get_module_from_name(name)
  File "/usr/lib/python2.7/unittest/loader.py", line 232, in _get_module_from_name
    __import__(name)
  File "/home/jenkins/workspace/e-mission-server-prb/emission/tests/netTests/TestBuiltinUserCacheHandlerInput.py", line 6, in <module>
    from future import standard_library
ImportError: No module named future


======================================================================
ERROR: netTests.TestAuthSelection (unittest.loader.ModuleImportFailure)
----------------------------------------------------------------------
ImportError: Failed to import test module: netTests.TestAuthSelection
Traceback (most recent call last):
  File "/usr/lib/python2.7/unittest/loader.py", line 254, in _find_tests
    module = self._get_module_from_name(name)
  File "/usr/lib/python2.7/unittest/loader.py", line 232, in _get_module_from_name
    __import__(name)
  File "/home/jenkins/workspace/e-mission-server-prb/emission/tests/netTests/TestAuthSelection.py", line 6, in <module>
    from future import standard_library
ImportError: No module named future


======================================================================
ERROR: coreTests.TestEntry (unittest.loader.ModuleImportFailure)
----------------------------------------------------------------------
ImportError: Failed to import test module: coreTests.TestEntry
Traceback (most recent call last):
  File "/usr/lib/python2.7/unittest/loader.py", line 254, in _find_tests
    module = self._get_module_from_name(name)
  File "/usr/lib/python2.7/unittest/loader.py", line 232, in _get_module_from_name
    __import__(name)
  File "/home/jenkins/workspace/e-mission-server-prb/emission/tests/coreTests/TestEntry.py", line 9, in <module>
    from future import standard_library
ImportError: No module named future


======================================================================
ERROR: coreTests.TestBase (unittest.loader.ModuleImportFailure)
----------------------------------------------------------------------
ImportError: Failed to import test module: coreTests.TestBase
Traceback (most recent call last):
  File "/usr/lib/python2.7/unittest/loader.py", line 254, in _find_tests
    module = self._get_module_from_name(name)
  File "/usr/lib/python2.7/unittest/loader.py", line 232, in _get_module_from_name
    __import__(name)
  File "/home/jenkins/workspace/e-mission-server-prb/emission/tests/coreTests/TestBase.py", line 10, in <module>
    from future import standard_library
ImportError: No module named future


======================================================================
ERROR: coreTests.wrapperTests.TestUser (unittest.loader.ModuleImportFailure)
----------------------------------------------------------------------
ImportError: Failed to import test module: coreTests.wrapperTests.TestUser
Traceback (most recent call last):
  File "/usr/lib/python2.7/unittest/loader.py", line 254, in _find_tests
    module = self._get_module_from_name(name)
  File "/usr/lib/python2.7/unittest/loader.py", line 232, in _get_module_from_name
    __import__(name)
  File "/home/jenkins/workspace/e-mission-server-prb/emission/tests/coreTests/wrapperTests/TestUser.py", line 6, in <module>
    from future import standard_library
ImportError: No module named future


======================================================================
ERROR: coreTests.wrapperTests.TestClient (unittest.loader.ModuleImportFailure)
----------------------------------------------------------------------
ImportError: Failed to import test module: coreTests.wrapperTests.TestClient
Traceback (most recent call last):
  File "/usr/lib/python2.7/unittest/loader.py", line 254, in _find_tests
    module = self._get_module_from_name(name)
  File "/usr/lib/python2.7/unittest/loader.py", line 232, in _get_module_from_name
    __import__(name)
  File "/home/jenkins/workspace/e-mission-server-prb/emission/tests/coreTests/wrapperTests/TestClient.py", line 6, in <module>
    from future import standard_library
ImportError: No module named future


======================================================================
ERROR: analysisTests.intakeTests.TestCleanAndResample (unittest.loader.ModuleImportFailure)
----------------------------------------------------------------------
ImportError: Failed to import test module: analysisTests.intakeTests.TestCleanAndResample
Traceback (most recent call last):
  File "/usr/lib/python2.7/unittest/loader.py", line 254, in _find_tests
    module = self._get_module_from_name(name)
  File "/usr/lib/python2.7/unittest/loader.py", line 232, in _get_module_from_name
    __import__(name)
  File "/home/jenkins/workspace/e-mission-server-prb/emission/tests/analysisTests/intakeTests/TestCleanAndResample.py", line 6, in <module>
    from future import standard_library
ImportError: No module named future


======================================================================
ERROR: analysisTests.intakeTests.TestLocationSmoothing (unittest.loader.ModuleImportFailure)
----------------------------------------------------------------------
ImportError: Failed to import test module: analysisTests.intakeTests.TestLocationSmoothing
Traceback (most recent call last):
  File "/usr/lib/python2.7/unittest/loader.py", line 254, in _find_tests
    module = self._get_module_from_name(name)
  File "/usr/lib/python2.7/unittest/loader.py", line 232, in _get_module_from_name
    __import__(name)
  File "/home/jenkins/workspace/e-mission-server-prb/emission/tests/analysisTests/intakeTests/TestLocationSmoothing.py", line 6, in <module>
    from future import standard_library
ImportError: No module named future


======================================================================
ERROR: analysisTests.intakeTests.TestFilterAccuracy (unittest.loader.ModuleImportFailure)
----------------------------------------------------------------------
ImportError: Failed to import test module: analysisTests.intakeTests.TestFilterAccuracy
Traceback (most recent call last):
  File "/usr/lib/python2.7/unittest/loader.py", line 254, in _find_tests
    module = self._get_module_from_name(name)
  File "/usr/lib/python2.7/unittest/loader.py", line 232, in _get_module_from_name
    __import__(name)
  File "/home/jenkins/workspace/e-mission-server-prb/emission/tests/analysisTests/intakeTests/TestFilterAccuracy.py", line 6, in <module>
    from future import standard_library
ImportError: No module named future


======================================================================
ERROR: analysisTests.intakeTests.TestSectionSegmentation (unittest.loader.ModuleImportFailure)
----------------------------------------------------------------------
ImportError: Failed to import test module: analysisTests.intakeTests.TestSectionSegmentation
Traceback (most recent call last):
  File "/usr/lib/python2.7/unittest/loader.py", line 254, in _find_tests
    module = self._get_module_from_name(name)
  File "/usr/lib/python2.7/unittest/loader.py", line 232, in _get_module_from_name
    __import__(name)
  File "/home/jenkins/workspace/e-mission-server-prb/emission/tests/analysisTests/intakeTests/TestSectionSegmentation.py", line 6, in <module>
    from future import standard_library
ImportError: No module named future


======================================================================
ERROR: analysisTests.intakeTests.TestPipelineRealData (unittest.loader.ModuleImportFailure)
----------------------------------------------------------------------
ImportError: Failed to import test module: analysisTests.intakeTests.TestPipelineRealData
Traceback (most recent call last):
  File "/usr/lib/python2.7/unittest/loader.py", line 254, in _find_tests
    module = self._get_module_from_name(name)
  File "/usr/lib/python2.7/unittest/loader.py", line 232, in _get_module_from_name
    __import__(name)
  File "/home/jenkins/workspace/e-mission-server-prb/emission/tests/analysisTests/intakeTests/TestPipelineRealData.py", line 28, in <module>
    from future import standard_library
ImportError: No module named future


======================================================================
ERROR: analysisTests.intakeTests.TestTripSegmentation (unittest.loader.ModuleImportFailure)
----------------------------------------------------------------------
ImportError: Failed to import test module: analysisTests.intakeTests.TestTripSegmentation
Traceback (most recent call last):
  File "/usr/lib/python2.7/unittest/loader.py", line 254, in _find_tests
    module = self._get_module_from_name(name)
  File "/usr/lib/python2.7/unittest/loader.py", line 232, in _get_module_from_name
    __import__(name)
  File "/home/jenkins/workspace/e-mission-server-prb/emission/tests/analysisTests/intakeTests/TestTripSegmentation.py", line 6, in <module>
    from future import standard_library
ImportError: No module named future


======================================================================
ERROR: analysisTests.resultTests.TestTimeGrouping (unittest.loader.ModuleImportFailure)
----------------------------------------------------------------------
ImportError: Failed to import test module: analysisTests.resultTests.TestTimeGrouping
Traceback (most recent call last):
  File "/usr/lib/python2.7/unittest/loader.py", line 254, in _find_tests
    module = self._get_module_from_name(name)
  File "/usr/lib/python2.7/unittest/loader.py", line 232, in _get_module_from_name
    __import__(name)
  File "/home/jenkins/workspace/e-mission-server-prb/emission/tests/analysisTests/resultTests/TestTimeGrouping.py", line 6, in <module>
    from future import standard_library
ImportError: No module named future


======================================================================
ERROR: analysisTests.plottingTests.TestGeojsonFeatureConverter (unittest.loader.ModuleImportFailure)
----------------------------------------------------------------------
ImportError: Failed to import test module: analysisTests.plottingTests.TestGeojsonFeatureConverter
Traceback (most recent call last):
  File "/usr/lib/python2.7/unittest/loader.py", line 254, in _find_tests
    module = self._get_module_from_name(name)
  File "/usr/lib/python2.7/unittest/loader.py", line 232, in _get_module_from_name
    __import__(name)
  File "/home/jenkins/workspace/e-mission-server-prb/emission/tests/analysisTests/plottingTests/TestGeojsonFeatureConverter.py", line 6, in <module>
    from future import standard_library
ImportError: No module named future


======================================================================
ERROR: analysisTests.configTests.TestSaveAllConfigs (unittest.loader.ModuleImportFailure)
----------------------------------------------------------------------
ImportError: Failed to import test module: analysisTests.configTests.TestSaveAllConfigs
Traceback (most recent call last):
  File "/usr/lib/python2.7/unittest/loader.py", line 254, in _find_tests
    module = self._get_module_from_name(name)
  File "/usr/lib/python2.7/unittest/loader.py", line 232, in _get_module_from_name
    __import__(name)
  File "/home/jenkins/workspace/e-mission-server-prb/emission/tests/analysisTests/configTests/TestSaveAllConfigs.py", line 6, in <module>
    from future import standard_library
ImportError: No module named future


======================================================================
ERROR: analysisTests.modeinferTests.TestFeatureCalc (unittest.loader.ModuleImportFailure)
----------------------------------------------------------------------
ImportError: Failed to import test module: analysisTests.modeinferTests.TestFeatureCalc
Traceback (most recent call last):
  File "/usr/lib/python2.7/unittest/loader.py", line 254, in _find_tests
    module = self._get_module_from_name(name)
  File "/usr/lib/python2.7/unittest/loader.py", line 232, in _get_module_from_name
    __import__(name)
  File "/home/jenkins/workspace/e-mission-server-prb/emission/tests/analysisTests/modeinferTests/TestFeatureCalc.py", line 5, in <module>
    from future import standard_library
ImportError: No module named future


======================================================================
ERROR: analysisTests.modeinferTests.TestPipeline (unittest.loader.ModuleImportFailure)
----------------------------------------------------------------------
ImportError: Failed to import test module: analysisTests.modeinferTests.TestPipeline
Traceback (most recent call last):
  File "/usr/lib/python2.7/unittest/loader.py", line 254, in _find_tests
    module = self._get_module_from_name(name)
  File "/usr/lib/python2.7/unittest/loader.py", line 232, in _get_module_from_name
    __import__(name)
  File "/home/jenkins/workspace/e-mission-server-prb/emission/tests/analysisTests/modeinferTests/TestPipeline.py", line 6, in <module>
    from future import standard_library
ImportError: No module named future


======================================================================
ERROR: analysisTests.modeinferTests.TestPipelineSeed (unittest.loader.ModuleImportFailure)
----------------------------------------------------------------------
ImportError: Failed to import test module: analysisTests.modeinferTests.TestPipelineSeed
Traceback (most recent call last):
  File "/usr/lib/python2.7/unittest/loader.py", line 254, in _find_tests
    module = self._get_module_from_name(name)
  File "/usr/lib/python2.7/unittest/loader.py", line 232, in _get_module_from_name
    __import__(name)
  File "/home/jenkins/workspace/e-mission-server-prb/emission/tests/analysisTests/modeinferTests/TestPipelineSeed.py", line 5, in <module>
    import numpy as np
ImportError: No module named numpy


----------------------------------------------------------------------
Ran 35 tests in 0.001s

FAILED (errors=35)
Removing environment from 
setup/teardown_tests.sh: line 4: deactivate: No such file or directory
setup/teardown_tests.sh: line 5: conda: command not found
Build step 'Execute shell' marked build as failure
Sending e-mails to: shankari@eecs.berkeley.edu
Test FAILed.
Refer to this link for build results (access rights to CI server needed): 
https://amplab.cs.berkeley.edu/jenkins//job/e-mission-server-prb/1177/
Test FAILed.
Finished: FAILURE