Console Output

Skipping 1,710 KB.. Full Log
[INFO] 
[INFO] --- scala-maven-plugin:4.3.0:testCompile (scala-test-compile-first) @ spark-token-provider-kafka-0-10_2.13 ---
[INFO] Using incremental compilation using Mixed compile order
[INFO] Compiler bridge file: /home/jenkins/.sbt/1.0/zinc/org.scala-sbt/org.scala-sbt-compiler-bridge_2.13-1.3.1-bin_2.13.4__52.0-1.3.1_20191012T045515.jar
[INFO] Compiling 6 Scala sources to /home/jenkins/workspace/spark-branch-3.1-test-maven-hadoop-2.7-scala-2.13/external/kafka-0-10-token-provider/target/scala-2.13/test-classes ...
[INFO] Done compiling.
[INFO] compile in 14.0 s
[INFO] 
[INFO] --- maven-surefire-plugin:3.0.0-M5:test (default-test) @ spark-token-provider-kafka-0-10_2.13 ---
[INFO] 
[INFO] -------------------------------------------------------
[INFO]  T E S T S
[INFO] -------------------------------------------------------
[INFO] 
[INFO] Results:
[INFO] 
[INFO] Tests run: 0, Failures: 0, Errors: 0, Skipped: 0
[INFO] 
[INFO] 
[INFO] --- maven-surefire-plugin:3.0.0-M5:test (test) @ spark-token-provider-kafka-0-10_2.13 ---
[INFO] Skipping execution of surefire because it has already been run for this configuration
[INFO] 
[INFO] --- scalatest-maven-plugin:2.0.0:test (test) @ spark-token-provider-kafka-0-10_2.13 ---
Discovery starting.
Discovery completed in 321 milliseconds.
Run starting. Expected test count is: 44
KafkaHadoopDelegationTokenManagerSuite:
- default configuration
KafkaConfigUpdaterSuite:
- set should always set value
- setIfUnset without existing key should set value
- setIfUnset with existing key should not set value
- setAuthenticationConfigIfNeeded with global security should not set values
- setAuthenticationConfigIfNeeded with token should set values
- setAuthenticationConfigIfNeeded with token should not override user-defined protocol
- setAuthenticationConfigIfNeeded with invalid mechanism should throw exception
- setAuthenticationConfigIfNeeded without security should not set values
KafkaTokenUtilSuite:
- checkProxyUser with proxy current user should throw exception
- createAdminClientProperties with SASL_PLAINTEXT protocol should not include keystore and truststore config
- createAdminClientProperties with SASL_SSL protocol should include truststore config
- createAdminClientProperties with SSL protocol should include keystore and truststore config
- createAdminClientProperties with global config should not set dynamic jaas config
- createAdminClientProperties with keytab should set keytab dynamic jaas config
- createAdminClientProperties without keytab should set ticket cache dynamic jaas config
- createAdminClientProperties with specified params should include it
- isGlobalJaasConfigurationProvided without global config should return false
- isGlobalJaasConfigurationProvided with global config should return false
- findMatchingTokenClusterConfig without token should return None
- findMatchingTokenClusterConfig with non-matching tokens should return None
- findMatchingTokenClusterConfig with one matching token should return token and cluster configuration
- findMatchingTokenClusterConfig with multiple matching tokens should throw exception
- getTokenJaasParams with token should return scram module
- needTokenUpdate without cluster config should return false
- needTokenUpdate without jaas config should return false
- needTokenUpdate with same token should return false
- needTokenUpdate with different token should return true
KafkaRedactionUtilSuite:
- redactParams shouldn't throw exception when no SparkEnv available
- redactParams should give back empty parameters
- redactParams should give back null value
- redactParams should redact non String parameters
- redactParams should redact token password from parameters
- redactParams should redact passwords from parameters
- redactJaasParam should give back null
- redactJaasParam should give back empty string
- redactJaasParam should redact token password
KafkaTokenSparkConfSuite:
- getClusterConfig should trow exception when not exists
- getClusterConfig should return entry with defaults
- getClusterConfig should return entry overwrite defaults
- getClusterConfig should return specified kafka params
- getAllClusterConfigs should return empty list when nothing configured
- getAllClusterConfigs should return empty list with malformed configuration
- getAllClusterConfigs should return multiple entries
Run completed in 2 seconds, 220 milliseconds.
Total number of tests run: 44
Suites: completed 6, aborted 0
Tests: succeeded 44, failed 0, canceled 0, ignored 0, pending 0
All tests passed.
[INFO] 
[INFO] ----------< org.apache.spark:spark-streaming-kafka-0-10_2.13 >----------
[INFO] Building Spark Integration for Kafka 0.10 3.1.3-SNAPSHOT         [20/31]
[INFO] --------------------------------[ jar ]---------------------------------
[INFO] 
[INFO] --- maven-enforcer-plugin:3.0.0-M2:enforce (enforce-versions) @ spark-streaming-kafka-0-10_2.13 ---
[INFO] 
[INFO] --- maven-enforcer-plugin:3.0.0-M2:enforce (enforce-no-duplicate-dependencies) @ spark-streaming-kafka-0-10_2.13 ---
[INFO] 
[INFO] --- mvn-scalafmt_2.13:1.0.3:format (default) @ spark-streaming-kafka-0-10_2.13 ---
[WARNING] format.skipSources set, ignoring main directories
[WARNING] format.skipTestSources set, ignoring validateOnly directories
[WARNING] No sources specified, skipping formatting
[INFO] 
[INFO] --- scala-maven-plugin:4.3.0:add-source (eclipse-add-source) @ spark-streaming-kafka-0-10_2.13 ---
[INFO] Add Source directory: /home/jenkins/workspace/spark-branch-3.1-test-maven-hadoop-2.7-scala-2.13/external/kafka-0-10/src/main/scala
[INFO] Add Test Source directory: /home/jenkins/workspace/spark-branch-3.1-test-maven-hadoop-2.7-scala-2.13/external/kafka-0-10/src/test/scala
[INFO] 
[INFO] --- maven-dependency-plugin:3.1.1:build-classpath (default-cli) @ spark-streaming-kafka-0-10_2.13 ---
[INFO] Dependencies classpath:
/home/jenkins/.m2/repository/org/apache/hadoop/hadoop-mapreduce-client-common/2.7.4/hadoop-mapreduce-client-common-2.7.4.jar:/home/jenkins/.m2/repository/log4j/log4j/1.2.17/log4j-1.2.17.jar:/home/jenkins/.m2/repository/org/apache/htrace/htrace-core/3.1.0-incubating/htrace-core-3.1.0-incubating.jar:/home/jenkins/.m2/repository/com/google/protobuf/protobuf-java/2.5.0/protobuf-java-2.5.0.jar:/home/jenkins/.m2/repository/org/apache/hadoop/hadoop-mapreduce-client-jobclient/2.7.4/hadoop-mapreduce-client-jobclient-2.7.4.jar:/home/jenkins/.m2/repository/org/slf4j/slf4j-log4j12/1.7.30/slf4j-log4j12-1.7.30.jar:/home/jenkins/.m2/repository/org/apache/curator/curator-framework/2.7.1/curator-framework-2.7.1.jar:/home/jenkins/.m2/repository/org/apache/curator/curator-recipes/2.7.1/curator-recipes-2.7.1.jar:/home/jenkins/.m2/repository/com/github/luben/zstd-jni/1.4.8-1/zstd-jni-1.4.8-1.jar:/home/jenkins/.m2/repository/com/thoughtworks/paranamer/paranamer/2.8/paranamer-2.8.jar:/home/jenkins/.m2/repository/io/netty/netty-all/4.1.51.Final/netty-all-4.1.51.Final.jar:/home/jenkins/.m2/repository/org/apache/avro/avro/1.8.2/avro-1.8.2.jar:/home/jenkins/.m2/repository/org/apache/directory/server/apacheds-kerberos-codec/2.0.0-M15/apacheds-kerberos-codec-2.0.0-M15.jar:/home/jenkins/.m2/repository/org/apache/hadoop/hadoop-client/2.7.4/hadoop-client-2.7.4.jar:/home/jenkins/.m2/repository/com/google/code/findbugs/jsr305/3.0.0/jsr305-3.0.0.jar:/home/jenkins/.m2/repository/xml-apis/xml-apis/1.4.01/xml-apis-1.4.01.jar:/home/jenkins/.m2/repository/org/tukaani/xz/1.5/xz-1.5.jar:/home/jenkins/.m2/repository/org/mortbay/jetty/jetty-util/6.1.26/jetty-util-6.1.26.jar:/home/jenkins/.m2/repository/org/apache/hadoop/hadoop-yarn-api/2.7.4/hadoop-yarn-api-2.7.4.jar:/home/jenkins/.m2/repository/org/apache/hadoop/hadoop-common/2.7.4/hadoop-common-2.7.4.jar:/home/jenkins/.m2/repository/commons-io/commons-io/2.4/commons-io-2.4.jar:/home/jenkins/.m2/repository/org/codehaus/jackson/jackson-mapper-asl/1.9.13/jackson-mapper-asl-1.9.13.jar:/home/jenkins/.m2/repository/javax/servlet/jsp/jsp-api/2.1/jsp-api-2.1.jar:/home/jenkins/.m2/repository/org/apache/hadoop/hadoop-yarn-server-common/2.7.4/hadoop-yarn-server-common-2.7.4.jar:/home/jenkins/.m2/repository/org/codehaus/jackson/jackson-jaxrs/1.9.13/jackson-jaxrs-1.9.13.jar:/home/jenkins/.m2/repository/org/apache/hadoop/hadoop-yarn-client/2.7.4/hadoop-yarn-client-2.7.4.jar:/home/jenkins/.m2/repository/org/apache/hadoop/hadoop-mapreduce-client-app/2.7.4/hadoop-mapreduce-client-app-2.7.4.jar:/home/jenkins/.m2/repository/org/apache/avro/avro-ipc/1.8.2/avro-ipc-1.8.2.jar:/home/jenkins/.m2/repository/xmlenc/xmlenc/0.52/xmlenc-0.52.jar:/home/jenkins/.m2/repository/org/slf4j/slf4j-api/1.7.30/slf4j-api-1.7.30.jar:/home/jenkins/.m2/repository/org/codehaus/jackson/jackson-core-asl/1.9.13/jackson-core-asl-1.9.13.jar:/home/jenkins/.m2/repository/org/apache/directory/api/api-util/1.0.0-M20/api-util-1.0.0-M20.jar:/home/jenkins/.m2/repository/xerces/xercesImpl/2.12.0/xercesImpl-2.12.0.jar:/home/jenkins/.m2/repository/org/apache/hadoop/hadoop-yarn-common/2.7.4/hadoop-yarn-common-2.7.4.jar:/home/jenkins/.m2/repository/com/google/code/gson/gson/2.2.4/gson-2.2.4.jar:/home/jenkins/workspace/spark-branch-3.1-test-maven-hadoop-2.7-scala-2.13/external/kafka-0-10-token-provider/target/scala-2.13/classes:/home/jenkins/.m2/repository/org/apache/directory/api/api-asn1-api/1.0.0-M20/api-asn1-api-1.0.0-M20.jar:/home/jenkins/.m2/repository/org/apache/hadoop/hadoop-annotations/2.7.4/hadoop-annotations-2.7.4.jar:/home/jenkins/.m2/repository/org/apache/commons/commons-compress/1.21/commons-compress-1.21.jar:/home/jenkins/.m2/repository/commons-configuration/commons-configuration/1.6/commons-configuration-1.6.jar:/home/jenkins/.m2/repository/commons-net/commons-net/3.1/commons-net-3.1.jar:/home/jenkins/.m2/repository/commons-digester/commons-digester/1.8/commons-digester-1.8.jar:/home/jenkins/.m2/repository/org/apache/directory/server/apacheds-i18n/2.0.0-M15/apacheds-i18n-2.0.0-M15.jar:/home/jenkins/.m2/repository/org/lz4/lz4-java/1.7.1/lz4-java-1.7.1.jar:/home/jenkins/.m2/repository/javax/xml/bind/jaxb-api/2.2.2/jaxb-api-2.2.2.jar:/home/jenkins/.m2/repository/org/apache/kafka/kafka-clients/2.6.0/kafka-clients-2.6.0.jar:/home/jenkins/.m2/repository/org/scala-lang/scala-library/2.13.4/scala-library-2.13.4.jar:/home/jenkins/.m2/repository/commons-lang/commons-lang/2.6/commons-lang-2.6.jar:/home/jenkins/.m2/repository/org/mortbay/jetty/jetty-sslengine/6.1.26/jetty-sslengine-6.1.26.jar:/home/jenkins/.m2/repository/org/apache/curator/curator-client/2.7.1/curator-client-2.7.1.jar:/home/jenkins/.m2/repository/org/apache/hadoop/hadoop-hdfs/2.7.4/hadoop-hdfs-2.7.4.jar:/home/jenkins/.m2/repository/org/xerial/snappy/snappy-java/1.1.8.2/snappy-java-1.1.8.2.jar:/home/jenkins/.m2/repository/org/apache/hadoop/hadoop-auth/2.7.4/hadoop-auth-2.7.4.jar:/home/jenkins/.m2/repository/javax/activation/activation/1.1.1/activation-1.1.1.jar:/home/jenkins/.m2/repository/org/apache/hadoop/hadoop-mapreduce-client-shuffle/2.7.4/hadoop-mapreduce-client-shuffle-2.7.4.jar:/home/jenkins/.m2/repository/commons-cli/commons-cli/1.2/commons-cli-1.2.jar:/home/jenkins/.m2/repository/commons-codec/commons-codec/1.10/commons-codec-1.10.jar:/home/jenkins/.m2/repository/org/apache/httpcomponents/httpcore/4.4.12/httpcore-4.4.12.jar:/home/jenkins/.m2/repository/commons-beanutils/commons-beanutils/1.9.4/commons-beanutils-1.9.4.jar:/home/jenkins/.m2/repository/org/spark-project/spark/unused/1.0.0/unused-1.0.0.jar:/home/jenkins/.m2/repository/org/apache/hadoop/hadoop-mapreduce-client-core/2.7.4/hadoop-mapreduce-client-core-2.7.4.jar:/home/jenkins/.m2/repository/org/apache/commons/commons-math3/3.4.1/commons-math3-3.4.1.jar:/home/jenkins/.m2/repository/commons-collections/commons-collections/3.2.2/commons-collections-3.2.2.jar:/home/jenkins/.m2/repository/javax/xml/stream/stax-api/1.0-2/stax-api-1.0-2.jar:/home/jenkins/.m2/repository/org/codehaus/jackson/jackson-xc/1.9.13/jackson-xc-1.9.13.jar:/home/jenkins/.m2/repository/org/apache/httpcomponents/httpclient/4.5.6/httpclient-4.5.6.jar:/home/jenkins/workspace/spark-branch-3.1-test-maven-hadoop-2.7-scala-2.13/common/tags/target/scala-2.13/classes:/home/jenkins/.m2/repository/org/apache/avro/avro-mapred/1.8.2/avro-mapred-1.8.2-hadoop2.jar:/home/jenkins/.m2/repository/commons-httpclient/commons-httpclient/3.1/commons-httpclient-3.1.jar
[INFO] 
[INFO] --- maven-remote-resources-plugin:1.5:process (process-resource-bundles) @ spark-streaming-kafka-0-10_2.13 ---
[INFO] 
[INFO] --- maven-resources-plugin:2.7:resources (default-resources) @ spark-streaming-kafka-0-10_2.13 ---
[INFO] Using 'UTF-8' encoding to copy filtered resources.
[INFO] skip non existing resourceDirectory /home/jenkins/workspace/spark-branch-3.1-test-maven-hadoop-2.7-scala-2.13/external/kafka-0-10/src/main/resources
[INFO] Copying 3 resources
[INFO] 
[INFO] --- maven-compiler-plugin:3.8.1:compile (default-compile) @ spark-streaming-kafka-0-10_2.13 ---
[INFO] Not compiling main sources
[INFO] 
[INFO] --- scala-maven-plugin:4.3.0:compile (scala-compile-first) @ spark-streaming-kafka-0-10_2.13 ---
[INFO] Using incremental compilation using Mixed compile order
[INFO] Compiler bridge file: /home/jenkins/.sbt/1.0/zinc/org.scala-sbt/org.scala-sbt-compiler-bridge_2.13-1.3.1-bin_2.13.4__52.0-1.3.1_20191012T045515.jar
[INFO] Compiling 10 Scala sources and 1 Java source to /home/jenkins/workspace/spark-branch-3.1-test-maven-hadoop-2.7-scala-2.13/external/kafka-0-10/target/scala-2.13/classes ...
[WARNING] [Warn] /home/jenkins/workspace/spark-branch-3.1-test-maven-hadoop-2.7-scala-2.13/external/kafka-0-10/src/main/scala/org/apache/spark/streaming/kafka010/ConsumerStrategy.scala:108: [deprecation @ org.apache.spark.streaming.kafka010.Subscribe.onStart | origin=org.apache.kafka.clients.consumer.KafkaConsumer.poll | version=] method poll in class KafkaConsumer is deprecated
[WARNING] [Warn] /home/jenkins/workspace/spark-branch-3.1-test-maven-hadoop-2.7-scala-2.13/external/kafka-0-10/src/main/scala/org/apache/spark/streaming/kafka010/ConsumerStrategy.scala:162: [deprecation @ org.apache.spark.streaming.kafka010.SubscribePattern.onStart | origin=org.apache.kafka.clients.consumer.KafkaConsumer.poll | version=] method poll in class KafkaConsumer is deprecated
[WARNING] [Warn] /home/jenkins/workspace/spark-branch-3.1-test-maven-hadoop-2.7-scala-2.13/external/kafka-0-10/src/main/scala/org/apache/spark/streaming/kafka010/DirectKafkaInputDStream.scala:172: [deprecation @ org.apache.spark.streaming.kafka010.DirectKafkaInputDStream.paranoidPoll.msgs | origin=org.apache.kafka.clients.consumer.Consumer.poll | version=] method poll in trait Consumer is deprecated
[WARNING] three warnings found
[INFO] Done compiling.
[INFO] compile in 14.6 s
[INFO] 
[INFO] --- maven-antrun-plugin:1.8:run (create-tmp-dir) @ spark-streaming-kafka-0-10_2.13 ---
[INFO] Executing tasks

main:
    [mkdir] Created dir: /home/jenkins/workspace/spark-branch-3.1-test-maven-hadoop-2.7-scala-2.13/external/kafka-0-10/target/tmp
[INFO] Executed tasks
[INFO] 
[INFO] --- maven-resources-plugin:2.7:testResources (default-testResources) @ spark-streaming-kafka-0-10_2.13 ---
[INFO] Using 'UTF-8' encoding to copy filtered resources.
[INFO] Copying 1 resource
[INFO] Copying 3 resources
[INFO] 
[INFO] --- maven-compiler-plugin:3.8.1:testCompile (default-testCompile) @ spark-streaming-kafka-0-10_2.13 ---
[INFO] Not compiling test sources
[INFO] 
[INFO] --- maven-dependency-plugin:3.1.1:build-classpath (generate-test-classpath) @ spark-streaming-kafka-0-10_2.13 ---
[INFO] Dependencies classpath:
/home/jenkins/.m2/repository/net/jcip/jcip-annotations/1.0/jcip-annotations-1.0.jar:/home/jenkins/.m2/repository/com/google/crypto/tink/tink/1.6.0/tink-1.6.0.jar:/home/jenkins/.m2/repository/org/glassfish/hk2/external/jakarta.inject/2.6.1/jakarta.inject-2.6.1.jar:/home/jenkins/.m2/repository/org/apache/htrace/htrace-core/3.1.0-incubating/htrace-core-3.1.0-incubating.jar:/home/jenkins/.m2/repository/com/google/protobuf/protobuf-java/2.5.0/protobuf-java-2.5.0.jar:/home/jenkins/.m2/repository/org/apache/hadoop/hadoop-mapreduce-client-jobclient/2.7.4/hadoop-mapreduce-client-jobclient-2.7.4.jar:/home/jenkins/.m2/repository/org/eclipse/jetty/jetty-plus/9.4.40.v20210413/jetty-plus-9.4.40.v20210413.jar:/home/jenkins/.m2/repository/jakarta/servlet/jakarta.servlet-api/4.0.3/jakarta.servlet-api-4.0.3.jar:/home/jenkins/workspace/spark-branch-3.1-test-maven-hadoop-2.7-scala-2.13/core/target/scala-2.13/classes:/home/jenkins/.m2/repository/com/google/code/findbugs/jsr305/3.0.0/jsr305-3.0.0.jar:/home/jenkins/.m2/repository/org/scalatest/scalatest-shouldmatchers_2.13/3.2.3/scalatest-shouldmatchers_2.13-3.2.3.jar:/home/jenkins/.m2/repository/org/glassfish/jersey/media/jersey-media-jaxb/2.30/jersey-media-jaxb-2.30.jar:/home/jenkins/.m2/repository/com/fasterxml/jackson/dataformat/jackson-dataformat-csv/2.10.2/jackson-dataformat-csv-2.10.2.jar:/home/jenkins/.m2/repository/org/scalatest/scalatest-funsuite_2.13/3.2.3/scalatest-funsuite_2.13-3.2.3.jar:/home/jenkins/.m2/repository/org/eclipse/jetty/jetty-http/9.4.40.v20210413/jetty-http-9.4.40.v20210413.jar:/home/jenkins/.m2/repository/org/codehaus/jackson/jackson-jaxrs/1.9.13/jackson-jaxrs-1.9.13.jar:/home/jenkins/.m2/repository/org/eclipse/jetty/jetty-jndi/9.4.40.v20210413/jetty-jndi-9.4.40.v20210413.jar:/home/jenkins/.m2/repository/org/scalatest/scalatest-featurespec_2.13/3.2.3/scalatest-featurespec_2.13-3.2.3.jar:/home/jenkins/.m2/repository/org/scalatest/scalatest-funspec_2.13/3.2.3/scalatest-funspec_2.13-3.2.3.jar:/home/jenkins/.m2/repository/xerces/xercesImpl/2.12.0/xercesImpl-2.12.0.jar:/home/jenkins/.m2/repository/org/apache-extras/beanshell/bsh/2.0b6/bsh-2.0b6.jar:/home/jenkins/.m2/repository/net/bytebuddy/byte-buddy/1.10.13/byte-buddy-1.10.13.jar:/home/jenkins/.m2/repository/org/json4s/json4s-core_2.13/3.7.0-M5/json4s-core_2.13-3.7.0-M5.jar:/home/jenkins/.m2/repository/org/eclipse/jetty/jetty-util/9.4.40.v20210413/jetty-util-9.4.40.v20210413.jar:/home/jenkins/.m2/repository/com/twitter/chill-java/0.9.5/chill-java-0.9.5.jar:/home/jenkins/.m2/repository/commons-net/commons-net/3.1/commons-net-3.1.jar:/home/jenkins/workspace/spark-branch-3.1-test-maven-hadoop-2.7-scala-2.13/streaming/target/scala-2.13/classes:/home/jenkins/.m2/repository/org/json4s/json4s-ast_2.13/3.7.0-M5/json4s-ast_2.13-3.7.0-M5.jar:/home/jenkins/.m2/repository/commons-lang/commons-lang/2.6/commons-lang-2.6.jar:/home/jenkins/.m2/repository/com/yammer/metrics/metrics-core/2.2.0/metrics-core-2.2.0.jar:/home/jenkins/.m2/repository/com/twitter/chill_2.13/0.9.5/chill_2.13-0.9.5.jar:/home/jenkins/.m2/repository/org/scalatest/scalatest-freespec_2.13/3.2.3/scalatest-freespec_2.13-3.2.3.jar:/home/jenkins/.m2/repository/org/seleniumhq/selenium/selenium-edge-driver/3.141.59/selenium-edge-driver-3.141.59.jar:/home/jenkins/.m2/repository/org/eclipse/jetty/jetty-server/9.4.40.v20210413/jetty-server-9.4.40.v20210413.jar:/home/jenkins/.m2/repository/org/apache/commons/commons-exec/1.3/commons-exec-1.3.jar:/home/jenkins/.m2/repository/org/apache/hadoop/hadoop-auth/2.7.4/hadoop-auth-2.7.4.jar:/home/jenkins/.m2/repository/javax/activation/activation/1.1.1/activation-1.1.1.jar:/home/jenkins/.m2/repository/org/apache/hadoop/hadoop-mapreduce-client-shuffle/2.7.4/hadoop-mapreduce-client-shuffle-2.7.4.jar:/home/jenkins/.m2/repository/org/apache/zookeeper/zookeeper/3.5.7/zookeeper-3.5.7.jar:/home/jenkins/.m2/repository/commons-beanutils/commons-beanutils/1.9.4/commons-beanutils-1.9.4.jar:/home/jenkins/.m2/repository/org/apache/ivy/ivy/2.4.0/ivy-2.4.0.jar:/home/jenkins/.m2/repository/net/razorvine/pyrolite/4.30/pyrolite-4.30.jar:/home/jenkins/.m2/repository/jakarta/validation/jakarta.validation-api/2.0.2/jakarta.validation-api-2.0.2.jar:/home/jenkins/.m2/repository/org/scalatestplus/scalatestplus-scalacheck_2.13/3.1.0.0-RC2/scalatestplus-scalacheck_2.13-3.1.0.0-RC2.jar:/home/jenkins/.m2/repository/org/glassfish/jersey/inject/jersey-hk2/2.30/jersey-hk2-2.30.jar:/home/jenkins/workspace/spark-branch-3.1-test-maven-hadoop-2.7-scala-2.13/core/target/scala-2.13/test-classes:/home/jenkins/.m2/repository/org/scala-lang/scala-reflect/2.13.4/scala-reflect-2.13.4.jar:/home/jenkins/.m2/repository/org/scalatest/scalatest-wordspec_2.13/3.2.3/scalatest-wordspec_2.13-3.2.3.jar:/home/jenkins/workspace/spark-branch-3.1-test-maven-hadoop-2.7-scala-2.13/streaming/target/scala-2.13/test-classes:/home/jenkins/.m2/repository/org/apache/avro/avro-mapred/1.8.2/avro-mapred-1.8.2-hadoop2.jar:/home/jenkins/.m2/repository/org/jmock/jmock-testjar/2.12.0/jmock-testjar-2.12.0.jar:/home/jenkins/workspace/spark-branch-3.1-test-maven-hadoop-2.7-scala-2.13/common/network-shuffle/target/scala-2.13/classes:/home/jenkins/.m2/repository/log4j/log4j/1.2.17/log4j-1.2.17.jar:/home/jenkins/.m2/repository/org/apache/curator/curator-framework/2.7.1/curator-framework-2.7.1.jar:/home/jenkins/.m2/repository/org/apache/curator/curator-recipes/2.7.1/curator-recipes-2.7.1.jar:/home/jenkins/.m2/repository/io/dropwizard/metrics/metrics-core/4.1.1/metrics-core-4.1.1.jar:/home/jenkins/.m2/repository/org/scalactic/scalactic_2.13/3.2.3/scalactic_2.13-3.2.3.jar:/home/jenkins/.m2/repository/junit/junit/4.13.1/junit-4.13.1.jar:/home/jenkins/.m2/repository/org/apache/avro/avro/1.8.2/avro-1.8.2.jar:/home/jenkins/.m2/repository/org/apache/directory/server/apacheds-kerberos-codec/2.0.0-M15/apacheds-kerberos-codec-2.0.0-M15.jar:/home/jenkins/.m2/repository/io/dropwizard/metrics/metrics-json/4.1.1/metrics-json-4.1.1.jar:/home/jenkins/.m2/repository/io/netty/netty-common/4.1.45.Final/netty-common-4.1.45.Final.jar:/home/jenkins/.m2/repository/org/roaringbitmap/shims/0.9.0/shims-0.9.0.jar:/home/jenkins/.m2/repository/org/eclipse/jetty/jetty-security/9.4.40.v20210413/jetty-security-9.4.40.v20210413.jar:/home/jenkins/.m2/repository/org/glassfish/hk2/osgi-resource-locator/1.0.3/osgi-resource-locator-1.0.3.jar:/home/jenkins/.m2/repository/net/bytebuddy/byte-buddy-agent/1.10.13/byte-buddy-agent-1.10.13.jar:/home/jenkins/.m2/repository/org/scalatest/scalatest-flatspec_2.13/3.2.3/scalatest-flatspec_2.13-3.2.3.jar:/home/jenkins/.m2/repository/org/scala-sbt/test-interface/1.0/test-interface-1.0.jar:/home/jenkins/.m2/repository/com/squareup/okio/okio/1.14.0/okio-1.14.0.jar:/home/jenkins/.m2/repository/org/eclipse/jetty/jetty-continuation/9.4.40.v20210413/jetty-continuation-9.4.40.v20210413.jar:/home/jenkins/.m2/repository/org/ow2/asm/asm/7.1/asm-7.1.jar:/home/jenkins/.m2/repository/org/codehaus/jackson/jackson-mapper-asl/1.9.13/jackson-mapper-asl-1.9.13.jar:/home/jenkins/.m2/repository/org/scala-lang/modules/scala-java8-compat_2.13/0.9.1/scala-java8-compat_2.13-0.9.1.jar:/home/jenkins/workspace/spark-branch-3.1-test-maven-hadoop-2.7-scala-2.13/launcher/target/scala-2.13/classes:/home/jenkins/.m2/repository/javax/servlet/jsp/jsp-api/2.1/jsp-api-2.1.jar:/home/jenkins/.m2/repository/org/json4s/json4s-scalap_2.13/3.7.0-M5/json4s-scalap_2.13-3.7.0-M5.jar:/home/jenkins/.m2/repository/org/scala-lang/modules/scala-parallel-collections_2.13/0.2.0/scala-parallel-collections_2.13-0.2.0.jar:/home/jenkins/.m2/repository/org/eclipse/jetty/jetty-servlet/9.4.40.v20210413/jetty-servlet-9.4.40.v20210413.jar:/home/jenkins/.m2/repository/org/slf4j/slf4j-api/1.7.30/slf4j-api-1.7.30.jar:/home/jenkins/.m2/repository/com/ning/compress-lzf/1.0.3/compress-lzf-1.0.3.jar:/home/jenkins/.m2/repository/org/glassfish/jersey/containers/jersey-container-servlet/2.30/jersey-container-servlet-2.30.jar:/home/jenkins/workspace/spark-branch-3.1-test-maven-hadoop-2.7-scala-2.13/common/unsafe/target/scala-2.13/classes:/home/jenkins/.m2/repository/com/google/code/gson/gson/2.2.4/gson-2.2.4.jar:/home/jenkins/.m2/repository/org/apache/hadoop/hadoop-annotations/2.7.4/hadoop-annotations-2.7.4.jar:/home/jenkins/.m2/repository/org/seleniumhq/selenium/selenium-remote-driver/3.141.59/selenium-remote-driver-3.141.59.jar:/home/jenkins/.m2/repository/org/javassist/javassist/3.25.0-GA/javassist-3.25.0-GA.jar:/home/jenkins/.m2/repository/org/eclipse/jetty/jetty-servlets/9.4.40.v20210413/jetty-servlets-9.4.40.v20210413.jar:/home/jenkins/.m2/repository/org/glassfish/jersey/containers/jersey-container-servlet-core/2.30/jersey-container-servlet-core-2.30.jar:/home/jenkins/.m2/repository/org/apache/commons/commons-compress/1.21/commons-compress-1.21.jar:/home/jenkins/.m2/repository/commons-configuration/commons-configuration/1.6/commons-configuration-1.6.jar:/home/jenkins/.m2/repository/commons-digester/commons-digester/1.8/commons-digester-1.8.jar:/home/jenkins/.m2/repository/org/apache/directory/server/apacheds-i18n/2.0.0-M15/apacheds-i18n-2.0.0-M15.jar:/home/jenkins/.m2/repository/org/apache/curator/curator-client/2.7.1/curator-client-2.7.1.jar:/home/jenkins/.m2/repository/org/apache/hadoop/hadoop-hdfs/2.7.4/hadoop-hdfs-2.7.4.jar:/home/jenkins/.m2/repository/org/mockito/mockito-core/3.4.6/mockito-core-3.4.6.jar:/home/jenkins/.m2/repository/org/xerial/snappy/snappy-java/1.1.8.2/snappy-java-1.1.8.2.jar:/home/jenkins/.m2/repository/org/apache/zookeeper/zookeeper-jute/3.5.7/zookeeper-jute-3.5.7.jar:/home/jenkins/.m2/repository/commons-cli/commons-cli/1.2/commons-cli-1.2.jar:/home/jenkins/.m2/repository/org/spark-project/spark/unused/1.0.0/unused-1.0.0.jar:/home/jenkins/.m2/repository/commons-collections/commons-collections/3.2.2/commons-collections-3.2.2.jar:/home/jenkins/.m2/repository/org/scalatest/scalatest-compatible/3.2.3/scalatest-compatible-3.2.3.jar:/home/jenkins/.m2/repository/org/apache/httpcomponents/httpclient/4.5.6/httpclient-4.5.6.jar:/home/jenkins/.m2/repository/org/apache/kafka/kafka_2.13/2.6.0/kafka_2.13-2.6.0.jar:/home/jenkins/.m2/repository/org/scalacheck/scalacheck_2.13/1.14.2/scalacheck_2.13-1.14.2.jar:/home/jenkins/.m2/repository/com/fasterxml/jackson/module/jackson-module-scala_2.13/2.10.0/jackson-module-scala_2.13-2.10.0.jar:/home/jenkins/.m2/repository/commons-httpclient/commons-httpclient/3.1/commons-httpclient-3.1.jar:/home/jenkins/.m2/repository/org/jmock/jmock-legacy/2.12.0/jmock-legacy-2.12.0.jar:/home/jenkins/.m2/repository/org/scalatest/scalatest-core_2.13/3.2.3/scalatest-core_2.13-3.2.3.jar:/home/jenkins/.m2/repository/org/scalatest/scalatest-matchers-core_2.13/3.2.3/scalatest-matchers-core_2.13-3.2.3.jar:/home/jenkins/.m2/repository/com/clearspring/analytics/stream/2.9.6/stream-2.9.6.jar:/home/jenkins/.m2/repository/org/scalatest/scalatest_2.13/3.2.3/scalatest_2.13-3.2.3.jar:/home/jenkins/.m2/repository/org/apache/hadoop/hadoop-mapreduce-client-common/2.7.4/hadoop-mapreduce-client-common-2.7.4.jar:/home/jenkins/.m2/repository/org/glassfish/hk2/hk2-locator/2.6.1/hk2-locator-2.6.1.jar:/home/jenkins/.m2/repository/org/slf4j/slf4j-log4j12/1.7.30/slf4j-log4j12-1.7.30.jar:/home/jenkins/.m2/repository/org/glassfish/hk2/hk2-utils/2.6.1/hk2-utils-2.6.1.jar:/home/jenkins/.m2/repository/com/thoughtworks/paranamer/paranamer/2.8/paranamer-2.8.jar:/home/jenkins/.m2/repository/io/netty/netty-all/4.1.51.Final/netty-all-4.1.51.Final.jar:/home/jenkins/.m2/repository/org/scalatest/scalatest-propspec_2.13/3.2.3/scalatest-propspec_2.13-3.2.3.jar:/home/jenkins/.m2/repository/com/fasterxml/jackson/core/jackson-annotations/2.10.0/jackson-annotations-2.10.0.jar:/home/jenkins/.m2/repository/io/netty/netty-buffer/4.1.45.Final/netty-buffer-4.1.45.Final.jar:/home/jenkins/.m2/repository/org/apache/hadoop/hadoop-client/2.7.4/hadoop-client-2.7.4.jar:/home/jenkins/.m2/repository/org/objenesis/objenesis/2.6/objenesis-2.6.jar:/home/jenkins/.m2/repository/xml-apis/xml-apis/1.4.01/xml-apis-1.4.01.jar:/home/jenkins/.m2/repository/org/fusesource/leveldbjni/leveldbjni-all/1.8/leveldbjni-all-1.8.jar:/home/jenkins/.m2/repository/org/apache/commons/commons-text/1.6/commons-text-1.6.jar:/home/jenkins/.m2/repository/com/fasterxml/jackson/core/jackson-core/2.10.0/jackson-core-2.10.0.jar:/home/jenkins/.m2/repository/jakarta/ws/rs/jakarta.ws.rs-api/2.1.6/jakarta.ws.rs-api-2.1.6.jar:/home/jenkins/.m2/repository/org/tukaani/xz/1.5/xz-1.5.jar:/home/jenkins/.m2/repository/org/glassfish/hk2/external/aopalliance-repackaged/2.6.1/aopalliance-repackaged-2.6.1.jar:/home/jenkins/.m2/repository/org/jmock/jmock-junit4/2.12.0/jmock-junit4-2.12.0.jar:/home/jenkins/workspace/spark-branch-3.1-test-maven-hadoop-2.7-scala-2.13/common/kvstore/target/scala-2.13/classes:/home/jenkins/.m2/repository/org/apache/hadoop/hadoop-common/2.7.4/hadoop-common-2.7.4.jar:/home/jenkins/.m2/repository/commons-io/commons-io/2.4/commons-io-2.4.jar:/home/jenkins/.m2/repository/io/netty/netty-codec/4.1.45.Final/netty-codec-4.1.45.Final.jar:/home/jenkins/.m2/repository/com/fasterxml/jackson/module/jackson-module-paranamer/2.10.0/jackson-module-paranamer-2.10.0.jar:/home/jenkins/.m2/repository/org/scalatestplus/scalatestplus-mockito_2.13/1.0.0-SNAP5/scalatestplus-mockito_2.13-1.0.0-SNAP5.jar:/home/jenkins/.m2/repository/org/apache/hadoop/hadoop-yarn-client/2.7.4/hadoop-yarn-client-2.7.4.jar:/home/jenkins/.m2/repository/com/esotericsoftware/kryo-shaded/4.0.2/kryo-shaded-4.0.2.jar:/home/jenkins/.m2/repository/com/esotericsoftware/minlog/1.3.0/minlog-1.3.0.jar:/home/jenkins/.m2/repository/org/codehaus/jackson/jackson-core-asl/1.9.13/jackson-core-asl-1.9.13.jar:/home/jenkins/.m2/repository/net/sf/py4j/py4j/0.10.9/py4j-0.10.9.jar:/home/jenkins/.m2/repository/org/scalatest/scalatest-diagrams_2.13/3.2.3/scalatest-diagrams_2.13-3.2.3.jar:/home/jenkins/.m2/repository/org/eclipse/jetty/jetty-util-ajax/9.4.40.v20210413/jetty-util-ajax-9.4.40.v20210413.jar:/home/jenkins/.m2/repository/com/typesafe/scala-logging/scala-logging_2.13/3.9.2/scala-logging_2.13-3.9.2.jar:/home/jenkins/workspace/spark-branch-3.1-test-maven-hadoop-2.7-scala-2.13/external/kafka-0-10-token-provider/target/scala-2.13/classes:/home/jenkins/.m2/repository/com/squareup/okhttp3/okhttp/3.11.0/okhttp-3.11.0.jar:/home/jenkins/.m2/repository/io/netty/netty-resolver/4.1.45.Final/netty-resolver-4.1.45.Final.jar:/home/jenkins/.m2/repository/org/slf4j/jul-to-slf4j/1.7.30/jul-to-slf4j-1.7.30.jar:/home/jenkins/.m2/repository/org/seleniumhq/selenium/selenium-ie-driver/3.141.59/selenium-ie-driver-3.141.59.jar:/home/jenkins/.m2/repository/org/lz4/lz4-java/1.7.1/lz4-java-1.7.1.jar:/home/jenkins/.m2/repository/javax/xml/bind/jaxb-api/2.2.2/jaxb-api-2.2.2.jar:/home/jenkins/.m2/repository/org/hamcrest/hamcrest/2.1/hamcrest-2.1.jar:/home/jenkins/workspace/spark-branch-3.1-test-maven-hadoop-2.7-scala-2.13/common/tags/target/scala-2.13/test-classes:/home/jenkins/.m2/repository/org/jmock/jmock/2.12.0/jmock-2.12.0.jar:/home/jenkins/.m2/repository/org/scala-lang/scala-library/2.13.4/scala-library-2.13.4.jar:/home/jenkins/.m2/repository/org/mortbay/jetty/jetty-sslengine/6.1.26/jetty-sslengine-6.1.26.jar:/home/jenkins/.m2/repository/io/dropwizard/metrics/metrics-graphite/4.1.1/metrics-graphite-4.1.1.jar:/home/jenkins/.m2/repository/io/netty/netty-transport/4.1.45.Final/netty-transport-4.1.45.Final.jar:/home/jenkins/.m2/repository/org/scalatest/scalatest-mustmatchers_2.13/3.2.3/scalatest-mustmatchers_2.13-3.2.3.jar:/home/jenkins/.m2/repository/commons-codec/commons-codec/1.10/commons-codec-1.10.jar:/home/jenkins/.m2/repository/org/apache/httpcomponents/httpcore/4.4.12/httpcore-4.4.12.jar:/home/jenkins/.m2/repository/com/google/guava/guava/14.0.1/guava-14.0.1.jar:/home/jenkins/.m2/repository/org/eclipse/jetty/jetty-xml/9.4.40.v20210413/jetty-xml-9.4.40.v20210413.jar:/home/jenkins/.m2/repository/org/eclipse/jetty/jetty-io/9.4.40.v20210413/jetty-io-9.4.40.v20210413.jar:/home/jenkins/.m2/repository/org/apache/hadoop/hadoop-mapreduce-client-core/2.7.4/hadoop-mapreduce-client-core-2.7.4.jar:/home/jenkins/.m2/repository/javax/servlet/javax.servlet-api/3.1.0/javax.servlet-api-3.1.0.jar:/home/jenkins/.m2/repository/org/apache/commons/commons-math3/3.4.1/commons-math3-3.4.1.jar:/home/jenkins/.m2/repository/javax/xml/stream/stax-api/1.0-2/stax-api-1.0-2.jar:/home/jenkins/.m2/repository/org/json4s/json4s-jackson_2.13/3.7.0-M5/json4s-jackson_2.13-3.7.0-M5.jar:/home/jenkins/.m2/repository/org/codehaus/jackson/jackson-xc/1.9.13/jackson-xc-1.9.13.jar:/home/jenkins/workspace/spark-branch-3.1-test-maven-hadoop-2.7-scala-2.13/common/tags/target/scala-2.13/classes:/home/jenkins/.m2/repository/org/eclipse/jetty/jetty-webapp/9.4.40.v20210413/jetty-webapp-9.4.40.v20210413.jar:/home/jenkins/.m2/repository/org/glassfish/jersey/core/jersey-common/2.30/jersey-common-2.30.jar:/home/jenkins/.m2/repository/oro/oro/2.0.8/oro-2.0.8.jar:/home/jenkins/.m2/repository/org/jmock/jmock-imposters/2.12.0/jmock-imposters-2.12.0.jar:/home/jenkins/.m2/repository/io/netty/netty-handler/4.1.45.Final/netty-handler-4.1.45.Final.jar:/home/jenkins/.m2/repository/com/novocode/junit-interface/0.11/junit-interface-0.11.jar:/home/jenkins/.m2/repository/org/apache/xbean/xbean-asm7-shaded/4.15/xbean-asm7-shaded-4.15.jar:/home/jenkins/.m2/repository/cglib/cglib/3.2.8/cglib-3.2.8.jar:/home/jenkins/.m2/repository/com/github/luben/zstd-jni/1.4.8-1/zstd-jni-1.4.8-1.jar:/home/jenkins/.m2/repository/org/hamcrest/hamcrest-library/1.3/hamcrest-library-1.3.jar:/home/jenkins/.m2/repository/org/scala-lang/modules/scala-xml_2.13/1.2.0/scala-xml_2.13-1.2.0.jar:/home/jenkins/.m2/repository/org/glassfish/hk2/hk2-api/2.6.1/hk2-api-2.6.1.jar:/home/jenkins/.m2/repository/org/seleniumhq/selenium/selenium-chrome-driver/3.141.59/selenium-chrome-driver-3.141.59.jar:/home/jenkins/.m2/repository/org/seleniumhq/selenium/selenium-opera-driver/3.141.59/selenium-opera-driver-3.141.59.jar:/home/jenkins/.m2/repository/jakarta/annotation/jakarta.annotation-api/1.3.5/jakarta.annotation-api-1.3.5.jar:/home/jenkins/.m2/repository/org/mortbay/jetty/jetty-util/6.1.26/jetty-util-6.1.26.jar:/home/jenkins/.m2/repository/org/apache/hadoop/hadoop-yarn-api/2.7.4/hadoop-yarn-api-2.7.4.jar:/home/jenkins/.m2/repository/org/apache/yetus/audience-annotations/0.5.0/audience-annotations-0.5.0.jar:/home/jenkins/.m2/repository/io/dropwizard/metrics/metrics-jvm/4.1.1/metrics-jvm-4.1.1.jar:/home/jenkins/.m2/repository/org/hamcrest/hamcrest-core/1.3/hamcrest-core-1.3.jar:/home/jenkins/.m2/repository/org/seleniumhq/selenium/selenium-support/3.141.59/selenium-support-3.141.59.jar:/home/jenkins/.m2/repository/org/apache/hadoop/hadoop-yarn-server-common/2.7.4/hadoop-yarn-server-common-2.7.4.jar:/home/jenkins/.m2/repository/org/apache/hadoop/hadoop-mapreduce-client-app/2.7.4/hadoop-mapreduce-client-app-2.7.4.jar:/home/jenkins/.m2/repository/org/apache/avro/avro-ipc/1.8.2/avro-ipc-1.8.2.jar:/home/jenkins/.m2/repository/xmlenc/xmlenc/0.52/xmlenc-0.52.jar:/home/jenkins/.m2/repository/com/fasterxml/jackson/datatype/jackson-datatype-jdk8/2.10.2/jackson-datatype-jdk8-2.10.2.jar:/home/jenkins/.m2/repository/org/apache/directory/api/api-util/1.0.0-M20/api-util-1.0.0-M20.jar:/home/jenkins/.m2/repository/com/fasterxml/jackson/core/jackson-databind/2.10.0/jackson-databind-2.10.0.jar:/home/jenkins/.m2/repository/org/apache/hadoop/hadoop-yarn-common/2.7.4/hadoop-yarn-common-2.7.4.jar:/home/jenkins/.m2/repository/org/apache/directory/api/api-asn1-api/1.0.0-M20/api-asn1-api-1.0.0-M20.jar:/home/jenkins/.m2/repository/org/eclipse/jetty/jetty-client/9.4.40.v20210413/jetty-client-9.4.40.v20210413.jar:/home/jenkins/.m2/repository/org/scalatestplus/scalatestplus-selenium_2.13/1.0.0-SNAP5/scalatestplus-selenium_2.13-1.0.0-SNAP5.jar:/home/jenkins/.m2/repository/org/apache/commons/commons-crypto/1.1.0/commons-crypto-1.1.0.jar:/home/jenkins/.m2/repository/net/sf/jopt-simple/jopt-simple/3.2/jopt-simple-3.2.jar:/home/jenkins/.m2/repository/org/apache/kafka/kafka-clients/2.6.0/kafka-clients-2.6.0.jar:/home/jenkins/.m2/repository/io/netty/netty-transport-native-unix-common/4.1.45.Final/netty-transport-native-unix-common-4.1.45.Final.jar:/home/jenkins/.m2/repository/org/apache/commons/commons-lang3/3.10/commons-lang3-3.10.jar:/home/jenkins/.m2/repository/org/seleniumhq/selenium/selenium-api/3.141.59/selenium-api-3.141.59.jar:/home/jenkins/.m2/repository/org/seleniumhq/selenium/selenium-java/3.141.59/selenium-java-3.141.59.jar:/home/jenkins/workspace/spark-branch-3.1-test-maven-hadoop-2.7-scala-2.13/common/network-common/target/scala-2.13/classes:/home/jenkins/.m2/repository/io/netty/netty-transport-native-epoll/4.1.45.Final/netty-transport-native-epoll-4.1.45.Final.jar:/home/jenkins/.m2/repository/org/roaringbitmap/RoaringBitmap/0.9.0/RoaringBitmap-0.9.0.jar:/home/jenkins/.m2/repository/org/slf4j/jcl-over-slf4j/1.7.30/jcl-over-slf4j-1.7.30.jar:/home/jenkins/.m2/repository/org/glassfish/jersey/core/jersey-server/2.30/jersey-server-2.30.jar:/home/jenkins/.m2/repository/io/dropwizard/metrics/metrics-jmx/4.1.1/metrics-jmx-4.1.1.jar:/home/jenkins/.m2/repository/org/glassfish/jersey/core/jersey-client/2.30/jersey-client-2.30.jar:/home/jenkins/.m2/repository/com/google/code/findbugs/annotations/3.0.1/annotations-3.0.1.jar:/home/jenkins/.m2/repository/org/seleniumhq/selenium/selenium-firefox-driver/3.141.59/selenium-firefox-driver-3.141.59.jar:/home/jenkins/.m2/repository/org/eclipse/jetty/jetty-proxy/9.4.40.v20210413/jetty-proxy-9.4.40.v20210413.jar:/home/jenkins/.m2/repository/org/seleniumhq/selenium/selenium-safari-driver/3.141.59/selenium-safari-driver-3.141.59.jar:/home/jenkins/.m2/repository/org/scalatest/scalatest-refspec_2.13/3.2.3/scalatest-refspec_2.13-3.2.3.jar:/home/jenkins/.m2/repository/org/scala-lang/modules/scala-collection-compat_2.13/2.1.6/scala-collection-compat_2.13-2.1.6.jar
[INFO] 
[INFO] --- scala-maven-plugin:4.3.0:testCompile (scala-test-compile-first) @ spark-streaming-kafka-0-10_2.13 ---
[INFO] Using incremental compilation using Mixed compile order
[INFO] Compiler bridge file: /home/jenkins/.sbt/1.0/zinc/org.scala-sbt/org.scala-sbt-compiler-bridge_2.13-1.3.1-bin_2.13.4__52.0-1.3.1_20191012T045515.jar
[INFO] Compiling 6 Scala sources and 4 Java sources to /home/jenkins/workspace/spark-branch-3.1-test-maven-hadoop-2.7-scala-2.13/external/kafka-0-10/target/scala-2.13/test-classes ...
[WARNING] [Warn] /home/jenkins/workspace/spark-branch-3.1-test-maven-hadoop-2.7-scala-2.13/external/kafka-0-10/src/test/scala/org/apache/spark/streaming/kafka010/DirectKafkaStreamSuite.scala:258: [deprecation @ org.apache.spark.streaming.kafka010.DirectKafkaStreamSuite.<local DirectKafkaStreamSuite>.stream | origin=org.apache.kafka.clients.consumer.Consumer.poll | version=] method poll in trait Consumer is deprecated
[WARNING] [Warn] /home/jenkins/workspace/spark-branch-3.1-test-maven-hadoop-2.7-scala-2.13/external/kafka-0-10/src/test/scala/org/apache/spark/streaming/kafka010/DirectKafkaStreamSuite.scala:314: [deprecation @ org.apache.spark.streaming.kafka010.DirectKafkaStreamSuite.<local DirectKafkaStreamSuite>.stream | origin=org.apache.kafka.clients.consumer.Consumer.poll | version=] method poll in trait Consumer is deprecated
[WARNING] [Warn] /home/jenkins/workspace/spark-branch-3.1-test-maven-hadoop-2.7-scala-2.13/external/kafka-0-10/src/test/scala/org/apache/spark/streaming/kafka010/DirectKafkaStreamSuite.scala:476: [deprecation @ org.apache.spark.streaming.kafka010.DirectKafkaStreamSuite | origin=org.apache.kafka.clients.consumer.KafkaConsumer.poll | version=] method poll in class KafkaConsumer is deprecated
[WARNING] three warnings found
[WARNING] [Warn] /home/jenkins/workspace/spark-branch-3.1-test-maven-hadoop-2.7-scala-2.13/external/kafka-0-10/src/test/java/org/apache/spark/streaming/kafka010/JavaConsumerStrategySuite.java:56: <A,B>mapAsScalaMap(java.util.Map<A,B>) in scala.collection.JavaConverters has been deprecated
[INFO] Done compiling.
[INFO] compile in 17.3 s
[INFO] 
[INFO] --- maven-surefire-plugin:3.0.0-M5:test (default-test) @ spark-streaming-kafka-0-10_2.13 ---
[INFO] 
[INFO] -------------------------------------------------------
[INFO]  T E S T S
[INFO] -------------------------------------------------------
[INFO] Running org.apache.spark.streaming.kafka010.JavaKafkaRDDSuite
[INFO] Tests run: 1, Failures: 0, Errors: 0, Skipped: 0, Time elapsed: 11.037 s - in org.apache.spark.streaming.kafka010.JavaKafkaRDDSuite
[INFO] Running org.apache.spark.streaming.kafka010.JavaLocationStrategySuite
[INFO] Tests run: 1, Failures: 0, Errors: 0, Skipped: 0, Time elapsed: 0.004 s - in org.apache.spark.streaming.kafka010.JavaLocationStrategySuite
[INFO] Running org.apache.spark.streaming.kafka010.JavaConsumerStrategySuite
[INFO] Tests run: 1, Failures: 0, Errors: 0, Skipped: 0, Time elapsed: 0.007 s - in org.apache.spark.streaming.kafka010.JavaConsumerStrategySuite
[INFO] Running org.apache.spark.streaming.kafka010.JavaDirectKafkaStreamSuite
[INFO] Tests run: 1, Failures: 0, Errors: 0, Skipped: 0, Time elapsed: 5.24 s - in org.apache.spark.streaming.kafka010.JavaDirectKafkaStreamSuite
[INFO] 
[INFO] Results:
[INFO] 
[INFO] Tests run: 4, Failures: 0, Errors: 0, Skipped: 0
[INFO] 
[INFO] 
[INFO] --- maven-surefire-plugin:3.0.0-M5:test (test) @ spark-streaming-kafka-0-10_2.13 ---
[INFO] Skipping execution of surefire because it has already been run for this configuration
[INFO] 
[INFO] --- scalatest-maven-plugin:2.0.0:test (test) @ spark-streaming-kafka-0-10_2.13 ---
Discovery starting.
Discovery completed in 524 milliseconds.
Run starting. Expected test count is: 21
KafkaRDDSuite:
- basic usage
- compacted topic
- iterator boundary conditions
- executor sorting
DirectKafkaStreamSuite:
- basic stream receiving with multiple topics and smallest starting offset
- pattern based subscription
- receiving from largest starting offset
- creating stream by offset
- offset recovery
- offset recovery from kafka
- Direct Kafka stream report input information
- maxMessagesPerPartition with backpressure disabled
- maxMessagesPerPartition with no lag
- maxMessagesPerPartition respects max rate
- using rate controller
- backpressure.initialRate should honor maxRatePerPartition
- use backpressure.initialRate with backpressure
- maxMessagesPerPartition with zero offset and rate equal to the specified minimum with default 1
KafkaDataConsumerSuite:
- KafkaDataConsumer reuse in case of same groupId and TopicPartition
- new KafkaDataConsumer instance in case of Task retry
- concurrent use of KafkaDataConsumer
Run completed in 1 minute.
Total number of tests run: 21
Suites: completed 4, aborted 0
Tests: succeeded 21, failed 0, canceled 0, ignored 0, pending 0
All tests passed.
[INFO] 
[INFO] ------------------------------------------------------------------------
[INFO] Skipping Kafka 0.10+ Source for Structured Streaming
[INFO] This project has been banned from the build due to previous failures.
[INFO] ------------------------------------------------------------------------
[INFO] 
[INFO] ---------< org.apache.spark:spark-streaming-kinesis-asl_2.13 >----------
[INFO] Building Spark Kinesis Integration 3.1.3-SNAPSHOT                [21/31]
[INFO] --------------------------------[ jar ]---------------------------------
[INFO] 
[INFO] --- maven-enforcer-plugin:3.0.0-M2:enforce (enforce-versions) @ spark-streaming-kinesis-asl_2.13 ---
[INFO] 
[INFO] --- maven-enforcer-plugin:3.0.0-M2:enforce (enforce-no-duplicate-dependencies) @ spark-streaming-kinesis-asl_2.13 ---
[INFO] 
[INFO] --- mvn-scalafmt_2.13:1.0.3:format (default) @ spark-streaming-kinesis-asl_2.13 ---
[WARNING] format.skipSources set, ignoring main directories
[WARNING] format.skipTestSources set, ignoring validateOnly directories
[WARNING] No sources specified, skipping formatting
[INFO] 
[INFO] --- scala-maven-plugin:4.3.0:add-source (eclipse-add-source) @ spark-streaming-kinesis-asl_2.13 ---
[INFO] Add Source directory: /home/jenkins/workspace/spark-branch-3.1-test-maven-hadoop-2.7-scala-2.13/external/kinesis-asl/src/main/scala
[INFO] Add Test Source directory: /home/jenkins/workspace/spark-branch-3.1-test-maven-hadoop-2.7-scala-2.13/external/kinesis-asl/src/test/scala
[INFO] 
[INFO] --- maven-dependency-plugin:3.1.1:build-classpath (default-cli) @ spark-streaming-kinesis-asl_2.13 ---
[INFO] Dependencies classpath:
/home/jenkins/.m2/repository/com/clearspring/analytics/stream/2.9.6/stream-2.9.6.jar:/home/jenkins/.m2/repository/org/apache/hadoop/hadoop-mapreduce-client-common/2.7.4/hadoop-mapreduce-client-common-2.7.4.jar:/home/jenkins/.m2/repository/com/google/crypto/tink/tink/1.6.0/tink-1.6.0.jar:/home/jenkins/.m2/repository/org/glassfish/hk2/external/jakarta.inject/2.6.1/jakarta.inject-2.6.1.jar:/home/jenkins/.m2/repository/org/glassfish/hk2/hk2-locator/2.6.1/hk2-locator-2.6.1.jar:/home/jenkins/.m2/repository/org/apache/htrace/htrace-core/3.1.0-incubating/htrace-core-3.1.0-incubating.jar:/home/jenkins/.m2/repository/org/apache/hadoop/hadoop-mapreduce-client-jobclient/2.7.4/hadoop-mapreduce-client-jobclient-2.7.4.jar:/home/jenkins/.m2/repository/org/slf4j/slf4j-log4j12/1.7.30/slf4j-log4j12-1.7.30.jar:/home/jenkins/.m2/repository/com/google/protobuf/protobuf-java/2.5.0/protobuf-java-2.5.0.jar:/home/jenkins/.m2/repository/org/glassfish/hk2/hk2-utils/2.6.1/hk2-utils-2.6.1.jar:/home/jenkins/.m2/repository/jakarta/servlet/jakarta.servlet-api/4.0.3/jakarta.servlet-api-4.0.3.jar:/home/jenkins/.m2/repository/com/thoughtworks/paranamer/paranamer/2.8/paranamer-2.8.jar:/home/jenkins/.m2/repository/io/netty/netty-all/4.1.51.Final/netty-all-4.1.51.Final.jar:/home/jenkins/.m2/repository/com/fasterxml/jackson/core/jackson-annotations/2.10.0/jackson-annotations-2.10.0.jar:/home/jenkins/workspace/spark-branch-3.1-test-maven-hadoop-2.7-scala-2.13/core/target/scala-2.13/classes:/home/jenkins/.m2/repository/org/apache/hadoop/hadoop-client/2.7.4/hadoop-client-2.7.4.jar:/home/jenkins/.m2/repository/com/google/code/findbugs/jsr305/3.0.0/jsr305-3.0.0.jar:/home/jenkins/.m2/repository/org/objenesis/objenesis/2.6/objenesis-2.6.jar:/home/jenkins/.m2/repository/xml-apis/xml-apis/1.4.01/xml-apis-1.4.01.jar:/home/jenkins/.m2/repository/org/fusesource/leveldbjni/leveldbjni-all/1.8/leveldbjni-all-1.8.jar:/home/jenkins/.m2/repository/com/fasterxml/jackson/dataformat/jackson-dataformat-cbor/2.10.0/jackson-dataformat-cbor-2.10.0.jar:/home/jenkins/.m2/repository/org/apache/commons/commons-text/1.6/commons-text-1.6.jar:/home/jenkins/.m2/repository/org/glassfish/jersey/media/jersey-media-jaxb/2.30/jersey-media-jaxb-2.30.jar:/home/jenkins/.m2/repository/com/fasterxml/jackson/core/jackson-core/2.10.0/jackson-core-2.10.0.jar:/home/jenkins/.m2/repository/jakarta/ws/rs/jakarta.ws.rs-api/2.1.6/jakarta.ws.rs-api-2.1.6.jar:/home/jenkins/.m2/repository/org/tukaani/xz/1.5/xz-1.5.jar:/home/jenkins/.m2/repository/org/glassfish/hk2/external/aopalliance-repackaged/2.6.1/aopalliance-repackaged-2.6.1.jar:/home/jenkins/.m2/repository/com/amazonaws/aws-java-sdk-core/1.11.655/aws-java-sdk-core-1.11.655.jar:/home/jenkins/workspace/spark-branch-3.1-test-maven-hadoop-2.7-scala-2.13/common/kvstore/target/scala-2.13/classes:/home/jenkins/.m2/repository/com/amazonaws/aws-java-sdk-sts/1.11.655/aws-java-sdk-sts-1.11.655.jar:/home/jenkins/.m2/repository/org/apache/hadoop/hadoop-common/2.7.4/hadoop-common-2.7.4.jar:/home/jenkins/.m2/repository/com/amazonaws/aws-java-sdk-cloudwatch/1.11.655/aws-java-sdk-cloudwatch-1.11.655.jar:/home/jenkins/.m2/repository/commons-io/commons-io/2.4/commons-io-2.4.jar:/home/jenkins/.m2/repository/org/codehaus/jackson/jackson-jaxrs/1.9.13/jackson-jaxrs-1.9.13.jar:/home/jenkins/.m2/repository/com/fasterxml/jackson/module/jackson-module-paranamer/2.10.0/jackson-module-paranamer-2.10.0.jar:/home/jenkins/.m2/repository/org/apache/hadoop/hadoop-yarn-client/2.7.4/hadoop-yarn-client-2.7.4.jar:/home/jenkins/.m2/repository/com/esotericsoftware/kryo-shaded/4.0.2/kryo-shaded-4.0.2.jar:/home/jenkins/.m2/repository/com/esotericsoftware/minlog/1.3.0/minlog-1.3.0.jar:/home/jenkins/.m2/repository/org/codehaus/jackson/jackson-core-asl/1.9.13/jackson-core-asl-1.9.13.jar:/home/jenkins/.m2/repository/xerces/xercesImpl/2.12.0/xercesImpl-2.12.0.jar:/home/jenkins/.m2/repository/net/sf/py4j/py4j/0.10.9/py4j-0.10.9.jar:/home/jenkins/.m2/repository/org/json4s/json4s-core_2.13/3.7.0-M5/json4s-core_2.13-3.7.0-M5.jar:/home/jenkins/.m2/repository/com/twitter/chill-java/0.9.5/chill-java-0.9.5.jar:/home/jenkins/.m2/repository/org/slf4j/jul-to-slf4j/1.7.30/jul-to-slf4j-1.7.30.jar:/home/jenkins/.m2/repository/com/amazonaws/aws-java-sdk-kms/1.11.655/aws-java-sdk-kms-1.11.655.jar:/home/jenkins/.m2/repository/commons-net/commons-net/3.1/commons-net-3.1.jar:/home/jenkins/.m2/repository/org/lz4/lz4-java/1.7.1/lz4-java-1.7.1.jar:/home/jenkins/.m2/repository/javax/xml/bind/jaxb-api/2.2.2/jaxb-api-2.2.2.jar:/home/jenkins/workspace/spark-branch-3.1-test-maven-hadoop-2.7-scala-2.13/streaming/target/scala-2.13/classes:/home/jenkins/.m2/repository/org/scala-lang/scala-library/2.13.4/scala-library-2.13.4.jar:/home/jenkins/.m2/repository/org/json4s/json4s-ast_2.13/3.7.0-M5/json4s-ast_2.13-3.7.0-M5.jar:/home/jenkins/.m2/repository/commons-lang/commons-lang/2.6/commons-lang-2.6.jar:/home/jenkins/.m2/repository/joda-time/joda-time/2.10.5/joda-time-2.10.5.jar:/home/jenkins/.m2/repository/org/mortbay/jetty/jetty-sslengine/6.1.26/jetty-sslengine-6.1.26.jar:/home/jenkins/.m2/repository/io/dropwizard/metrics/metrics-graphite/4.1.1/metrics-graphite-4.1.1.jar:/home/jenkins/.m2/repository/com/amazonaws/aws-java-sdk-s3/1.11.655/aws-java-sdk-s3-1.11.655.jar:/home/jenkins/.m2/repository/com/amazonaws/aws-java-sdk-dynamodb/1.11.655/aws-java-sdk-dynamodb-1.11.655.jar:/home/jenkins/.m2/repository/com/twitter/chill_2.13/0.9.5/chill_2.13-0.9.5.jar:/home/jenkins/.m2/repository/org/apache/hadoop/hadoop-auth/2.7.4/hadoop-auth-2.7.4.jar:/home/jenkins/.m2/repository/javax/activation/activation/1.1.1/activation-1.1.1.jar:/home/jenkins/.m2/repository/org/apache/hadoop/hadoop-mapreduce-client-shuffle/2.7.4/hadoop-mapreduce-client-shuffle-2.7.4.jar:/home/jenkins/.m2/repository/commons-codec/commons-codec/1.10/commons-codec-1.10.jar:/home/jenkins/.m2/repository/org/apache/httpcomponents/httpcore/4.4.12/httpcore-4.4.12.jar:/home/jenkins/.m2/repository/commons-beanutils/commons-beanutils/1.9.4/commons-beanutils-1.9.4.jar:/home/jenkins/.m2/repository/org/apache/ivy/ivy/2.4.0/ivy-2.4.0.jar:/home/jenkins/.m2/repository/org/apache/hadoop/hadoop-mapreduce-client-core/2.7.4/hadoop-mapreduce-client-core-2.7.4.jar:/home/jenkins/.m2/repository/org/apache/commons/commons-math3/3.4.1/commons-math3-3.4.1.jar:/home/jenkins/.m2/repository/net/razorvine/pyrolite/4.30/pyrolite-4.30.jar:/home/jenkins/.m2/repository/javax/xml/stream/stax-api/1.0-2/stax-api-1.0-2.jar:/home/jenkins/.m2/repository/org/json4s/json4s-jackson_2.13/3.7.0-M5/json4s-jackson_2.13-3.7.0-M5.jar:/home/jenkins/.m2/repository/jakarta/validation/jakarta.validation-api/2.0.2/jakarta.validation-api-2.0.2.jar:/home/jenkins/.m2/repository/org/codehaus/jackson/jackson-xc/1.9.13/jackson-xc-1.9.13.jar:/home/jenkins/.m2/repository/com/amazonaws/amazon-kinesis-client/1.12.0/amazon-kinesis-client-1.12.0.jar:/home/jenkins/.m2/repository/org/glassfish/jersey/inject/jersey-hk2/2.30/jersey-hk2-2.30.jar:/home/jenkins/workspace/spark-branch-3.1-test-maven-hadoop-2.7-scala-2.13/common/tags/target/scala-2.13/classes:/home/jenkins/.m2/repository/org/scala-lang/scala-reflect/2.13.4/scala-reflect-2.13.4.jar:/home/jenkins/.m2/repository/org/glassfish/jersey/core/jersey-common/2.30/jersey-common-2.30.jar:/home/jenkins/.m2/repository/oro/oro/2.0.8/oro-2.0.8.jar:/home/jenkins/.m2/repository/org/apache/avro/avro-mapred/1.8.2/avro-mapred-1.8.2-hadoop2.jar:/home/jenkins/workspace/spark-branch-3.1-test-maven-hadoop-2.7-scala-2.13/common/network-shuffle/target/scala-2.13/classes:/home/jenkins/.m2/repository/log4j/log4j/1.2.17/log4j-1.2.17.jar:/home/jenkins/.m2/repository/org/apache/xbean/xbean-asm7-shaded/4.15/xbean-asm7-shaded-4.15.jar:/home/jenkins/.m2/repository/org/apache/curator/curator-framework/2.7.1/curator-framework-2.7.1.jar:/home/jenkins/.m2/repository/org/apache/curator/curator-recipes/2.7.1/curator-recipes-2.7.1.jar:/home/jenkins/.m2/repository/com/github/luben/zstd-jni/1.4.8-1/zstd-jni-1.4.8-1.jar:/home/jenkins/.m2/repository/io/dropwizard/metrics/metrics-core/4.1.1/metrics-core-4.1.1.jar:/home/jenkins/.m2/repository/org/scala-lang/modules/scala-xml_2.13/1.2.0/scala-xml_2.13-1.2.0.jar:/home/jenkins/.m2/repository/com/amazonaws/aws-java-sdk-kinesis/1.11.655/aws-java-sdk-kinesis-1.11.655.jar:/home/jenkins/.m2/repository/org/apache/avro/avro/1.8.2/avro-1.8.2.jar:/home/jenkins/.m2/repository/org/apache/directory/server/apacheds-kerberos-codec/2.0.0-M15/apacheds-kerberos-codec-2.0.0-M15.jar:/home/jenkins/.m2/repository/io/dropwizard/metrics/metrics-json/4.1.1/metrics-json-4.1.1.jar:/home/jenkins/.m2/repository/org/glassfish/hk2/hk2-api/2.6.1/hk2-api-2.6.1.jar:/home/jenkins/.m2/repository/org/apache/zookeeper/zookeeper/3.4.14/zookeeper-3.4.14.jar:/home/jenkins/.m2/repository/org/roaringbitmap/shims/0.9.0/shims-0.9.0.jar:/home/jenkins/.m2/repository/jakarta/annotation/jakarta.annotation-api/1.3.5/jakarta.annotation-api-1.3.5.jar:/home/jenkins/.m2/repository/org/glassfish/hk2/osgi-resource-locator/1.0.3/osgi-resource-locator-1.0.3.jar:/home/jenkins/.m2/repository/org/mortbay/jetty/jetty-util/6.1.26/jetty-util-6.1.26.jar:/home/jenkins/.m2/repository/org/apache/hadoop/hadoop-yarn-api/2.7.4/hadoop-yarn-api-2.7.4.jar:/home/jenkins/.m2/repository/org/apache/yetus/audience-annotations/0.5.0/audience-annotations-0.5.0.jar:/home/jenkins/.m2/repository/io/dropwizard/metrics/metrics-jvm/4.1.1/metrics-jvm-4.1.1.jar:/home/jenkins/.m2/repository/org/codehaus/jackson/jackson-mapper-asl/1.9.13/jackson-mapper-asl-1.9.13.jar:/home/jenkins/workspace/spark-branch-3.1-test-maven-hadoop-2.7-scala-2.13/launcher/target/scala-2.13/classes:/home/jenkins/.m2/repository/javax/servlet/jsp/jsp-api/2.1/jsp-api-2.1.jar:/home/jenkins/.m2/repository/org/apache/hadoop/hadoop-yarn-server-common/2.7.4/hadoop-yarn-server-common-2.7.4.jar:/home/jenkins/.m2/repository/org/json4s/json4s-scalap_2.13/3.7.0-M5/json4s-scalap_2.13-3.7.0-M5.jar:/home/jenkins/.m2/repository/org/scala-lang/modules/scala-parallel-collections_2.13/0.2.0/scala-parallel-collections_2.13-0.2.0.jar:/home/jenkins/.m2/repository/org/apache/hadoop/hadoop-mapreduce-client-app/2.7.4/hadoop-mapreduce-client-app-2.7.4.jar:/home/jenkins/.m2/repository/org/apache/avro/avro-ipc/1.8.2/avro-ipc-1.8.2.jar:/home/jenkins/.m2/repository/xmlenc/xmlenc/0.52/xmlenc-0.52.jar:/home/jenkins/.m2/repository/org/slf4j/slf4j-api/1.7.30/slf4j-api-1.7.30.jar:/home/jenkins/.m2/repository/com/ning/compress-lzf/1.0.3/compress-lzf-1.0.3.jar:/home/jenkins/.m2/repository/org/glassfish/jersey/containers/jersey-container-servlet/2.30/jersey-container-servlet-2.30.jar:/home/jenkins/.m2/repository/org/apache/directory/api/api-util/1.0.0-M20/api-util-1.0.0-M20.jar:/home/jenkins/workspace/spark-branch-3.1-test-maven-hadoop-2.7-scala-2.13/common/unsafe/target/scala-2.13/classes:/home/jenkins/.m2/repository/com/fasterxml/jackson/core/jackson-databind/2.10.0/jackson-databind-2.10.0.jar:/home/jenkins/.m2/repository/org/apache/hadoop/hadoop-yarn-common/2.7.4/hadoop-yarn-common-2.7.4.jar:/home/jenkins/.m2/repository/com/google/code/gson/gson/2.2.4/gson-2.2.4.jar:/home/jenkins/.m2/repository/org/apache/directory/api/api-asn1-api/1.0.0-M20/api-asn1-api-1.0.0-M20.jar:/home/jenkins/.m2/repository/org/apache/hadoop/hadoop-annotations/2.7.4/hadoop-annotations-2.7.4.jar:/home/jenkins/.m2/repository/org/apache/commons/commons-crypto/1.1.0/commons-crypto-1.1.0.jar:/home/jenkins/.m2/repository/org/javassist/javassist/3.25.0-GA/javassist-3.25.0-GA.jar:/home/jenkins/.m2/repository/org/glassfish/jersey/containers/jersey-container-servlet-core/2.30/jersey-container-servlet-core-2.30.jar:/home/jenkins/.m2/repository/org/apache/commons/commons-compress/1.21/commons-compress-1.21.jar:/home/jenkins/.m2/repository/commons-configuration/commons-configuration/1.6/commons-configuration-1.6.jar:/home/jenkins/.m2/repository/commons-digester/commons-digester/1.8/commons-digester-1.8.jar:/home/jenkins/.m2/repository/org/apache/directory/server/apacheds-i18n/2.0.0-M15/apacheds-i18n-2.0.0-M15.jar:/home/jenkins/.m2/repository/org/apache/commons/commons-lang3/3.10/commons-lang3-3.10.jar:/home/jenkins/.m2/repository/org/apache/curator/curator-client/2.7.1/curator-client-2.7.1.jar:/home/jenkins/.m2/repository/org/apache/hadoop/hadoop-hdfs/2.7.4/hadoop-hdfs-2.7.4.jar:/home/jenkins/workspace/spark-branch-3.1-test-maven-hadoop-2.7-scala-2.13/common/network-common/target/scala-2.13/classes:/home/jenkins/.m2/repository/org/xerial/snappy/snappy-java/1.1.8.2/snappy-java-1.1.8.2.jar:/home/jenkins/.m2/repository/org/roaringbitmap/RoaringBitmap/0.9.0/RoaringBitmap-0.9.0.jar:/home/jenkins/.m2/repository/commons-cli/commons-cli/1.2/commons-cli-1.2.jar:/home/jenkins/.m2/repository/org/slf4j/jcl-over-slf4j/1.7.30/jcl-over-slf4j-1.7.30.jar:/home/jenkins/.m2/repository/org/spark-project/spark/unused/1.0.0/unused-1.0.0.jar:/home/jenkins/.m2/repository/org/glassfish/jersey/core/jersey-server/2.30/jersey-server-2.30.jar:/home/jenkins/.m2/repository/io/dropwizard/metrics/metrics-jmx/4.1.1/metrics-jmx-4.1.1.jar:/home/jenkins/.m2/repository/org/glassfish/jersey/core/jersey-client/2.30/jersey-client-2.30.jar:/home/jenkins/.m2/repository/commons-collections/commons-collections/3.2.2/commons-collections-3.2.2.jar:/home/jenkins/.m2/repository/commons-logging/commons-logging/1.1.3/commons-logging-1.1.3.jar:/home/jenkins/.m2/repository/org/apache/httpcomponents/httpclient/4.5.6/httpclient-4.5.6.jar:/home/jenkins/.m2/repository/com/amazonaws/jmespath-java/1.11.655/jmespath-java-1.11.655.jar:/home/jenkins/.m2/repository/software/amazon/ion/ion-java/1.0.2/ion-java-1.0.2.jar:/home/jenkins/.m2/repository/com/fasterxml/jackson/module/jackson-module-scala_2.13/2.10.0/jackson-module-scala_2.13-2.10.0.jar:/home/jenkins/.m2/repository/commons-httpclient/commons-httpclient/3.1/commons-httpclient-3.1.jar
[INFO] 
[INFO] --- maven-remote-resources-plugin:1.5:process (process-resource-bundles) @ spark-streaming-kinesis-asl_2.13 ---
[INFO] 
[INFO] --- maven-resources-plugin:2.7:resources (default-resources) @ spark-streaming-kinesis-asl_2.13 ---
[INFO] Using 'UTF-8' encoding to copy filtered resources.
[INFO] Copying 1 resource
[INFO] Copying 3 resources
[INFO] 
[INFO] --- maven-compiler-plugin:3.8.1:compile (default-compile) @ spark-streaming-kinesis-asl_2.13 ---
[INFO] Not compiling main sources
[INFO] 
[INFO] --- scala-maven-plugin:4.3.0:compile (scala-compile-first) @ spark-streaming-kinesis-asl_2.13 ---
[INFO] Using incremental compilation using Mixed compile order
[INFO] Compiler bridge file: /home/jenkins/.sbt/1.0/zinc/org.scala-sbt/org.scala-sbt-compiler-bridge_2.13-1.3.1-bin_2.13.4__52.0-1.3.1_20191012T045515.jar
[INFO] Compiling 11 Scala sources and 2 Java sources to /home/jenkins/workspace/spark-branch-3.1-test-maven-hadoop-2.7-scala-2.13/external/kinesis-asl/target/scala-2.13/classes ...
[WARNING] [Warn] /home/jenkins/workspace/spark-branch-3.1-test-maven-hadoop-2.7-scala-2.13/external/kinesis-asl/src/main/scala/org/apache/spark/examples/streaming/KinesisWordCountASL.scala:107: [deprecation @ org.apache.spark.examples.streaming.KinesisWordCountASL.main.kinesisClient | origin=com.amazonaws.services.kinesis.AmazonKinesisClient.<init> | version=] constructor AmazonKinesisClient in class AmazonKinesisClient is deprecated
[WARNING] [Warn] /home/jenkins/workspace/spark-branch-3.1-test-maven-hadoop-2.7-scala-2.13/external/kinesis-asl/src/main/scala/org/apache/spark/examples/streaming/KinesisWordCountASL.scala:108: [deprecation @ org.apache.spark.examples.streaming.KinesisWordCountASL.main | origin=com.amazonaws.AmazonWebServiceClient.setEndpoint | version=] method setEndpoint in class AmazonWebServiceClient is deprecated
[WARNING] [Warn] /home/jenkins/workspace/spark-branch-3.1-test-maven-hadoop-2.7-scala-2.13/external/kinesis-asl/src/main/scala/org/apache/spark/examples/streaming/KinesisWordCountASL.scala:223: [deprecation @ org.apache.spark.examples.streaming.KinesisWordProducerASL.generate.kinesisClient | origin=com.amazonaws.services.kinesis.AmazonKinesisClient.<init> | version=] constructor AmazonKinesisClient in class AmazonKinesisClient is deprecated
[WARNING] [Warn] /home/jenkins/workspace/spark-branch-3.1-test-maven-hadoop-2.7-scala-2.13/external/kinesis-asl/src/main/scala/org/apache/spark/examples/streaming/KinesisWordCountASL.scala:224: [deprecation @ org.apache.spark.examples.streaming.KinesisWordProducerASL.generate | origin=com.amazonaws.AmazonWebServiceClient.setEndpoint | version=] method setEndpoint in class AmazonWebServiceClient is deprecated
[WARNING] [Warn] /home/jenkins/workspace/spark-branch-3.1-test-maven-hadoop-2.7-scala-2.13/external/kinesis-asl/src/main/scala/org/apache/spark/streaming/kinesis/KinesisBackedBlockRDD.scala:142: [deprecation @ org.apache.spark.streaming.kinesis.KinesisSequenceRangeIterator.client | origin=com.amazonaws.services.kinesis.AmazonKinesisClient.<init> | version=] constructor AmazonKinesisClient in class AmazonKinesisClient is deprecated
[WARNING] [Warn] /home/jenkins/workspace/spark-branch-3.1-test-maven-hadoop-2.7-scala-2.13/external/kinesis-asl/src/main/scala/org/apache/spark/streaming/kinesis/KinesisBackedBlockRDD.scala:152: [deprecation @ org.apache.spark.streaming.kinesis.KinesisSequenceRangeIterator | origin=com.amazonaws.AmazonWebServiceClient.setEndpoint | version=] method setEndpoint in class AmazonWebServiceClient is deprecated
[WARNING] [Warn] /home/jenkins/workspace/spark-branch-3.1-test-maven-hadoop-2.7-scala-2.13/external/kinesis-asl/src/main/scala/org/apache/spark/streaming/kinesis/KinesisBackedBlockRDD.scala:221: [deprecation @ org.apache.spark.streaming.kinesis.KinesisSequenceRangeIterator.getRecordsAndNextKinesisIterator | origin=com.amazonaws.AmazonWebServiceRequest.setRequestCredentials | version=] method setRequestCredentials in class AmazonWebServiceRequest is deprecated
[WARNING] [Warn] /home/jenkins/workspace/spark-branch-3.1-test-maven-hadoop-2.7-scala-2.13/external/kinesis-asl/src/main/scala/org/apache/spark/streaming/kinesis/KinesisBackedBlockRDD.scala:242: [deprecation @ org.apache.spark.streaming.kinesis.KinesisSequenceRangeIterator.getKinesisIterator | origin=com.amazonaws.AmazonWebServiceRequest.setRequestCredentials | version=] method setRequestCredentials in class AmazonWebServiceRequest is deprecated
[WARNING] [Warn] /home/jenkins/workspace/spark-branch-3.1-test-maven-hadoop-2.7-scala-2.13/external/kinesis-asl/src/main/scala/org/apache/spark/streaming/kinesis/KinesisReceiver.scala:192: [deprecation @ org.apache.spark.streaming.kinesis.KinesisReceiver.onStart | origin=com.amazonaws.services.kinesis.clientlibrary.lib.worker.Worker.<init> | version=] constructor Worker in class Worker is deprecated
[WARNING] [Warn] /home/jenkins/workspace/spark-branch-3.1-test-maven-hadoop-2.7-scala-2.13/external/kinesis-asl/src/main/scala/org/apache/spark/streaming/kinesis/KinesisTestUtils.scala:58: [deprecation @ org.apache.spark.streaming.kinesis.KinesisTestUtils.kinesisClient.client | origin=com.amazonaws.services.kinesis.AmazonKinesisClient.<init> | version=] constructor AmazonKinesisClient in class AmazonKinesisClient is deprecated
[WARNING] [Warn] /home/jenkins/workspace/spark-branch-3.1-test-maven-hadoop-2.7-scala-2.13/external/kinesis-asl/src/main/scala/org/apache/spark/streaming/kinesis/KinesisTestUtils.scala:59: [deprecation @ org.apache.spark.streaming.kinesis.KinesisTestUtils.kinesisClient | origin=com.amazonaws.AmazonWebServiceClient.setEndpoint | version=] method setEndpoint in class AmazonWebServiceClient is deprecated
[WARNING] [Warn] /home/jenkins/workspace/spark-branch-3.1-test-maven-hadoop-2.7-scala-2.13/external/kinesis-asl/src/main/scala/org/apache/spark/streaming/kinesis/KinesisTestUtils.scala:64: [deprecation @ org.apache.spark.streaming.kinesis.KinesisTestUtils.dynamoDB.dynamoDBClient | origin=com.amazonaws.services.dynamodbv2.AmazonDynamoDBClient.<init> | version=] constructor AmazonDynamoDBClient in class AmazonDynamoDBClient is deprecated
[WARNING] [Warn] /home/jenkins/workspace/spark-branch-3.1-test-maven-hadoop-2.7-scala-2.13/external/kinesis-asl/src/main/scala/org/apache/spark/streaming/kinesis/KinesisTestUtils.scala:65: [deprecation @ org.apache.spark.streaming.kinesis.KinesisTestUtils.dynamoDB | origin=com.amazonaws.AmazonWebServiceClient.setRegion | version=] method setRegion in class AmazonWebServiceClient is deprecated
[WARNING] [Warn] /home/jenkins/workspace/spark-branch-3.1-test-maven-hadoop-2.7-scala-2.13/external/kinesis-asl/src/main/scala/org/apache/spark/streaming/kinesis/SparkAWSCredentials.scala:74: [deprecation @ org.apache.spark.streaming.kinesis.STSCredentials.provider.builder | origin=com.amazonaws.auth.STSAssumeRoleSessionCredentialsProvider.Builder.withLongLivedCredentialsProvider | version=] method withLongLivedCredentialsProvider in class Builder is deprecated
[WARNING] 14 warnings found
[WARNING] [Warn] /home/jenkins/workspace/spark-branch-3.1-test-maven-hadoop-2.7-scala-2.13/external/kinesis-asl/src/main/java/org/apache/spark/examples/streaming/JavaKinesisWordCountASL.java:110: AmazonKinesisClient(com.amazonaws.auth.AWSCredentialsProvider) in com.amazonaws.services.kinesis.AmazonKinesisClient has been deprecated
[WARNING] [Warn] /home/jenkins/workspace/spark-branch-3.1-test-maven-hadoop-2.7-scala-2.13/external/kinesis-asl/src/main/java/org/apache/spark/examples/streaming/JavaKinesisWordCountASL.java:111: setEndpoint(java.lang.String) in com.amazonaws.AmazonWebServiceClient has been deprecated
[WARNING] [Warn] /home/jenkins/workspace/spark-branch-3.1-test-maven-hadoop-2.7-scala-2.13/external/kinesis-asl/src/main/java/org/apache/spark/examples/streaming/JavaKinesisWordCountASL.java:157: found raw type: org.apache.spark.streaming.api.java.JavaDStream
  missing type arguments for generic class org.apache.spark.streaming.api.java.JavaDStream<T>
[WARNING] [Warn] /home/jenkins/workspace/spark-branch-3.1-test-maven-hadoop-2.7-scala-2.13/external/kinesis-asl/src/main/java/org/apache/spark/examples/streaming/JavaKinesisWordCountASL.java:157: unchecked method invocation: method union in class org.apache.spark.streaming.api.java.JavaStreamingContext is applied to given types
  required: org.apache.spark.streaming.api.java.JavaDStream<T>[]
  found: org.apache.spark.streaming.api.java.JavaDStream[]
[WARNING] [Warn] /home/jenkins/workspace/spark-branch-3.1-test-maven-hadoop-2.7-scala-2.13/external/kinesis-asl/src/main/java/org/apache/spark/examples/streaming/JavaKinesisWordCountASL.java:157: unchecked conversion
  required: org.apache.spark.streaming.api.java.JavaDStream<T>[]
  found:    org.apache.spark.streaming.api.java.JavaDStream[]
[INFO] Done compiling.
[INFO] compile in 15.3 s
[INFO] 
[INFO] --- maven-antrun-plugin:1.8:run (create-tmp-dir) @ spark-streaming-kinesis-asl_2.13 ---
[INFO] Executing tasks

main:
    [mkdir] Created dir: /home/jenkins/workspace/spark-branch-3.1-test-maven-hadoop-2.7-scala-2.13/external/kinesis-asl/target/tmp
[INFO] Executed tasks
[INFO] 
[INFO] --- maven-resources-plugin:2.7:testResources (default-testResources) @ spark-streaming-kinesis-asl_2.13 ---
[INFO] Using 'UTF-8' encoding to copy filtered resources.
[INFO] Copying 1 resource
[INFO] Copying 3 resources
[INFO] 
[INFO] --- maven-compiler-plugin:3.8.1:testCompile (default-testCompile) @ spark-streaming-kinesis-asl_2.13 ---
[INFO] Not compiling test sources
[INFO] 
[INFO] --- maven-dependency-plugin:3.1.1:build-classpath (generate-test-classpath) @ spark-streaming-kinesis-asl_2.13 ---
[INFO] Dependencies classpath:
/home/jenkins/.m2/repository/com/google/crypto/tink/tink/1.6.0/tink-1.6.0.jar:/home/jenkins/.m2/repository/org/glassfish/hk2/external/jakarta.inject/2.6.1/jakarta.inject-2.6.1.jar:/home/jenkins/.m2/repository/org/apache/htrace/htrace-core/3.1.0-incubating/htrace-core-3.1.0-incubating.jar:/home/jenkins/.m2/repository/org/apache/hadoop/hadoop-mapreduce-client-jobclient/2.7.4/hadoop-mapreduce-client-jobclient-2.7.4.jar:/home/jenkins/.m2/repository/com/google/protobuf/protobuf-java/2.5.0/protobuf-java-2.5.0.jar:/home/jenkins/.m2/repository/org/eclipse/jetty/jetty-plus/9.4.40.v20210413/jetty-plus-9.4.40.v20210413.jar:/home/jenkins/.m2/repository/jakarta/servlet/jakarta.servlet-api/4.0.3/jakarta.servlet-api-4.0.3.jar:/home/jenkins/workspace/spark-branch-3.1-test-maven-hadoop-2.7-scala-2.13/core/target/scala-2.13/classes:/home/jenkins/.m2/repository/com/google/code/findbugs/jsr305/3.0.0/jsr305-3.0.0.jar:/home/jenkins/.m2/repository/org/scalatest/scalatest-shouldmatchers_2.13/3.2.3/scalatest-shouldmatchers_2.13-3.2.3.jar:/home/jenkins/.m2/repository/com/fasterxml/jackson/dataformat/jackson-dataformat-cbor/2.10.0/jackson-dataformat-cbor-2.10.0.jar:/home/jenkins/.m2/repository/org/glassfish/jersey/media/jersey-media-jaxb/2.30/jersey-media-jaxb-2.30.jar:/home/jenkins/.m2/repository/com/amazonaws/aws-java-sdk-core/1.11.655/aws-java-sdk-core-1.11.655.jar:/home/jenkins/.m2/repository/org/scalatest/scalatest-funsuite_2.13/3.2.3/scalatest-funsuite_2.13-3.2.3.jar:/home/jenkins/.m2/repository/org/eclipse/jetty/jetty-http/9.4.40.v20210413/jetty-http-9.4.40.v20210413.jar:/home/jenkins/.m2/repository/org/codehaus/jackson/jackson-jaxrs/1.9.13/jackson-jaxrs-1.9.13.jar:/home/jenkins/.m2/repository/org/eclipse/jetty/jetty-jndi/9.4.40.v20210413/jetty-jndi-9.4.40.v20210413.jar:/home/jenkins/.m2/repository/org/scalatest/scalatest-featurespec_2.13/3.2.3/scalatest-featurespec_2.13-3.2.3.jar:/home/jenkins/.m2/repository/org/scalatest/scalatest-funspec_2.13/3.2.3/scalatest-funspec_2.13-3.2.3.jar:/home/jenkins/.m2/repository/xerces/xercesImpl/2.12.0/xercesImpl-2.12.0.jar:/home/jenkins/.m2/repository/net/bytebuddy/byte-buddy/1.10.13/byte-buddy-1.10.13.jar:/home/jenkins/.m2/repository/org/json4s/json4s-core_2.13/3.7.0-M5/json4s-core_2.13-3.7.0-M5.jar:/home/jenkins/.m2/repository/org/eclipse/jetty/jetty-util/9.4.40.v20210413/jetty-util-9.4.40.v20210413.jar:/home/jenkins/.m2/repository/com/twitter/chill-java/0.9.5/chill-java-0.9.5.jar:/home/jenkins/.m2/repository/com/amazonaws/aws-java-sdk-kms/1.11.655/aws-java-sdk-kms-1.11.655.jar:/home/jenkins/.m2/repository/commons-net/commons-net/3.1/commons-net-3.1.jar:/home/jenkins/workspace/spark-branch-3.1-test-maven-hadoop-2.7-scala-2.13/streaming/target/scala-2.13/classes:/home/jenkins/.m2/repository/org/json4s/json4s-ast_2.13/3.7.0-M5/json4s-ast_2.13-3.7.0-M5.jar:/home/jenkins/.m2/repository/commons-lang/commons-lang/2.6/commons-lang-2.6.jar:/home/jenkins/.m2/repository/joda-time/joda-time/2.10.5/joda-time-2.10.5.jar:/home/jenkins/.m2/repository/com/amazonaws/aws-java-sdk-s3/1.11.655/aws-java-sdk-s3-1.11.655.jar:/home/jenkins/.m2/repository/com/twitter/chill_2.13/0.9.5/chill_2.13-0.9.5.jar:/home/jenkins/.m2/repository/org/scalatest/scalatest-freespec_2.13/3.2.3/scalatest-freespec_2.13-3.2.3.jar:/home/jenkins/.m2/repository/org/seleniumhq/selenium/selenium-edge-driver/3.141.59/selenium-edge-driver-3.141.59.jar:/home/jenkins/.m2/repository/org/eclipse/jetty/jetty-server/9.4.40.v20210413/jetty-server-9.4.40.v20210413.jar:/home/jenkins/.m2/repository/org/apache/commons/commons-exec/1.3/commons-exec-1.3.jar:/home/jenkins/.m2/repository/org/apache/hadoop/hadoop-auth/2.7.4/hadoop-auth-2.7.4.jar:/home/jenkins/.m2/repository/javax/activation/activation/1.1.1/activation-1.1.1.jar:/home/jenkins/.m2/repository/org/apache/hadoop/hadoop-mapreduce-client-shuffle/2.7.4/hadoop-mapreduce-client-shuffle-2.7.4.jar:/home/jenkins/.m2/repository/commons-beanutils/commons-beanutils/1.9.4/commons-beanutils-1.9.4.jar:/home/jenkins/.m2/repository/org/apache/ivy/ivy/2.4.0/ivy-2.4.0.jar:/home/jenkins/.m2/repository/net/razorvine/pyrolite/4.30/pyrolite-4.30.jar:/home/jenkins/.m2/repository/jakarta/validation/jakarta.validation-api/2.0.2/jakarta.validation-api-2.0.2.jar:/home/jenkins/.m2/repository/org/scalatestplus/scalatestplus-scalacheck_2.13/3.1.0.0-RC2/scalatestplus-scalacheck_2.13-3.1.0.0-RC2.jar:/home/jenkins/.m2/repository/org/glassfish/jersey/inject/jersey-hk2/2.30/jersey-hk2-2.30.jar:/home/jenkins/workspace/spark-branch-3.1-test-maven-hadoop-2.7-scala-2.13/core/target/scala-2.13/test-classes:/home/jenkins/.m2/repository/org/scala-lang/scala-reflect/2.13.4/scala-reflect-2.13.4.jar:/home/jenkins/.m2/repository/org/scalatest/scalatest-wordspec_2.13/3.2.3/scalatest-wordspec_2.13-3.2.3.jar:/home/jenkins/workspace/spark-branch-3.1-test-maven-hadoop-2.7-scala-2.13/streaming/target/scala-2.13/test-classes:/home/jenkins/.m2/repository/org/apache/avro/avro-mapred/1.8.2/avro-mapred-1.8.2-hadoop2.jar:/home/jenkins/workspace/spark-branch-3.1-test-maven-hadoop-2.7-scala-2.13/common/network-shuffle/target/scala-2.13/classes:/home/jenkins/.m2/repository/log4j/log4j/1.2.17/log4j-1.2.17.jar:/home/jenkins/.m2/repository/org/apache/curator/curator-framework/2.7.1/curator-framework-2.7.1.jar:/home/jenkins/.m2/repository/org/apache/curator/curator-recipes/2.7.1/curator-recipes-2.7.1.jar:/home/jenkins/.m2/repository/io/dropwizard/metrics/metrics-core/4.1.1/metrics-core-4.1.1.jar:/home/jenkins/.m2/repository/org/scalactic/scalactic_2.13/3.2.3/scalactic_2.13-3.2.3.jar:/home/jenkins/.m2/repository/junit/junit/4.13.1/junit-4.13.1.jar:/home/jenkins/.m2/repository/org/apache/avro/avro/1.8.2/avro-1.8.2.jar:/home/jenkins/.m2/repository/org/apache/directory/server/apacheds-kerberos-codec/2.0.0-M15/apacheds-kerberos-codec-2.0.0-M15.jar:/home/jenkins/.m2/repository/io/dropwizard/metrics/metrics-json/4.1.1/metrics-json-4.1.1.jar:/home/jenkins/.m2/repository/org/roaringbitmap/shims/0.9.0/shims-0.9.0.jar:/home/jenkins/.m2/repository/org/eclipse/jetty/jetty-security/9.4.40.v20210413/jetty-security-9.4.40.v20210413.jar:/home/jenkins/.m2/repository/org/glassfish/hk2/osgi-resource-locator/1.0.3/osgi-resource-locator-1.0.3.jar:/home/jenkins/.m2/repository/net/bytebuddy/byte-buddy-agent/1.10.13/byte-buddy-agent-1.10.13.jar:/home/jenkins/.m2/repository/org/scalatest/scalatest-flatspec_2.13/3.2.3/scalatest-flatspec_2.13-3.2.3.jar:/home/jenkins/.m2/repository/org/scala-sbt/test-interface/1.0/test-interface-1.0.jar:/home/jenkins/.m2/repository/com/squareup/okio/okio/1.14.0/okio-1.14.0.jar:/home/jenkins/.m2/repository/org/eclipse/jetty/jetty-continuation/9.4.40.v20210413/jetty-continuation-9.4.40.v20210413.jar:/home/jenkins/.m2/repository/org/codehaus/jackson/jackson-mapper-asl/1.9.13/jackson-mapper-asl-1.9.13.jar:/home/jenkins/workspace/spark-branch-3.1-test-maven-hadoop-2.7-scala-2.13/launcher/target/scala-2.13/classes:/home/jenkins/.m2/repository/javax/servlet/jsp/jsp-api/2.1/jsp-api-2.1.jar:/home/jenkins/.m2/repository/org/json4s/json4s-scalap_2.13/3.7.0-M5/json4s-scalap_2.13-3.7.0-M5.jar:/home/jenkins/.m2/repository/org/scala-lang/modules/scala-parallel-collections_2.13/0.2.0/scala-parallel-collections_2.13-0.2.0.jar:/home/jenkins/.m2/repository/org/eclipse/jetty/jetty-servlet/9.4.40.v20210413/jetty-servlet-9.4.40.v20210413.jar:/home/jenkins/.m2/repository/org/slf4j/slf4j-api/1.7.30/slf4j-api-1.7.30.jar:/home/jenkins/.m2/repository/com/ning/compress-lzf/1.0.3/compress-lzf-1.0.3.jar:/home/jenkins/.m2/repository/org/glassfish/jersey/containers/jersey-container-servlet/2.30/jersey-container-servlet-2.30.jar:/home/jenkins/workspace/spark-branch-3.1-test-maven-hadoop-2.7-scala-2.13/common/unsafe/target/scala-2.13/classes:/home/jenkins/.m2/repository/com/google/code/gson/gson/2.2.4/gson-2.2.4.jar:/home/jenkins/.m2/repository/org/apache/hadoop/hadoop-annotations/2.7.4/hadoop-annotations-2.7.4.jar:/home/jenkins/.m2/repository/org/seleniumhq/selenium/selenium-remote-driver/3.141.59/selenium-remote-driver-3.141.59.jar:/home/jenkins/.m2/repository/org/javassist/javassist/3.25.0-GA/javassist-3.25.0-GA.jar:/home/jenkins/.m2/repository/org/eclipse/jetty/jetty-servlets/9.4.40.v20210413/jetty-servlets-9.4.40.v20210413.jar:/home/jenkins/.m2/repository/org/glassfish/jersey/containers/jersey-container-servlet-core/2.30/jersey-container-servlet-core-2.30.jar:/home/jenkins/.m2/repository/org/apache/commons/commons-compress/1.21/commons-compress-1.21.jar:/home/jenkins/.m2/repository/commons-configuration/commons-configuration/1.6/commons-configuration-1.6.jar:/home/jenkins/.m2/repository/commons-digester/commons-digester/1.8/commons-digester-1.8.jar:/home/jenkins/.m2/repository/org/apache/directory/server/apacheds-i18n/2.0.0-M15/apacheds-i18n-2.0.0-M15.jar:/home/jenkins/.m2/repository/org/apache/curator/curator-client/2.7.1/curator-client-2.7.1.jar:/home/jenkins/.m2/repository/org/apache/hadoop/hadoop-hdfs/2.7.4/hadoop-hdfs-2.7.4.jar:/home/jenkins/.m2/repository/org/mockito/mockito-core/3.4.6/mockito-core-3.4.6.jar:/home/jenkins/.m2/repository/org/xerial/snappy/snappy-java/1.1.8.2/snappy-java-1.1.8.2.jar:/home/jenkins/.m2/repository/commons-cli/commons-cli/1.2/commons-cli-1.2.jar:/home/jenkins/.m2/repository/org/spark-project/spark/unused/1.0.0/unused-1.0.0.jar:/home/jenkins/.m2/repository/commons-collections/commons-collections/3.2.2/commons-collections-3.2.2.jar:/home/jenkins/.m2/repository/org/scalatest/scalatest-compatible/3.2.3/scalatest-compatible-3.2.3.jar:/home/jenkins/.m2/repository/org/apache/httpcomponents/httpclient/4.5.6/httpclient-4.5.6.jar:/home/jenkins/.m2/repository/org/scalacheck/scalacheck_2.13/1.14.2/scalacheck_2.13-1.14.2.jar:/home/jenkins/.m2/repository/com/fasterxml/jackson/module/jackson-module-scala_2.13/2.10.0/jackson-module-scala_2.13-2.10.0.jar:/home/jenkins/.m2/repository/commons-httpclient/commons-httpclient/3.1/commons-httpclient-3.1.jar:/home/jenkins/.m2/repository/org/scalatest/scalatest-core_2.13/3.2.3/scalatest-core_2.13-3.2.3.jar:/home/jenkins/.m2/repository/org/scalatest/scalatest-matchers-core_2.13/3.2.3/scalatest-matchers-core_2.13-3.2.3.jar:/home/jenkins/.m2/repository/com/clearspring/analytics/stream/2.9.6/stream-2.9.6.jar:/home/jenkins/.m2/repository/org/scalatest/scalatest_2.13/3.2.3/scalatest_2.13-3.2.3.jar:/home/jenkins/.m2/repository/org/apache/hadoop/hadoop-mapreduce-client-common/2.7.4/hadoop-mapreduce-client-common-2.7.4.jar:/home/jenkins/.m2/repository/org/glassfish/hk2/hk2-locator/2.6.1/hk2-locator-2.6.1.jar:/home/jenkins/.m2/repository/org/slf4j/slf4j-log4j12/1.7.30/slf4j-log4j12-1.7.30.jar:/home/jenkins/.m2/repository/org/glassfish/hk2/hk2-utils/2.6.1/hk2-utils-2.6.1.jar:/home/jenkins/.m2/repository/com/thoughtworks/paranamer/paranamer/2.8/paranamer-2.8.jar:/home/jenkins/.m2/repository/io/netty/netty-all/4.1.51.Final/netty-all-4.1.51.Final.jar:/home/jenkins/.m2/repository/org/scalatest/scalatest-propspec_2.13/3.2.3/scalatest-propspec_2.13-3.2.3.jar:/home/jenkins/.m2/repository/com/fasterxml/jackson/core/jackson-annotations/2.10.0/jackson-annotations-2.10.0.jar:/home/jenkins/.m2/repository/org/apache/hadoop/hadoop-client/2.7.4/hadoop-client-2.7.4.jar:/home/jenkins/.m2/repository/org/objenesis/objenesis/2.6/objenesis-2.6.jar:/home/jenkins/.m2/repository/xml-apis/xml-apis/1.4.01/xml-apis-1.4.01.jar:/home/jenkins/.m2/repository/org/fusesource/leveldbjni/leveldbjni-all/1.8/leveldbjni-all-1.8.jar:/home/jenkins/.m2/repository/org/apache/commons/commons-text/1.6/commons-text-1.6.jar:/home/jenkins/.m2/repository/com/fasterxml/jackson/core/jackson-core/2.10.0/jackson-core-2.10.0.jar:/home/jenkins/.m2/repository/jakarta/ws/rs/jakarta.ws.rs-api/2.1.6/jakarta.ws.rs-api-2.1.6.jar:/home/jenkins/.m2/repository/org/tukaani/xz/1.5/xz-1.5.jar:/home/jenkins/.m2/repository/org/glassfish/hk2/external/aopalliance-repackaged/2.6.1/aopalliance-repackaged-2.6.1.jar:/home/jenkins/workspace/spark-branch-3.1-test-maven-hadoop-2.7-scala-2.13/common/kvstore/target/scala-2.13/classes:/home/jenkins/.m2/repository/com/amazonaws/aws-java-sdk-sts/1.11.655/aws-java-sdk-sts-1.11.655.jar:/home/jenkins/.m2/repository/org/apache/hadoop/hadoop-common/2.7.4/hadoop-common-2.7.4.jar:/home/jenkins/.m2/repository/com/amazonaws/aws-java-sdk-cloudwatch/1.11.655/aws-java-sdk-cloudwatch-1.11.655.jar:/home/jenkins/.m2/repository/commons-io/commons-io/2.4/commons-io-2.4.jar:/home/jenkins/.m2/repository/com/fasterxml/jackson/module/jackson-module-paranamer/2.10.0/jackson-module-paranamer-2.10.0.jar:/home/jenkins/.m2/repository/org/scalatestplus/scalatestplus-mockito_2.13/1.0.0-SNAP5/scalatestplus-mockito_2.13-1.0.0-SNAP5.jar:/home/jenkins/.m2/repository/org/apache/hadoop/hadoop-yarn-client/2.7.4/hadoop-yarn-client-2.7.4.jar:/home/jenkins/.m2/repository/com/esotericsoftware/kryo-shaded/4.0.2/kryo-shaded-4.0.2.jar:/home/jenkins/.m2/repository/com/esotericsoftware/minlog/1.3.0/minlog-1.3.0.jar:/home/jenkins/.m2/repository/org/codehaus/jackson/jackson-core-asl/1.9.13/jackson-core-asl-1.9.13.jar:/home/jenkins/.m2/repository/net/sf/py4j/py4j/0.10.9/py4j-0.10.9.jar:/home/jenkins/.m2/repository/org/scalatest/scalatest-diagrams_2.13/3.2.3/scalatest-diagrams_2.13-3.2.3.jar:/home/jenkins/.m2/repository/org/eclipse/jetty/jetty-util-ajax/9.4.40.v20210413/jetty-util-ajax-9.4.40.v20210413.jar:/home/jenkins/.m2/repository/com/squareup/okhttp3/okhttp/3.11.0/okhttp-3.11.0.jar:/home/jenkins/.m2/repository/org/slf4j/jul-to-slf4j/1.7.30/jul-to-slf4j-1.7.30.jar:/home/jenkins/.m2/repository/org/seleniumhq/selenium/selenium-ie-driver/3.141.59/selenium-ie-driver-3.141.59.jar:/home/jenkins/.m2/repository/org/lz4/lz4-java/1.7.1/lz4-java-1.7.1.jar:/home/jenkins/.m2/repository/com/amazonaws/amazon-kinesis-producer/0.12.8/amazon-kinesis-producer-0.12.8.jar:/home/jenkins/.m2/repository/javax/xml/bind/jaxb-api/2.2.2/jaxb-api-2.2.2.jar:/home/jenkins/workspace/spark-branch-3.1-test-maven-hadoop-2.7-scala-2.13/common/tags/target/scala-2.13/test-classes:/home/jenkins/.m2/repository/org/scala-lang/scala-library/2.13.4/scala-library-2.13.4.jar:/home/jenkins/.m2/repository/org/mortbay/jetty/jetty-sslengine/6.1.26/jetty-sslengine-6.1.26.jar:/home/jenkins/.m2/repository/io/dropwizard/metrics/metrics-graphite/4.1.1/metrics-graphite-4.1.1.jar:/home/jenkins/.m2/repository/com/amazonaws/aws-java-sdk-dynamodb/1.11.655/aws-java-sdk-dynamodb-1.11.655.jar:/home/jenkins/.m2/repository/org/scalatest/scalatest-mustmatchers_2.13/3.2.3/scalatest-mustmatchers_2.13-3.2.3.jar:/home/jenkins/.m2/repository/commons-codec/commons-codec/1.10/commons-codec-1.10.jar:/home/jenkins/.m2/repository/com/google/guava/guava/14.0.1/guava-14.0.1.jar:/home/jenkins/.m2/repository/org/apache/httpcomponents/httpcore/4.4.12/httpcore-4.4.12.jar:/home/jenkins/.m2/repository/org/eclipse/jetty/jetty-xml/9.4.40.v20210413/jetty-xml-9.4.40.v20210413.jar:/home/jenkins/.m2/repository/org/eclipse/jetty/jetty-io/9.4.40.v20210413/jetty-io-9.4.40.v20210413.jar:/home/jenkins/.m2/repository/org/apache/hadoop/hadoop-mapreduce-client-core/2.7.4/hadoop-mapreduce-client-core-2.7.4.jar:/home/jenkins/.m2/repository/javax/servlet/javax.servlet-api/3.1.0/javax.servlet-api-3.1.0.jar:/home/jenkins/.m2/repository/org/apache/commons/commons-math3/3.4.1/commons-math3-3.4.1.jar:/home/jenkins/.m2/repository/javax/xml/stream/stax-api/1.0-2/stax-api-1.0-2.jar:/home/jenkins/.m2/repository/org/json4s/json4s-jackson_2.13/3.7.0-M5/json4s-jackson_2.13-3.7.0-M5.jar:/home/jenkins/.m2/repository/org/codehaus/jackson/jackson-xc/1.9.13/jackson-xc-1.9.13.jar:/home/jenkins/.m2/repository/com/amazonaws/amazon-kinesis-client/1.12.0/amazon-kinesis-client-1.12.0.jar:/home/jenkins/workspace/spark-branch-3.1-test-maven-hadoop-2.7-scala-2.13/common/tags/target/scala-2.13/classes:/home/jenkins/.m2/repository/org/eclipse/jetty/jetty-webapp/9.4.40.v20210413/jetty-webapp-9.4.40.v20210413.jar:/home/jenkins/.m2/repository/org/glassfish/jersey/core/jersey-common/2.30/jersey-common-2.30.jar:/home/jenkins/.m2/repository/oro/oro/2.0.8/oro-2.0.8.jar:/home/jenkins/.m2/repository/com/novocode/junit-interface/0.11/junit-interface-0.11.jar:/home/jenkins/.m2/repository/org/apache/xbean/xbean-asm7-shaded/4.15/xbean-asm7-shaded-4.15.jar:/home/jenkins/.m2/repository/com/github/luben/zstd-jni/1.4.8-1/zstd-jni-1.4.8-1.jar:/home/jenkins/.m2/repository/org/scala-lang/modules/scala-xml_2.13/1.2.0/scala-xml_2.13-1.2.0.jar:/home/jenkins/.m2/repository/com/amazonaws/aws-java-sdk-kinesis/1.11.655/aws-java-sdk-kinesis-1.11.655.jar:/home/jenkins/.m2/repository/org/glassfish/hk2/hk2-api/2.6.1/hk2-api-2.6.1.jar:/home/jenkins/.m2/repository/org/apache/zookeeper/zookeeper/3.4.14/zookeeper-3.4.14.jar:/home/jenkins/.m2/repository/org/seleniumhq/selenium/selenium-chrome-driver/3.141.59/selenium-chrome-driver-3.141.59.jar:/home/jenkins/.m2/repository/org/seleniumhq/selenium/selenium-opera-driver/3.141.59/selenium-opera-driver-3.141.59.jar:/home/jenkins/.m2/repository/jakarta/annotation/jakarta.annotation-api/1.3.5/jakarta.annotation-api-1.3.5.jar:/home/jenkins/.m2/repository/org/mortbay/jetty/jetty-util/6.1.26/jetty-util-6.1.26.jar:/home/jenkins/.m2/repository/org/apache/hadoop/hadoop-yarn-api/2.7.4/hadoop-yarn-api-2.7.4.jar:/home/jenkins/.m2/repository/org/apache/yetus/audience-annotations/0.5.0/audience-annotations-0.5.0.jar:/home/jenkins/.m2/repository/io/dropwizard/metrics/metrics-jvm/4.1.1/metrics-jvm-4.1.1.jar:/home/jenkins/.m2/repository/org/hamcrest/hamcrest-core/1.3/hamcrest-core-1.3.jar:/home/jenkins/.m2/repository/org/seleniumhq/selenium/selenium-support/3.141.59/selenium-support-3.141.59.jar:/home/jenkins/.m2/repository/org/apache/hadoop/hadoop-yarn-server-common/2.7.4/hadoop-yarn-server-common-2.7.4.jar:/home/jenkins/.m2/repository/org/apache/hadoop/hadoop-mapreduce-client-app/2.7.4/hadoop-mapreduce-client-app-2.7.4.jar:/home/jenkins/.m2/repository/org/apache/avro/avro-ipc/1.8.2/avro-ipc-1.8.2.jar:/home/jenkins/.m2/repository/xmlenc/xmlenc/0.52/xmlenc-0.52.jar:/home/jenkins/.m2/repository/org/apache/directory/api/api-util/1.0.0-M20/api-util-1.0.0-M20.jar:/home/jenkins/.m2/repository/com/fasterxml/jackson/core/jackson-databind/2.10.0/jackson-databind-2.10.0.jar:/home/jenkins/.m2/repository/org/apache/hadoop/hadoop-yarn-common/2.7.4/hadoop-yarn-common-2.7.4.jar:/home/jenkins/.m2/repository/org/apache/directory/api/api-asn1-api/1.0.0-M20/api-asn1-api-1.0.0-M20.jar:/home/jenkins/.m2/repository/org/eclipse/jetty/jetty-client/9.4.40.v20210413/jetty-client-9.4.40.v20210413.jar:/home/jenkins/.m2/repository/org/scalatestplus/scalatestplus-selenium_2.13/1.0.0-SNAP5/scalatestplus-selenium_2.13-1.0.0-SNAP5.jar:/home/jenkins/.m2/repository/org/apache/commons/commons-crypto/1.1.0/commons-crypto-1.1.0.jar:/home/jenkins/.m2/repository/org/apache/commons/commons-lang3/3.10/commons-lang3-3.10.jar:/home/jenkins/.m2/repository/org/seleniumhq/selenium/selenium-api/3.141.59/selenium-api-3.141.59.jar:/home/jenkins/.m2/repository/org/seleniumhq/selenium/selenium-java/3.141.59/selenium-java-3.141.59.jar:/home/jenkins/workspace/spark-branch-3.1-test-maven-hadoop-2.7-scala-2.13/common/network-common/target/scala-2.13/classes:/home/jenkins/.m2/repository/org/roaringbitmap/RoaringBitmap/0.9.0/RoaringBitmap-0.9.0.jar:/home/jenkins/.m2/repository/org/slf4j/jcl-over-slf4j/1.7.30/jcl-over-slf4j-1.7.30.jar:/home/jenkins/.m2/repository/org/glassfish/jersey/core/jersey-server/2.30/jersey-server-2.30.jar:/home/jenkins/.m2/repository/io/dropwizard/metrics/metrics-jmx/4.1.1/metrics-jmx-4.1.1.jar:/home/jenkins/.m2/repository/org/glassfish/jersey/core/jersey-client/2.30/jersey-client-2.30.jar:/home/jenkins/.m2/repository/org/seleniumhq/selenium/selenium-firefox-driver/3.141.59/selenium-firefox-driver-3.141.59.jar:/home/jenkins/.m2/repository/commons-logging/commons-logging/1.1.3/commons-logging-1.1.3.jar:/home/jenkins/.m2/repository/org/eclipse/jetty/jetty-proxy/9.4.40.v20210413/jetty-proxy-9.4.40.v20210413.jar:/home/jenkins/.m2/repository/com/amazonaws/jmespath-java/1.11.655/jmespath-java-1.11.655.jar:/home/jenkins/.m2/repository/org/seleniumhq/selenium/selenium-safari-driver/3.141.59/selenium-safari-driver-3.141.59.jar:/home/jenkins/.m2/repository/software/amazon/ion/ion-java/1.0.2/ion-java-1.0.2.jar:/home/jenkins/.m2/repository/org/scalatest/scalatest-refspec_2.13/3.2.3/scalatest-refspec_2.13-3.2.3.jar
[INFO] 
[INFO] --- scala-maven-plugin:4.3.0:testCompile (scala-test-compile-first) @ spark-streaming-kinesis-asl_2.13 ---
[INFO] Using incremental compilation using Mixed compile order
[INFO] Compiler bridge file: /home/jenkins/.sbt/1.0/zinc/org.scala-sbt/org.scala-sbt-compiler-bridge_2.13-1.3.1-bin_2.13.4__52.0-1.3.1_20191012T045515.jar
[INFO] Compiling 8 Scala sources and 1 Java source to /home/jenkins/workspace/spark-branch-3.1-test-maven-hadoop-2.7-scala-2.13/external/kinesis-asl/target/scala-2.13/test-classes ...
[WARNING] [Warn] /home/jenkins/workspace/spark-branch-3.1-test-maven-hadoop-2.7-scala-2.13/external/kinesis-asl/src/test/scala/org/apache/spark/streaming/kinesis/KinesisInputDStreamBuilderSuite.scala:182: [deprecation @ org.apache.spark.streaming.kinesis.KinesisInputDStreamBuilderSuite.<local KinesisInputDStreamBuilderSuite>.kinesisDStream | origin=org.apache.spark.streaming.kinesis.KinesisInputDStream.Builder.initialPositionInStream | version=2.3.0] method initialPositionInStream in class Builder is deprecated (since 2.3.0): use initialPosition(initialPosition: KinesisInitialPosition)
[WARNING] one warning found
[WARNING] [Warn] /home/jenkins/workspace/spark-branch-3.1-test-maven-hadoop-2.7-scala-2.13/external/kinesis-asl/src/test/java/org/apache/spark/streaming/kinesis/JavaKinesisInputDStreamBuilderSuite.java:39: auxiliary class org.apache.spark.streaming.kinesis.KinesisInitialPosition in KinesisInitialPositions.java should not be accessed from outside its own source file
[WARNING] [Warn] /home/jenkins/workspace/spark-branch-3.1-test-maven-hadoop-2.7-scala-2.13/external/kinesis-asl/src/test/java/org/apache/spark/streaming/kinesis/JavaKinesisInputDStreamBuilderSuite.java:84: initialPositionInStream(com.amazonaws.services.kinesis.clientlibrary.lib.worker.InitialPositionInStream) in org.apache.spark.streaming.kinesis.KinesisInputDStream.Builder has been deprecated
[INFO] Done compiling.
[INFO] compile in 18.7 s
[INFO] 
[INFO] --- maven-surefire-plugin:3.0.0-M5:test (default-test) @ spark-streaming-kinesis-asl_2.13 ---
[INFO] 
[INFO] -------------------------------------------------------
[INFO]  T E S T S
[INFO] -------------------------------------------------------
[INFO] Running org.apache.spark.streaming.kinesis.JavaKinesisInputDStreamBuilderSuite
[INFO] Tests run: 2, Failures: 0, Errors: 0, Skipped: 0, Time elapsed: 3.388 s - in org.apache.spark.streaming.kinesis.JavaKinesisInputDStreamBuilderSuite
[INFO] 
[INFO] Results:
[INFO] 
[INFO] Tests run: 2, Failures: 0, Errors: 0, Skipped: 0
[INFO] 
[INFO] 
[INFO] --- maven-surefire-plugin:3.0.0-M5:test (test) @ spark-streaming-kinesis-asl_2.13 ---
[INFO] Skipping execution of surefire because it has already been run for this configuration
[INFO] 
[INFO] --- scalatest-maven-plugin:2.0.0:test (test) @ spark-streaming-kinesis-asl_2.13 ---
Discovery starting.
Discovery completed in 2 seconds, 642 milliseconds.
Run starting. Expected test count is: 35
KinesisInputDStreamBuilderSuite:
- should raise an exception if the StreamingContext is missing
- should raise an exception if the stream name is missing
- should raise an exception if the checkpoint app name is missing
- should propagate required values to KinesisInputDStream
- should propagate default values to KinesisInputDStream
- should propagate custom non-auth values to KinesisInputDStream
- old Api should throw UnsupportedOperationExceptionexception with AT_TIMESTAMP
WithoutAggregationKinesisBackedBlockRDDSuite:
- Basic reading from Kinesis [enable by setting env var ENABLE_KINESIS_TESTS=1] !!! IGNORED !!!
- Read data available in both block manager and Kinesis [enable by setting env var ENABLE_KINESIS_TESTS=1] !!! IGNORED !!!
- Read data available only in block manager, not in Kinesis [enable by setting env var ENABLE_KINESIS_TESTS=1] !!! IGNORED !!!
- Read data available only in Kinesis, not in block manager [enable by setting env var ENABLE_KINESIS_TESTS=1] !!! IGNORED !!!
- Read data available partially in block manager, rest in Kinesis [enable by setting env var ENABLE_KINESIS_TESTS=1] !!! IGNORED !!!
- Test isBlockValid skips block fetching from block manager [enable by setting env var ENABLE_KINESIS_TESTS=1] !!! IGNORED !!!
- Test whether RDD is valid after removing blocks from block manager [enable by setting env var ENABLE_KINESIS_TESTS=1] !!! IGNORED !!!
KinesisReceiverSuite:
- process records including store and set checkpointer
- split into multiple processes if a limitation is set
- shouldn't store and update checkpointer when receiver is stopped
- shouldn't update checkpointer when exception occurs during store
- shutdown should checkpoint if the reason is TERMINATE
- shutdown should not checkpoint if the reason is something other than TERMINATE
- retry success on first attempt
- retry success on second attempt after a Kinesis throttling exception
- retry success on second attempt after a Kinesis dependency exception
- retry failed after a shutdown exception
- retry failed after an invalid state exception
- retry failed after unexpected exception
- retry failed after exhausting all retries
WithAggregationKinesisBackedBlockRDDSuite:
- Basic reading from Kinesis [enable by setting env var ENABLE_KINESIS_TESTS=1] !!! IGNORED !!!
- Read data available in both block manager and Kinesis [enable by setting env var ENABLE_KINESIS_TESTS=1] !!! IGNORED !!!
- Read data available only in block manager, not in Kinesis [enable by setting env var ENABLE_KINESIS_TESTS=1] !!! IGNORED !!!
- Read data available only in Kinesis, not in block manager [enable by setting env var ENABLE_KINESIS_TESTS=1] !!! IGNORED !!!
- Read data available partially in block manager, rest in Kinesis [enable by setting env var ENABLE_KINESIS_TESTS=1] !!! IGNORED !!!
- Test isBlockValid skips block fetching from block manager [enable by setting env var ENABLE_KINESIS_TESTS=1] !!! IGNORED !!!
- Test whether RDD is valid after removing blocks from block manager [enable by setting env var ENABLE_KINESIS_TESTS=1] !!! IGNORED !!!
WithAggregationKinesisStreamSuite:
- RDD generation
- basic operation [enable by setting env var ENABLE_KINESIS_TESTS=1] !!! IGNORED !!!
- custom message handling [enable by setting env var ENABLE_KINESIS_TESTS=1] !!! IGNORED !!!
- Kinesis read with custom configurations
- split and merge shards in a stream [enable by setting env var ENABLE_KINESIS_TESTS=1] !!! IGNORED !!!
- failure recovery [enable by setting env var ENABLE_KINESIS_TESTS=1] !!! IGNORED !!!
- Prepare KinesisTestUtils [enable by setting env var ENABLE_KINESIS_TESTS=1] !!! IGNORED !!!
KinesisCheckpointerSuite:
- checkpoint is not called twice for the same sequence number
- checkpoint is called after sequence number increases
- should checkpoint if we have exceeded the checkpoint interval
- shouldn't checkpoint if we have not exceeded the checkpoint interval
- should not checkpoint for the same sequence number
- removing checkpointer checkpoints one last time
- if checkpointing is going on, wait until finished before removing and checkpointing
SparkAWSCredentialsBuilderSuite:
- should build DefaultCredentials when given no params
- should build BasicCredentials
- should build STSCredentials
- SparkAWSCredentials classes should be serializable
WithoutAggregationKinesisStreamSuite:
- RDD generation
- basic operation [enable by setting env var ENABLE_KINESIS_TESTS=1] !!! IGNORED !!!
- custom message handling [enable by setting env var ENABLE_KINESIS_TESTS=1] !!! IGNORED !!!
- Kinesis read with custom configurations
- split and merge shards in a stream [enable by setting env var ENABLE_KINESIS_TESTS=1] !!! IGNORED !!!
- failure recovery [enable by setting env var ENABLE_KINESIS_TESTS=1] !!! IGNORED !!!
- Prepare KinesisTestUtils [enable by setting env var ENABLE_KINESIS_TESTS=1] !!! IGNORED !!!
Run completed in 4 seconds, 971 milliseconds.
Total number of tests run: 35
Suites: completed 9, aborted 0
Tests: succeeded 35, failed 0, canceled 0, ignored 24, pending 0
All tests passed.
[INFO] 
[INFO] ------------------------------------------------------------------------
[INFO] Skipping Spark Project Examples
[INFO] This project has been banned from the build due to previous failures.
[INFO] ------------------------------------------------------------------------
[INFO] 
[INFO] -----< org.apache.spark:spark-streaming-kafka-0-10-assembly_2.13 >------
[INFO] Building Spark Integration for Kafka 0.10 Assembly 3.1.3-SNAPSHOT [22/31]
[INFO] --------------------------------[ jar ]---------------------------------
[INFO] 
[INFO] --- maven-enforcer-plugin:3.0.0-M2:enforce (enforce-versions) @ spark-streaming-kafka-0-10-assembly_2.13 ---
[INFO] 
[INFO] --- maven-enforcer-plugin:3.0.0-M2:enforce (enforce-no-duplicate-dependencies) @ spark-streaming-kafka-0-10-assembly_2.13 ---
[INFO] 
[INFO] --- mvn-scalafmt_2.13:1.0.3:format (default) @ spark-streaming-kafka-0-10-assembly_2.13 ---
[WARNING] format.skipSources set, ignoring main directories
[WARNING] format.skipTestSources set, ignoring validateOnly directories
[WARNING] No sources specified, skipping formatting
[INFO] 
[INFO] --- scala-maven-plugin:4.3.0:add-source (eclipse-add-source) @ spark-streaming-kafka-0-10-assembly_2.13 ---
[INFO] Add Source directory: /home/jenkins/workspace/spark-branch-3.1-test-maven-hadoop-2.7-scala-2.13/external/kafka-0-10-assembly/src/main/scala
[INFO] Add Test Source directory: /home/jenkins/workspace/spark-branch-3.1-test-maven-hadoop-2.7-scala-2.13/external/kafka-0-10-assembly/src/test/scala
[INFO] 
[INFO] --- maven-dependency-plugin:3.1.1:build-classpath (default-cli) @ spark-streaming-kafka-0-10-assembly_2.13 ---
[INFO] Dependencies classpath:
/home/jenkins/.m2/repository/org/mortbay/jetty/jetty-util/6.1.26/jetty-util-6.1.26.jar:/home/jenkins/.m2/repository/org/apache/hadoop/hadoop-yarn-api/2.7.4/hadoop-yarn-api-2.7.4.jar:/home/jenkins/.m2/repository/org/spark-project/spark/unused/1.0.0/unused-1.0.0.jar:/home/jenkins/.m2/repository/org/apache/commons/commons-compress/1.21/commons-compress-1.21.jar:/home/jenkins/.m2/repository/commons-io/commons-io/2.4/commons-io-2.4.jar:/home/jenkins/.m2/repository/org/codehaus/jackson/jackson-mapper-asl/1.9.13/jackson-mapper-asl-1.9.13.jar:/home/jenkins/.m2/repository/org/apache/kafka/kafka-clients/2.6.0/kafka-clients-2.6.0.jar:/home/jenkins/.m2/repository/javax/xml/bind/jaxb-api/2.2.2/jaxb-api-2.2.2.jar:/home/jenkins/.m2/repository/com/github/luben/zstd-jni/1.4.8-1/zstd-jni-1.4.8-1.jar:/home/jenkins/.m2/repository/org/codehaus/jackson/jackson-jaxrs/1.9.13/jackson-jaxrs-1.9.13.jar:/home/jenkins/.m2/repository/javax/xml/stream/stax-api/1.0-2/stax-api-1.0-2.jar:/home/jenkins/workspace/spark-branch-3.1-test-maven-hadoop-2.7-scala-2.13/external/kafka-0-10/target/scala-2.13/classes:/home/jenkins/.m2/repository/com/thoughtworks/paranamer/paranamer/2.8/paranamer-2.8.jar:/home/jenkins/.m2/repository/org/apache/hadoop/hadoop-yarn-client/2.7.4/hadoop-yarn-client-2.7.4.jar:/home/jenkins/.m2/repository/org/codehaus/jackson/jackson-xc/1.9.13/jackson-xc-1.9.13.jar:/home/jenkins/workspace/spark-branch-3.1-test-maven-hadoop-2.7-scala-2.13/common/tags/target/scala-2.13/classes:/home/jenkins/.m2/repository/org/codehaus/jackson/jackson-core-asl/1.9.13/jackson-core-asl-1.9.13.jar:/home/jenkins/.m2/repository/org/apache/hadoop/hadoop-yarn-common/2.7.4/hadoop-yarn-common-2.7.4.jar:/home/jenkins/.m2/repository/javax/activation/activation/1.1.1/activation-1.1.1.jar:/home/jenkins/workspace/spark-branch-3.1-test-maven-hadoop-2.7-scala-2.13/external/kafka-0-10-token-provider/target/scala-2.13/classes:/home/jenkins/.m2/repository/commons-cli/commons-cli/1.2/commons-cli-1.2.jar
[INFO] 
[INFO] --- maven-remote-resources-plugin:1.5:process (process-resource-bundles) @ spark-streaming-kafka-0-10-assembly_2.13 ---
[INFO] 
[INFO] --- maven-resources-plugin:2.7:resources (default-resources) @ spark-streaming-kafka-0-10-assembly_2.13 ---
[INFO] Using 'UTF-8' encoding to copy filtered resources.
[INFO] skip non existing resourceDirectory /home/jenkins/workspace/spark-branch-3.1-test-maven-hadoop-2.7-scala-2.13/external/kafka-0-10-assembly/src/main/resources
[INFO] Copying 3 resources
[INFO] 
[INFO] --- maven-compiler-plugin:3.8.1:compile (default-compile) @ spark-streaming-kafka-0-10-assembly_2.13 ---
[INFO] Not compiling main sources
[INFO] 
[INFO] --- scala-maven-plugin:4.3.0:compile (scala-compile-first) @ spark-streaming-kafka-0-10-assembly_2.13 ---
[INFO] compile in 0.0 s
[INFO] No sources to compile
[INFO] 
[INFO] --- maven-antrun-plugin:1.8:run (create-tmp-dir) @ spark-streaming-kafka-0-10-assembly_2.13 ---
[INFO] Executing tasks

main:
    [mkdir] Created dir: /home/jenkins/workspace/spark-branch-3.1-test-maven-hadoop-2.7-scala-2.13/external/kafka-0-10-assembly/target/tmp
[INFO] Executed tasks
[INFO] 
[INFO] --- maven-resources-plugin:2.7:testResources (default-testResources) @ spark-streaming-kafka-0-10-assembly_2.13 ---
[INFO] Using 'UTF-8' encoding to copy filtered resources.
[INFO] skip non existing resourceDirectory /home/jenkins/workspace/spark-branch-3.1-test-maven-hadoop-2.7-scala-2.13/external/kafka-0-10-assembly/src/test/resources
[INFO] Copying 3 resources
[INFO] 
[INFO] --- maven-compiler-plugin:3.8.1:testCompile (default-testCompile) @ spark-streaming-kafka-0-10-assembly_2.13 ---
[INFO] Not compiling test sources
[INFO] 
[INFO] --- maven-dependency-plugin:3.1.1:build-classpath (generate-test-classpath) @ spark-streaming-kafka-0-10-assembly_2.13 ---
[INFO] Dependencies classpath:
/home/jenkins/.m2/repository/org/scalatest/scalatest-core_2.13/3.2.3/scalatest-core_2.13-3.2.3.jar:/home/jenkins/.m2/repository/org/scalatest/scalatest-matchers-core_2.13/3.2.3/scalatest-matchers-core_2.13-3.2.3.jar:/home/jenkins/.m2/repository/com/clearspring/analytics/stream/2.9.6/stream-2.9.6.jar:/home/jenkins/.m2/repository/org/scalatest/scalatest_2.13/3.2.3/scalatest_2.13-3.2.3.jar:/home/jenkins/.m2/repository/com/google/crypto/tink/tink/1.6.0/tink-1.6.0.jar:/home/jenkins/.m2/repository/org/apache/hadoop/hadoop-mapreduce-client-common/2.7.4/hadoop-mapreduce-client-common-2.7.4.jar:/home/jenkins/.m2/repository/org/glassfish/hk2/external/jakarta.inject/2.6.1/jakarta.inject-2.6.1.jar:/home/jenkins/.m2/repository/org/glassfish/hk2/hk2-locator/2.6.1/hk2-locator-2.6.1.jar:/home/jenkins/.m2/repository/org/apache/htrace/htrace-core/3.1.0-incubating/htrace-core-3.1.0-incubating.jar:/home/jenkins/.m2/repository/com/google/protobuf/protobuf-java/2.5.0/protobuf-java-2.5.0.jar:/home/jenkins/.m2/repository/org/apache/hadoop/hadoop-mapreduce-client-jobclient/2.7.4/hadoop-mapreduce-client-jobclient-2.7.4.jar:/home/jenkins/.m2/repository/org/slf4j/slf4j-log4j12/1.7.30/slf4j-log4j12-1.7.30.jar:/home/jenkins/.m2/repository/org/glassfish/hk2/hk2-utils/2.6.1/hk2-utils-2.6.1.jar:/home/jenkins/.m2/repository/org/eclipse/jetty/jetty-plus/9.4.40.v20210413/jetty-plus-9.4.40.v20210413.jar:/home/jenkins/.m2/repository/jakarta/servlet/jakarta.servlet-api/4.0.3/jakarta.servlet-api-4.0.3.jar:/home/jenkins/.m2/repository/com/thoughtworks/paranamer/paranamer/2.8/paranamer-2.8.jar:/home/jenkins/.m2/repository/io/netty/netty-all/4.1.51.Final/netty-all-4.1.51.Final.jar:/home/jenkins/.m2/repository/org/scalatest/scalatest-propspec_2.13/3.2.3/scalatest-propspec_2.13-3.2.3.jar:/home/jenkins/.m2/repository/com/fasterxml/jackson/core/jackson-annotations/2.10.0/jackson-annotations-2.10.0.jar:/home/jenkins/workspace/spark-branch-3.1-test-maven-hadoop-2.7-scala-2.13/core/target/scala-2.13/classes:/home/jenkins/.m2/repository/com/google/code/findbugs/jsr305/3.0.0/jsr305-3.0.0.jar:/home/jenkins/.m2/repository/org/apache/hadoop/hadoop-client/2.7.4/hadoop-client-2.7.4.jar:/home/jenkins/.m2/repository/org/objenesis/objenesis/2.6/objenesis-2.6.jar:/home/jenkins/.m2/repository/org/scalatest/scalatest-shouldmatchers_2.13/3.2.3/scalatest-shouldmatchers_2.13-3.2.3.jar:/home/jenkins/.m2/repository/org/fusesource/leveldbjni/leveldbjni-all/1.8/leveldbjni-all-1.8.jar:/home/jenkins/.m2/repository/xml-apis/xml-apis/1.4.01/xml-apis-1.4.01.jar:/home/jenkins/.m2/repository/org/apache/commons/commons-text/1.6/commons-text-1.6.jar:/home/jenkins/.m2/repository/com/fasterxml/jackson/core/jackson-core/2.10.0/jackson-core-2.10.0.jar:/home/jenkins/.m2/repository/org/glassfish/jersey/media/jersey-media-jaxb/2.30/jersey-media-jaxb-2.30.jar:/home/jenkins/.m2/repository/jakarta/ws/rs/jakarta.ws.rs-api/2.1.6/jakarta.ws.rs-api-2.1.6.jar:/home/jenkins/.m2/repository/org/tukaani/xz/1.5/xz-1.5.jar:/home/jenkins/.m2/repository/org/glassfish/hk2/external/aopalliance-repackaged/2.6.1/aopalliance-repackaged-2.6.1.jar:/home/jenkins/workspace/spark-branch-3.1-test-maven-hadoop-2.7-scala-2.13/common/kvstore/target/scala-2.13/classes:/home/jenkins/.m2/repository/org/apache/hadoop/hadoop-common/2.7.4/hadoop-common-2.7.4.jar:/home/jenkins/.m2/repository/commons-io/commons-io/2.4/commons-io-2.4.jar:/home/jenkins/.m2/repository/org/scalatest/scalatest-funsuite_2.13/3.2.3/scalatest-funsuite_2.13-3.2.3.jar:/home/jenkins/.m2/repository/org/eclipse/jetty/jetty-http/9.4.40.v20210413/jetty-http-9.4.40.v20210413.jar:/home/jenkins/.m2/repository/org/codehaus/jackson/jackson-jaxrs/1.9.13/jackson-jaxrs-1.9.13.jar:/home/jenkins/.m2/repository/com/fasterxml/jackson/module/jackson-module-paranamer/2.10.0/jackson-module-paranamer-2.10.0.jar:/home/jenkins/.m2/repository/org/scalatestplus/scalatestplus-mockito_2.13/1.0.0-SNAP5/scalatestplus-mockito_2.13-1.0.0-SNAP5.jar:/home/jenkins/.m2/repository/org/apache/hadoop/hadoop-yarn-client/2.7.4/hadoop-yarn-client-2.7.4.jar:/home/jenkins/.m2/repository/org/eclipse/jetty/jetty-jndi/9.4.40.v20210413/jetty-jndi-9.4.40.v20210413.jar:/home/jenkins/.m2/repository/com/esotericsoftware/kryo-shaded/4.0.2/kryo-shaded-4.0.2.jar:/home/jenkins/.m2/repository/com/esotericsoftware/minlog/1.3.0/minlog-1.3.0.jar:/home/jenkins/.m2/repository/org/scalatest/scalatest-featurespec_2.13/3.2.3/scalatest-featurespec_2.13-3.2.3.jar:/home/jenkins/.m2/repository/org/scalatest/scalatest-funspec_2.13/3.2.3/scalatest-funspec_2.13-3.2.3.jar:/home/jenkins/.m2/repository/org/codehaus/jackson/jackson-core-asl/1.9.13/jackson-core-asl-1.9.13.jar:/home/jenkins/.m2/repository/xerces/xercesImpl/2.12.0/xercesImpl-2.12.0.jar:/home/jenkins/.m2/repository/net/sf/py4j/py4j/0.10.9/py4j-0.10.9.jar:/home/jenkins/.m2/repository/org/scalatest/scalatest-diagrams_2.13/3.2.3/scalatest-diagrams_2.13-3.2.3.jar:/home/jenkins/.m2/repository/net/bytebuddy/byte-buddy/1.10.13/byte-buddy-1.10.13.jar:/home/jenkins/.m2/repository/org/eclipse/jetty/jetty-util-ajax/9.4.40.v20210413/jetty-util-ajax-9.4.40.v20210413.jar:/home/jenkins/workspace/spark-branch-3.1-test-maven-hadoop-2.7-scala-2.13/external/kafka-0-10-token-provider/target/scala-2.13/classes:/home/jenkins/.m2/repository/org/json4s/json4s-core_2.13/3.7.0-M5/json4s-core_2.13-3.7.0-M5.jar:/home/jenkins/.m2/repository/com/squareup/okhttp3/okhttp/3.11.0/okhttp-3.11.0.jar:/home/jenkins/.m2/repository/org/eclipse/jetty/jetty-util/9.4.40.v20210413/jetty-util-9.4.40.v20210413.jar:/home/jenkins/.m2/repository/com/twitter/chill-java/0.9.5/chill-java-0.9.5.jar:/home/jenkins/.m2/repository/org/slf4j/jul-to-slf4j/1.7.30/jul-to-slf4j-1.7.30.jar:/home/jenkins/.m2/repository/commons-net/commons-net/3.1/commons-net-3.1.jar:/home/jenkins/.m2/repository/org/seleniumhq/selenium/selenium-ie-driver/3.141.59/selenium-ie-driver-3.141.59.jar:/home/jenkins/.m2/repository/org/lz4/lz4-java/1.7.1/lz4-java-1.7.1.jar:/home/jenkins/.m2/repository/javax/xml/bind/jaxb-api/2.2.2/jaxb-api-2.2.2.jar:/home/jenkins/workspace/spark-branch-3.1-test-maven-hadoop-2.7-scala-2.13/streaming/target/scala-2.13/classes:/home/jenkins/.m2/repository/org/json4s/json4s-ast_2.13/3.7.0-M5/json4s-ast_2.13-3.7.0-M5.jar:/home/jenkins/.m2/repository/org/scala-lang/scala-library/2.13.4/scala-library-2.13.4.jar:/home/jenkins/.m2/repository/commons-lang/commons-lang/2.6/commons-lang-2.6.jar:/home/jenkins/.m2/repository/io/dropwizard/metrics/metrics-graphite/4.1.1/metrics-graphite-4.1.1.jar:/home/jenkins/.m2/repository/org/mortbay/jetty/jetty-sslengine/6.1.26/jetty-sslengine-6.1.26.jar:/home/jenkins/.m2/repository/com/twitter/chill_2.13/0.9.5/chill_2.13-0.9.5.jar:/home/jenkins/.m2/repository/org/scalatest/scalatest-freespec_2.13/3.2.3/scalatest-freespec_2.13-3.2.3.jar:/home/jenkins/.m2/repository/org/seleniumhq/selenium/selenium-edge-driver/3.141.59/selenium-edge-driver-3.141.59.jar:/home/jenkins/.m2/repository/org/eclipse/jetty/jetty-server/9.4.40.v20210413/jetty-server-9.4.40.v20210413.jar:/home/jenkins/.m2/repository/org/apache/commons/commons-exec/1.3/commons-exec-1.3.jar:/home/jenkins/.m2/repository/javax/activation/activation/1.1.1/activation-1.1.1.jar:/home/jenkins/.m2/repository/org/apache/hadoop/hadoop-auth/2.7.4/hadoop-auth-2.7.4.jar:/home/jenkins/.m2/repository/org/scalatest/scalatest-mustmatchers_2.13/3.2.3/scalatest-mustmatchers_2.13-3.2.3.jar:/home/jenkins/.m2/repository/org/apache/hadoop/hadoop-mapreduce-client-shuffle/2.7.4/hadoop-mapreduce-client-shuffle-2.7.4.jar:/home/jenkins/.m2/repository/commons-codec/commons-codec/1.10/commons-codec-1.10.jar:/home/jenkins/.m2/repository/org/apache/httpcomponents/httpcore/4.4.12/httpcore-4.4.12.jar:/home/jenkins/.m2/repository/com/google/guava/guava/14.0.1/guava-14.0.1.jar:/home/jenkins/.m2/repository/org/eclipse/jetty/jetty-xml/9.4.40.v20210413/jetty-xml-9.4.40.v20210413.jar:/home/jenkins/.m2/repository/commons-beanutils/commons-beanutils/1.9.4/commons-beanutils-1.9.4.jar:/home/jenkins/.m2/repository/org/apache/ivy/ivy/2.4.0/ivy-2.4.0.jar:/home/jenkins/.m2/repository/org/eclipse/jetty/jetty-io/9.4.40.v20210413/jetty-io-9.4.40.v20210413.jar:/home/jenkins/.m2/repository/org/apache/hadoop/hadoop-mapreduce-client-core/2.7.4/hadoop-mapreduce-client-core-2.7.4.jar:/home/jenkins/.m2/repository/javax/servlet/javax.servlet-api/3.1.0/javax.servlet-api-3.1.0.jar:/home/jenkins/.m2/repository/org/apache/commons/commons-math3/3.4.1/commons-math3-3.4.1.jar:/home/jenkins/.m2/repository/net/razorvine/pyrolite/4.30/pyrolite-4.30.jar:/home/jenkins/.m2/repository/javax/xml/stream/stax-api/1.0-2/stax-api-1.0-2.jar:/home/jenkins/.m2/repository/org/json4s/json4s-jackson_2.13/3.7.0-M5/json4s-jackson_2.13-3.7.0-M5.jar:/home/jenkins/.m2/repository/jakarta/validation/jakarta.validation-api/2.0.2/jakarta.validation-api-2.0.2.jar:/home/jenkins/.m2/repository/org/scalatestplus/scalatestplus-scalacheck_2.13/3.1.0.0-RC2/scalatestplus-scalacheck_2.13-3.1.0.0-RC2.jar:/home/jenkins/.m2/repository/org/codehaus/jackson/jackson-xc/1.9.13/jackson-xc-1.9.13.jar:/home/jenkins/.m2/repository/org/glassfish/jersey/inject/jersey-hk2/2.30/jersey-hk2-2.30.jar:/home/jenkins/workspace/spark-branch-3.1-test-maven-hadoop-2.7-scala-2.13/common/tags/target/scala-2.13/classes:/home/jenkins/.m2/repository/org/scalatest/scalatest-wordspec_2.13/3.2.3/scalatest-wordspec_2.13-3.2.3.jar:/home/jenkins/.m2/repository/org/scala-lang/scala-reflect/2.13.4/scala-reflect-2.13.4.jar:/home/jenkins/.m2/repository/org/eclipse/jetty/jetty-webapp/9.4.40.v20210413/jetty-webapp-9.4.40.v20210413.jar:/home/jenkins/.m2/repository/org/glassfish/jersey/core/jersey-common/2.30/jersey-common-2.30.jar:/home/jenkins/.m2/repository/oro/oro/2.0.8/oro-2.0.8.jar:/home/jenkins/.m2/repository/org/apache/avro/avro-mapred/1.8.2/avro-mapred-1.8.2-hadoop2.jar:/home/jenkins/workspace/spark-branch-3.1-test-maven-hadoop-2.7-scala-2.13/common/network-shuffle/target/scala-2.13/classes:/home/jenkins/.m2/repository/log4j/log4j/1.2.17/log4j-1.2.17.jar:/home/jenkins/.m2/repository/com/novocode/junit-interface/0.11/junit-interface-0.11.jar:/home/jenkins/.m2/repository/org/apache/xbean/xbean-asm7-shaded/4.15/xbean-asm7-shaded-4.15.jar:/home/jenkins/.m2/repository/org/apache/curator/curator-framework/2.7.1/curator-framework-2.7.1.jar:/home/jenkins/.m2/repository/org/apache/curator/curator-recipes/2.7.1/curator-recipes-2.7.1.jar:/home/jenkins/.m2/repository/com/github/luben/zstd-jni/1.4.8-1/zstd-jni-1.4.8-1.jar:/home/jenkins/.m2/repository/io/dropwizard/metrics/metrics-core/4.1.1/metrics-core-4.1.1.jar:/home/jenkins/.m2/repository/org/scalactic/scalactic_2.13/3.2.3/scalactic_2.13-3.2.3.jar:/home/jenkins/.m2/repository/junit/junit/4.13.1/junit-4.13.1.jar:/home/jenkins/.m2/repository/org/scala-lang/modules/scala-xml_2.13/1.2.0/scala-xml_2.13-1.2.0.jar:/home/jenkins/.m2/repository/org/apache/avro/avro/1.8.2/avro-1.8.2.jar:/home/jenkins/.m2/repository/io/dropwizard/metrics/metrics-json/4.1.1/metrics-json-4.1.1.jar:/home/jenkins/.m2/repository/org/apache/directory/server/apacheds-kerberos-codec/2.0.0-M15/apacheds-kerberos-codec-2.0.0-M15.jar:/home/jenkins/.m2/repository/org/glassfish/hk2/hk2-api/2.6.1/hk2-api-2.6.1.jar:/home/jenkins/.m2/repository/org/roaringbitmap/shims/0.9.0/shims-0.9.0.jar:/home/jenkins/.m2/repository/org/apache/zookeeper/zookeeper/3.4.14/zookeeper-3.4.14.jar:/home/jenkins/.m2/repository/org/seleniumhq/selenium/selenium-chrome-driver/3.141.59/selenium-chrome-driver-3.141.59.jar:/home/jenkins/.m2/repository/org/seleniumhq/selenium/selenium-opera-driver/3.141.59/selenium-opera-driver-3.141.59.jar:/home/jenkins/.m2/repository/jakarta/annotation/jakarta.annotation-api/1.3.5/jakarta.annotation-api-1.3.5.jar:/home/jenkins/.m2/repository/org/eclipse/jetty/jetty-security/9.4.40.v20210413/jetty-security-9.4.40.v20210413.jar:/home/jenkins/.m2/repository/org/glassfish/hk2/osgi-resource-locator/1.0.3/osgi-resource-locator-1.0.3.jar:/home/jenkins/.m2/repository/net/bytebuddy/byte-buddy-agent/1.10.13/byte-buddy-agent-1.10.13.jar:/home/jenkins/.m2/repository/org/mortbay/jetty/jetty-util/6.1.26/jetty-util-6.1.26.jar:/home/jenkins/.m2/repository/org/apache/hadoop/hadoop-yarn-api/2.7.4/hadoop-yarn-api-2.7.4.jar:/home/jenkins/.m2/repository/org/apache/yetus/audience-annotations/0.5.0/audience-annotations-0.5.0.jar:/home/jenkins/.m2/repository/org/scalatest/scalatest-flatspec_2.13/3.2.3/scalatest-flatspec_2.13-3.2.3.jar:/home/jenkins/.m2/repository/io/dropwizard/metrics/metrics-jvm/4.1.1/metrics-jvm-4.1.1.jar:/home/jenkins/.m2/repository/org/scala-sbt/test-interface/1.0/test-interface-1.0.jar:/home/jenkins/.m2/repository/com/squareup/okio/okio/1.14.0/okio-1.14.0.jar:/home/jenkins/.m2/repository/org/eclipse/jetty/jetty-continuation/9.4.40.v20210413/jetty-continuation-9.4.40.v20210413.jar:/home/jenkins/.m2/repository/org/hamcrest/hamcrest-core/1.3/hamcrest-core-1.3.jar:/home/jenkins/.m2/repository/org/codehaus/jackson/jackson-mapper-asl/1.9.13/jackson-mapper-asl-1.9.13.jar:/home/jenkins/workspace/spark-branch-3.1-test-maven-hadoop-2.7-scala-2.13/launcher/target/scala-2.13/classes:/home/jenkins/.m2/repository/org/seleniumhq/selenium/selenium-support/3.141.59/selenium-support-3.141.59.jar:/home/jenkins/.m2/repository/org/json4s/json4s-scalap_2.13/3.7.0-M5/json4s-scalap_2.13-3.7.0-M5.jar:/home/jenkins/.m2/repository/javax/servlet/jsp/jsp-api/2.1/jsp-api-2.1.jar:/home/jenkins/.m2/repository/org/apache/hadoop/hadoop-yarn-server-common/2.7.4/hadoop-yarn-server-common-2.7.4.jar:/home/jenkins/.m2/repository/org/eclipse/jetty/jetty-servlet/9.4.40.v20210413/jetty-servlet-9.4.40.v20210413.jar:/home/jenkins/.m2/repository/org/scala-lang/modules/scala-parallel-collections_2.13/0.2.0/scala-parallel-collections_2.13-0.2.0.jar:/home/jenkins/.m2/repository/org/apache/hadoop/hadoop-mapreduce-client-app/2.7.4/hadoop-mapreduce-client-app-2.7.4.jar:/home/jenkins/.m2/repository/com/ning/compress-lzf/1.0.3/compress-lzf-1.0.3.jar:/home/jenkins/.m2/repository/xmlenc/xmlenc/0.52/xmlenc-0.52.jar:/home/jenkins/.m2/repository/org/apache/avro/avro-ipc/1.8.2/avro-ipc-1.8.2.jar:/home/jenkins/.m2/repository/org/slf4j/slf4j-api/1.7.30/slf4j-api-1.7.30.jar:/home/jenkins/.m2/repository/org/glassfish/jersey/containers/jersey-container-servlet/2.30/jersey-container-servlet-2.30.jar:/home/jenkins/workspace/spark-branch-3.1-test-maven-hadoop-2.7-scala-2.13/common/unsafe/target/scala-2.13/classes:/home/jenkins/.m2/repository/com/fasterxml/jackson/core/jackson-databind/2.10.0/jackson-databind-2.10.0.jar:/home/jenkins/.m2/repository/org/apache/directory/api/api-util/1.0.0-M20/api-util-1.0.0-M20.jar:/home/jenkins/.m2/repository/org/apache/hadoop/hadoop-yarn-common/2.7.4/hadoop-yarn-common-2.7.4.jar:/home/jenkins/.m2/repository/com/google/code/gson/gson/2.2.4/gson-2.2.4.jar:/home/jenkins/.m2/repository/org/apache/directory/api/api-asn1-api/1.0.0-M20/api-asn1-api-1.0.0-M20.jar:/home/jenkins/.m2/repository/org/apache/hadoop/hadoop-annotations/2.7.4/hadoop-annotations-2.7.4.jar:/home/jenkins/.m2/repository/org/seleniumhq/selenium/selenium-remote-driver/3.141.59/selenium-remote-driver-3.141.59.jar:/home/jenkins/.m2/repository/org/eclipse/jetty/jetty-client/9.4.40.v20210413/jetty-client-9.4.40.v20210413.jar:/home/jenkins/.m2/repository/org/scalatestplus/scalatestplus-selenium_2.13/1.0.0-SNAP5/scalatestplus-selenium_2.13-1.0.0-SNAP5.jar:/home/jenkins/.m2/repository/org/apache/commons/commons-crypto/1.1.0/commons-crypto-1.1.0.jar:/home/jenkins/.m2/repository/org/javassist/javassist/3.25.0-GA/javassist-3.25.0-GA.jar:/home/jenkins/.m2/repository/org/eclipse/jetty/jetty-servlets/9.4.40.v20210413/jetty-servlets-9.4.40.v20210413.jar:/home/jenkins/.m2/repository/org/glassfish/jersey/containers/jersey-container-servlet-core/2.30/jersey-container-servlet-core-2.30.jar:/home/jenkins/.m2/repository/commons-configuration/commons-configuration/1.6/commons-configuration-1.6.jar:/home/jenkins/.m2/repository/org/apache/commons/commons-compress/1.21/commons-compress-1.21.jar:/home/jenkins/.m2/repository/commons-digester/commons-digester/1.8/commons-digester-1.8.jar:/home/jenkins/.m2/repository/org/apache/directory/server/apacheds-i18n/2.0.0-M15/apacheds-i18n-2.0.0-M15.jar:/home/jenkins/.m2/repository/org/apache/kafka/kafka-clients/2.6.0/kafka-clients-2.6.0.jar:/home/jenkins/workspace/spark-branch-3.1-test-maven-hadoop-2.7-scala-2.13/external/kafka-0-10/target/scala-2.13/classes:/home/jenkins/.m2/repository/org/apache/commons/commons-lang3/3.10/commons-lang3-3.10.jar:/home/jenkins/.m2/repository/org/seleniumhq/selenium/selenium-api/3.141.59/selenium-api-3.141.59.jar:/home/jenkins/.m2/repository/org/apache/curator/curator-client/2.7.1/curator-client-2.7.1.jar:/home/jenkins/.m2/repository/org/apache/hadoop/hadoop-hdfs/2.7.4/hadoop-hdfs-2.7.4.jar:/home/jenkins/.m2/repository/org/seleniumhq/selenium/selenium-java/3.141.59/selenium-java-3.141.59.jar:/home/jenkins/.m2/repository/org/mockito/mockito-core/3.4.6/mockito-core-3.4.6.jar:/home/jenkins/workspace/spark-branch-3.1-test-maven-hadoop-2.7-scala-2.13/common/network-common/target/scala-2.13/classes:/home/jenkins/.m2/repository/org/xerial/snappy/snappy-java/1.1.8.2/snappy-java-1.1.8.2.jar:/home/jenkins/.m2/repository/org/roaringbitmap/RoaringBitmap/0.9.0/RoaringBitmap-0.9.0.jar:/home/jenkins/.m2/repository/commons-cli/commons-cli/1.2/commons-cli-1.2.jar:/home/jenkins/.m2/repository/org/slf4j/jcl-over-slf4j/1.7.30/jcl-over-slf4j-1.7.30.jar:/home/jenkins/.m2/repository/org/spark-project/spark/unused/1.0.0/unused-1.0.0.jar:/home/jenkins/.m2/repository/org/glassfish/jersey/core/jersey-server/2.30/jersey-server-2.30.jar:/home/jenkins/.m2/repository/io/dropwizard/metrics/metrics-jmx/4.1.1/metrics-jmx-4.1.1.jar:/home/jenkins/.m2/repository/org/glassfish/jersey/core/jersey-client/2.30/jersey-client-2.30.jar:/home/jenkins/.m2/repository/commons-collections/commons-collections/3.2.2/commons-collections-3.2.2.jar:/home/jenkins/.m2/repository/org/scalatest/scalatest-compatible/3.2.3/scalatest-compatible-3.2.3.jar:/home/jenkins/.m2/repository/org/seleniumhq/selenium/selenium-firefox-driver/3.141.59/selenium-firefox-driver-3.141.59.jar:/home/jenkins/.m2/repository/org/apache/httpcomponents/httpclient/4.5.6/httpclient-4.5.6.jar:/home/jenkins/.m2/repository/org/eclipse/jetty/jetty-proxy/9.4.40.v20210413/jetty-proxy-9.4.40.v20210413.jar:/home/jenkins/.m2/repository/org/seleniumhq/selenium/selenium-safari-driver/3.141.59/selenium-safari-driver-3.141.59.jar:/home/jenkins/.m2/repository/org/scalacheck/scalacheck_2.13/1.14.2/scalacheck_2.13-1.14.2.jar:/home/jenkins/.m2/repository/com/fasterxml/jackson/module/jackson-module-scala_2.13/2.10.0/jackson-module-scala_2.13-2.10.0.jar:/home/jenkins/.m2/repository/org/scalatest/scalatest-refspec_2.13/3.2.3/scalatest-refspec_2.13-3.2.3.jar:/home/jenkins/.m2/repository/commons-httpclient/commons-httpclient/3.1/commons-httpclient-3.1.jar
[INFO] 
[INFO] --- scala-maven-plugin:4.3.0:testCompile (scala-test-compile-first) @ spark-streaming-kafka-0-10-assembly_2.13 ---
[INFO] compile in 0.0 s
[INFO] No sources to compile
[INFO] 
[INFO] --- maven-surefire-plugin:3.0.0-M5:test (default-test) @ spark-streaming-kafka-0-10-assembly_2.13 ---
[INFO] 
[INFO] --- maven-surefire-plugin:3.0.0-M5:test (test) @ spark-streaming-kafka-0-10-assembly_2.13 ---
[INFO] Skipping execution of surefire because it has already been run for this configuration
[INFO] 
[INFO] --- scalatest-maven-plugin:2.0.0:test (test) @ spark-streaming-kafka-0-10-assembly_2.13 ---
Discovery starting.
Discovery completed in 45 milliseconds.
Run starting. Expected test count is: 0
DiscoverySuite:
Run completed in 103 milliseconds.
Total number of tests run: 0
Suites: completed 1, aborted 0
Tests: succeeded 0, failed 0, canceled 0, ignored 0, pending 0
No tests were executed.
[INFO] 
[INFO] ------------------------------------------------------------------------
[INFO] Skipping Spark Avro
[INFO] This project has been banned from the build due to previous failures.
[INFO] ------------------------------------------------------------------------
[INFO] 
[INFO] -----< org.apache.spark:spark-streaming-kinesis-asl-assembly_2.13 >-----
[INFO] Building Spark Project Kinesis Assembly 3.1.3-SNAPSHOT           [23/31]
[INFO] --------------------------------[ jar ]---------------------------------
[INFO] 
[INFO] --- maven-enforcer-plugin:3.0.0-M2:enforce (enforce-versions) @ spark-streaming-kinesis-asl-assembly_2.13 ---
[INFO] 
[INFO] --- maven-enforcer-plugin:3.0.0-M2:enforce (enforce-no-duplicate-dependencies) @ spark-streaming-kinesis-asl-assembly_2.13 ---
[INFO] 
[INFO] --- mvn-scalafmt_2.13:1.0.3:format (default) @ spark-streaming-kinesis-asl-assembly_2.13 ---
[WARNING] format.skipSources set, ignoring main directories
[WARNING] format.skipTestSources set, ignoring validateOnly directories
[WARNING] No sources specified, skipping formatting
[INFO] 
[INFO] --- scala-maven-plugin:4.3.0:add-source (eclipse-add-source) @ spark-streaming-kinesis-asl-assembly_2.13 ---
[INFO] Add Source directory: /home/jenkins/workspace/spark-branch-3.1-test-maven-hadoop-2.7-scala-2.13/external/kinesis-asl-assembly/src/main/scala
[INFO] Add Test Source directory: /home/jenkins/workspace/spark-branch-3.1-test-maven-hadoop-2.7-scala-2.13/external/kinesis-asl-assembly/src/test/scala
[INFO] 
[INFO] --- maven-dependency-plugin:3.1.1:build-classpath (default-cli) @ spark-streaming-kinesis-asl-assembly_2.13 ---
[INFO] Dependencies classpath:
/home/jenkins/.m2/repository/com/amazonaws/aws-java-sdk-kms/1.11.655/aws-java-sdk-kms-1.11.655.jar:/home/jenkins/.m2/repository/org/apache/commons/commons-compress/1.21/commons-compress-1.21.jar:/home/jenkins/.m2/repository/javax/xml/bind/jaxb-api/2.2.2/jaxb-api-2.2.2.jar:/home/jenkins/.m2/repository/com/thoughtworks/paranamer/paranamer/2.8/paranamer-2.8.jar:/home/jenkins/.m2/repository/org/scala-lang/scala-library/2.13.4/scala-library-2.13.4.jar:/home/jenkins/.m2/repository/com/amazonaws/aws-java-sdk-kinesis/1.11.655/aws-java-sdk-kinesis-1.11.655.jar:/home/jenkins/.m2/repository/org/apache/commons/commons-lang3/3.10/commons-lang3-3.10.jar:/home/jenkins/.m2/repository/joda-time/joda-time/2.10.5/joda-time-2.10.5.jar:/home/jenkins/.m2/repository/com/amazonaws/aws-java-sdk-s3/1.11.655/aws-java-sdk-s3-1.11.655.jar:/home/jenkins/.m2/repository/com/amazonaws/aws-java-sdk-dynamodb/1.11.655/aws-java-sdk-dynamodb-1.11.655.jar:/home/jenkins/.m2/repository/com/fasterxml/jackson/dataformat/jackson-dataformat-cbor/2.10.0/jackson-dataformat-cbor-2.10.0.jar:/home/jenkins/.m2/repository/javax/activation/activation/1.1.1/activation-1.1.1.jar:/home/jenkins/.m2/repository/com/fasterxml/jackson/core/jackson-core/2.10.0/jackson-core-2.10.0.jar:/home/jenkins/.m2/repository/commons-cli/commons-cli/1.2/commons-cli-1.2.jar:/home/jenkins/.m2/repository/commons-codec/commons-codec/1.10/commons-codec-1.10.jar:/home/jenkins/.m2/repository/com/amazonaws/aws-java-sdk-core/1.11.655/aws-java-sdk-core-1.11.655.jar:/home/jenkins/.m2/repository/org/apache/httpcomponents/httpcore/4.4.12/httpcore-4.4.12.jar:/home/jenkins/.m2/repository/com/google/protobuf/protobuf-java/2.6.1/protobuf-java-2.6.1.jar:/home/jenkins/.m2/repository/org/mortbay/jetty/jetty-util/6.1.26/jetty-util-6.1.26.jar:/home/jenkins/.m2/repository/org/apache/hadoop/hadoop-yarn-api/2.7.4/hadoop-yarn-api-2.7.4.jar:/home/jenkins/.m2/repository/org/spark-project/spark/unused/1.0.0/unused-1.0.0.jar:/home/jenkins/.m2/repository/com/amazonaws/aws-java-sdk-sts/1.11.655/aws-java-sdk-sts-1.11.655.jar:/home/jenkins/.m2/repository/com/amazonaws/aws-java-sdk-cloudwatch/1.11.655/aws-java-sdk-cloudwatch-1.11.655.jar:/home/jenkins/.m2/repository/commons-io/commons-io/2.4/commons-io-2.4.jar:/home/jenkins/.m2/repository/org/codehaus/jackson/jackson-mapper-asl/1.9.13/jackson-mapper-asl-1.9.13.jar:/home/jenkins/workspace/spark-branch-3.1-test-maven-hadoop-2.7-scala-2.13/external/kinesis-asl/target/scala-2.13/classes:/home/jenkins/.m2/repository/org/codehaus/jackson/jackson-jaxrs/1.9.13/jackson-jaxrs-1.9.13.jar:/home/jenkins/.m2/repository/javax/xml/stream/stax-api/1.0-2/stax-api-1.0-2.jar:/home/jenkins/.m2/repository/com/amazonaws/amazon-kinesis-client/1.12.0/amazon-kinesis-client-1.12.0.jar:/home/jenkins/.m2/repository/org/apache/hadoop/hadoop-yarn-client/2.7.4/hadoop-yarn-client-2.7.4.jar:/home/jenkins/.m2/repository/org/codehaus/jackson/jackson-xc/1.9.13/jackson-xc-1.9.13.jar:/home/jenkins/.m2/repository/commons-logging/commons-logging/1.1.3/commons-logging-1.1.3.jar:/home/jenkins/.m2/repository/org/apache/httpcomponents/httpclient/4.5.6/httpclient-4.5.6.jar:/home/jenkins/workspace/spark-branch-3.1-test-maven-hadoop-2.7-scala-2.13/common/tags/target/scala-2.13/classes:/home/jenkins/.m2/repository/com/amazonaws/jmespath-java/1.11.655/jmespath-java-1.11.655.jar:/home/jenkins/.m2/repository/org/codehaus/jackson/jackson-core-asl/1.9.13/jackson-core-asl-1.9.13.jar:/home/jenkins/.m2/repository/software/amazon/ion/ion-java/1.0.2/ion-java-1.0.2.jar:/home/jenkins/.m2/repository/org/apache/hadoop/hadoop-yarn-common/2.7.4/hadoop-yarn-common-2.7.4.jar
[INFO] 
[INFO] --- maven-remote-resources-plugin:1.5:process (process-resource-bundles) @ spark-streaming-kinesis-asl-assembly_2.13 ---
[INFO] 
[INFO] --- maven-resources-plugin:2.7:resources (default-resources) @ spark-streaming-kinesis-asl-assembly_2.13 ---
[INFO] Using 'UTF-8' encoding to copy filtered resources.
[INFO] skip non existing resourceDirectory /home/jenkins/workspace/spark-branch-3.1-test-maven-hadoop-2.7-scala-2.13/external/kinesis-asl-assembly/src/main/resources
[INFO] Copying 3 resources
[INFO] 
[INFO] --- maven-compiler-plugin:3.8.1:compile (default-compile) @ spark-streaming-kinesis-asl-assembly_2.13 ---
[INFO] Not compiling main sources
[INFO] 
[INFO] --- scala-maven-plugin:4.3.0:compile (scala-compile-first) @ spark-streaming-kinesis-asl-assembly_2.13 ---
[INFO] compile in 0.0 s
[INFO] No sources to compile
[INFO] 
[INFO] --- maven-antrun-plugin:1.8:run (create-tmp-dir) @ spark-streaming-kinesis-asl-assembly_2.13 ---
[INFO] Executing tasks

main:
    [mkdir] Created dir: /home/jenkins/workspace/spark-branch-3.1-test-maven-hadoop-2.7-scala-2.13/external/kinesis-asl-assembly/target/tmp
[INFO] Executed tasks
[INFO] 
[INFO] --- maven-resources-plugin:2.7:testResources (default-testResources) @ spark-streaming-kinesis-asl-assembly_2.13 ---
[INFO] Using 'UTF-8' encoding to copy filtered resources.
[INFO] skip non existing resourceDirectory /home/jenkins/workspace/spark-branch-3.1-test-maven-hadoop-2.7-scala-2.13/external/kinesis-asl-assembly/src/test/resources
[INFO] Copying 3 resources
[INFO] 
[INFO] --- maven-compiler-plugin:3.8.1:testCompile (default-testCompile) @ spark-streaming-kinesis-asl-assembly_2.13 ---
[INFO] Not compiling test sources
[INFO] 
[INFO] --- maven-dependency-plugin:3.1.1:build-classpath (generate-test-classpath) @ spark-streaming-kinesis-asl-assembly_2.13 ---
[INFO] Dependencies classpath:
/home/jenkins/.m2/repository/com/google/crypto/tink/tink/1.6.0/tink-1.6.0.jar:/home/jenkins/.m2/repository/org/glassfish/hk2/external/jakarta.inject/2.6.1/jakarta.inject-2.6.1.jar:/home/jenkins/.m2/repository/org/apache/htrace/htrace-core/3.1.0-incubating/htrace-core-3.1.0-incubating.jar:/home/jenkins/.m2/repository/org/apache/hadoop/hadoop-mapreduce-client-jobclient/2.7.4/hadoop-mapreduce-client-jobclient-2.7.4.jar:/home/jenkins/.m2/repository/org/eclipse/jetty/jetty-plus/9.4.40.v20210413/jetty-plus-9.4.40.v20210413.jar:/home/jenkins/.m2/repository/jakarta/servlet/jakarta.servlet-api/4.0.3/jakarta.servlet-api-4.0.3.jar:/home/jenkins/workspace/spark-branch-3.1-test-maven-hadoop-2.7-scala-2.13/core/target/scala-2.13/classes:/home/jenkins/.m2/repository/com/google/code/findbugs/jsr305/3.0.0/jsr305-3.0.0.jar:/home/jenkins/.m2/repository/org/scalatest/scalatest-shouldmatchers_2.13/3.2.3/scalatest-shouldmatchers_2.13-3.2.3.jar:/home/jenkins/.m2/repository/com/fasterxml/jackson/dataformat/jackson-dataformat-cbor/2.10.0/jackson-dataformat-cbor-2.10.0.jar:/home/jenkins/.m2/repository/org/glassfish/jersey/media/jersey-media-jaxb/2.30/jersey-media-jaxb-2.30.jar:/home/jenkins/.m2/repository/com/amazonaws/aws-java-sdk-core/1.11.655/aws-java-sdk-core-1.11.655.jar:/home/jenkins/.m2/repository/org/scalatest/scalatest-funsuite_2.13/3.2.3/scalatest-funsuite_2.13-3.2.3.jar:/home/jenkins/.m2/repository/org/eclipse/jetty/jetty-http/9.4.40.v20210413/jetty-http-9.4.40.v20210413.jar:/home/jenkins/.m2/repository/org/codehaus/jackson/jackson-jaxrs/1.9.13/jackson-jaxrs-1.9.13.jar:/home/jenkins/.m2/repository/org/eclipse/jetty/jetty-jndi/9.4.40.v20210413/jetty-jndi-9.4.40.v20210413.jar:/home/jenkins/.m2/repository/org/scalatest/scalatest-featurespec_2.13/3.2.3/scalatest-featurespec_2.13-3.2.3.jar:/home/jenkins/.m2/repository/org/scalatest/scalatest-funspec_2.13/3.2.3/scalatest-funspec_2.13-3.2.3.jar:/home/jenkins/.m2/repository/xerces/xercesImpl/2.12.0/xercesImpl-2.12.0.jar:/home/jenkins/.m2/repository/net/bytebuddy/byte-buddy/1.10.13/byte-buddy-1.10.13.jar:/home/jenkins/.m2/repository/org/json4s/json4s-core_2.13/3.7.0-M5/json4s-core_2.13-3.7.0-M5.jar:/home/jenkins/.m2/repository/org/eclipse/jetty/jetty-util/9.4.40.v20210413/jetty-util-9.4.40.v20210413.jar:/home/jenkins/.m2/repository/com/twitter/chill-java/0.9.5/chill-java-0.9.5.jar:/home/jenkins/.m2/repository/com/amazonaws/aws-java-sdk-kms/1.11.655/aws-java-sdk-kms-1.11.655.jar:/home/jenkins/.m2/repository/commons-net/commons-net/3.1/commons-net-3.1.jar:/home/jenkins/workspace/spark-branch-3.1-test-maven-hadoop-2.7-scala-2.13/streaming/target/scala-2.13/classes:/home/jenkins/.m2/repository/org/json4s/json4s-ast_2.13/3.7.0-M5/json4s-ast_2.13-3.7.0-M5.jar:/home/jenkins/.m2/repository/commons-lang/commons-lang/2.6/commons-lang-2.6.jar:/home/jenkins/.m2/repository/joda-time/joda-time/2.10.5/joda-time-2.10.5.jar:/home/jenkins/.m2/repository/com/amazonaws/aws-java-sdk-s3/1.11.655/aws-java-sdk-s3-1.11.655.jar:/home/jenkins/.m2/repository/com/twitter/chill_2.13/0.9.5/chill_2.13-0.9.5.jar:/home/jenkins/.m2/repository/org/scalatest/scalatest-freespec_2.13/3.2.3/scalatest-freespec_2.13-3.2.3.jar:/home/jenkins/.m2/repository/org/seleniumhq/selenium/selenium-edge-driver/3.141.59/selenium-edge-driver-3.141.59.jar:/home/jenkins/.m2/repository/org/eclipse/jetty/jetty-server/9.4.40.v20210413/jetty-server-9.4.40.v20210413.jar:/home/jenkins/.m2/repository/org/apache/commons/commons-exec/1.3/commons-exec-1.3.jar:/home/jenkins/.m2/repository/javax/activation/activation/1.1.1/activation-1.1.1.jar:/home/jenkins/.m2/repository/org/apache/hadoop/hadoop-auth/2.7.4/hadoop-auth-2.7.4.jar:/home/jenkins/.m2/repository/org/apache/hadoop/hadoop-mapreduce-client-shuffle/2.7.4/hadoop-mapreduce-client-shuffle-2.7.4.jar:/home/jenkins/.m2/repository/commons-beanutils/commons-beanutils/1.9.4/commons-beanutils-1.9.4.jar:/home/jenkins/.m2/repository/org/apache/ivy/ivy/2.4.0/ivy-2.4.0.jar:/home/jenkins/.m2/repository/net/razorvine/pyrolite/4.30/pyrolite-4.30.jar:/home/jenkins/.m2/repository/jakarta/validation/jakarta.validation-api/2.0.2/jakarta.validation-api-2.0.2.jar:/home/jenkins/.m2/repository/org/scalatestplus/scalatestplus-scalacheck_2.13/3.1.0.0-RC2/scalatestplus-scalacheck_2.13-3.1.0.0-RC2.jar:/home/jenkins/.m2/repository/org/glassfish/jersey/inject/jersey-hk2/2.30/jersey-hk2-2.30.jar:/home/jenkins/.m2/repository/org/scalatest/scalatest-wordspec_2.13/3.2.3/scalatest-wordspec_2.13-3.2.3.jar:/home/jenkins/.m2/repository/org/scala-lang/scala-reflect/2.13.4/scala-reflect-2.13.4.jar:/home/jenkins/.m2/repository/org/apache/avro/avro-mapred/1.8.2/avro-mapred-1.8.2-hadoop2.jar:/home/jenkins/workspace/spark-branch-3.1-test-maven-hadoop-2.7-scala-2.13/common/network-shuffle/target/scala-2.13/classes:/home/jenkins/.m2/repository/log4j/log4j/1.2.17/log4j-1.2.17.jar:/home/jenkins/.m2/repository/org/apache/curator/curator-framework/2.7.1/curator-framework-2.7.1.jar:/home/jenkins/.m2/repository/org/apache/curator/curator-recipes/2.7.1/curator-recipes-2.7.1.jar:/home/jenkins/.m2/repository/io/dropwizard/metrics/metrics-core/4.1.1/metrics-core-4.1.1.jar:/home/jenkins/.m2/repository/org/scalactic/scalactic_2.13/3.2.3/scalactic_2.13-3.2.3.jar:/home/jenkins/.m2/repository/junit/junit/4.13.1/junit-4.13.1.jar:/home/jenkins/.m2/repository/org/apache/avro/avro/1.8.2/avro-1.8.2.jar:/home/jenkins/.m2/repository/io/dropwizard/metrics/metrics-json/4.1.1/metrics-json-4.1.1.jar:/home/jenkins/.m2/repository/org/apache/directory/server/apacheds-kerberos-codec/2.0.0-M15/apacheds-kerberos-codec-2.0.0-M15.jar:/home/jenkins/.m2/repository/org/roaringbitmap/shims/0.9.0/shims-0.9.0.jar:/home/jenkins/.m2/repository/org/eclipse/jetty/jetty-security/9.4.40.v20210413/jetty-security-9.4.40.v20210413.jar:/home/jenkins/.m2/repository/org/glassfish/hk2/osgi-resource-locator/1.0.3/osgi-resource-locator-1.0.3.jar:/home/jenkins/.m2/repository/net/bytebuddy/byte-buddy-agent/1.10.13/byte-buddy-agent-1.10.13.jar:/home/jenkins/.m2/repository/org/scalatest/scalatest-flatspec_2.13/3.2.3/scalatest-flatspec_2.13-3.2.3.jar:/home/jenkins/.m2/repository/org/scala-sbt/test-interface/1.0/test-interface-1.0.jar:/home/jenkins/.m2/repository/com/squareup/okio/okio/1.14.0/okio-1.14.0.jar:/home/jenkins/.m2/repository/org/eclipse/jetty/jetty-continuation/9.4.40.v20210413/jetty-continuation-9.4.40.v20210413.jar:/home/jenkins/.m2/repository/org/codehaus/jackson/jackson-mapper-asl/1.9.13/jackson-mapper-asl-1.9.13.jar:/home/jenkins/workspace/spark-branch-3.1-test-maven-hadoop-2.7-scala-2.13/launcher/target/scala-2.13/classes:/home/jenkins/.m2/repository/org/json4s/json4s-scalap_2.13/3.7.0-M5/json4s-scalap_2.13-3.7.0-M5.jar:/home/jenkins/.m2/repository/javax/servlet/jsp/jsp-api/2.1/jsp-api-2.1.jar:/home/jenkins/.m2/repository/org/eclipse/jetty/jetty-servlet/9.4.40.v20210413/jetty-servlet-9.4.40.v20210413.jar:/home/jenkins/.m2/repository/org/scala-lang/modules/scala-parallel-collections_2.13/0.2.0/scala-parallel-collections_2.13-0.2.0.jar:/home/jenkins/.m2/repository/com/ning/compress-lzf/1.0.3/compress-lzf-1.0.3.jar:/home/jenkins/.m2/repository/org/slf4j/slf4j-api/1.7.30/slf4j-api-1.7.30.jar:/home/jenkins/.m2/repository/org/glassfish/jersey/containers/jersey-container-servlet/2.30/jersey-container-servlet-2.30.jar:/home/jenkins/workspace/spark-branch-3.1-test-maven-hadoop-2.7-scala-2.13/common/unsafe/target/scala-2.13/classes:/home/jenkins/.m2/repository/com/google/code/gson/gson/2.2.4/gson-2.2.4.jar:/home/jenkins/.m2/repository/org/apache/hadoop/hadoop-annotations/2.7.4/hadoop-annotations-2.7.4.jar:/home/jenkins/.m2/repository/org/seleniumhq/selenium/selenium-remote-driver/3.141.59/selenium-remote-driver-3.141.59.jar:/home/jenkins/.m2/repository/org/javassist/javassist/3.25.0-GA/javassist-3.25.0-GA.jar:/home/jenkins/.m2/repository/org/eclipse/jetty/jetty-servlets/9.4.40.v20210413/jetty-servlets-9.4.40.v20210413.jar:/home/jenkins/.m2/repository/org/glassfish/jersey/containers/jersey-container-servlet-core/2.30/jersey-container-servlet-core-2.30.jar:/home/jenkins/.m2/repository/commons-configuration/commons-configuration/1.6/commons-configuration-1.6.jar:/home/jenkins/.m2/repository/org/apache/commons/commons-compress/1.21/commons-compress-1.21.jar:/home/jenkins/.m2/repository/commons-digester/commons-digester/1.8/commons-digester-1.8.jar:/home/jenkins/.m2/repository/org/apache/directory/server/apacheds-i18n/2.0.0-M15/apacheds-i18n-2.0.0-M15.jar:/home/jenkins/.m2/repository/org/apache/curator/curator-client/2.7.1/curator-client-2.7.1.jar:/home/jenkins/.m2/repository/org/apache/hadoop/hadoop-hdfs/2.7.4/hadoop-hdfs-2.7.4.jar:/home/jenkins/.m2/repository/org/mockito/mockito-core/3.4.6/mockito-core-3.4.6.jar:/home/jenkins/.m2/repository/org/xerial/snappy/snappy-java/1.1.8.2/snappy-java-1.1.8.2.jar:/home/jenkins/.m2/repository/commons-cli/commons-cli/1.2/commons-cli-1.2.jar:/home/jenkins/.m2/repository/org/spark-project/spark/unused/1.0.0/unused-1.0.0.jar:/home/jenkins/.m2/repository/commons-collections/commons-collections/3.2.2/commons-collections-3.2.2.jar:/home/jenkins/.m2/repository/org/scalatest/scalatest-compatible/3.2.3/scalatest-compatible-3.2.3.jar:/home/jenkins/.m2/repository/org/apache/httpcomponents/httpclient/4.5.6/httpclient-4.5.6.jar:/home/jenkins/.m2/repository/org/scalacheck/scalacheck_2.13/1.14.2/scalacheck_2.13-1.14.2.jar:/home/jenkins/.m2/repository/com/fasterxml/jackson/module/jackson-module-scala_2.13/2.10.0/jackson-module-scala_2.13-2.10.0.jar:/home/jenkins/.m2/repository/commons-httpclient/commons-httpclient/3.1/commons-httpclient-3.1.jar:/home/jenkins/.m2/repository/org/scalatest/scalatest-core_2.13/3.2.3/scalatest-core_2.13-3.2.3.jar:/home/jenkins/.m2/repository/org/scalatest/scalatest-matchers-core_2.13/3.2.3/scalatest-matchers-core_2.13-3.2.3.jar:/home/jenkins/.m2/repository/com/clearspring/analytics/stream/2.9.6/stream-2.9.6.jar:/home/jenkins/.m2/repository/org/scalatest/scalatest_2.13/3.2.3/scalatest_2.13-3.2.3.jar:/home/jenkins/.m2/repository/org/apache/hadoop/hadoop-mapreduce-client-common/2.7.4/hadoop-mapreduce-client-common-2.7.4.jar:/home/jenkins/.m2/repository/org/glassfish/hk2/hk2-locator/2.6.1/hk2-locator-2.6.1.jar:/home/jenkins/.m2/repository/org/slf4j/slf4j-log4j12/1.7.30/slf4j-log4j12-1.7.30.jar:/home/jenkins/.m2/repository/org/glassfish/hk2/hk2-utils/2.6.1/hk2-utils-2.6.1.jar:/home/jenkins/.m2/repository/com/thoughtworks/paranamer/paranamer/2.8/paranamer-2.8.jar:/home/jenkins/.m2/repository/io/netty/netty-all/4.1.51.Final/netty-all-4.1.51.Final.jar:/home/jenkins/.m2/repository/org/scalatest/scalatest-propspec_2.13/3.2.3/scalatest-propspec_2.13-3.2.3.jar:/home/jenkins/.m2/repository/com/fasterxml/jackson/core/jackson-annotations/2.10.0/jackson-annotations-2.10.0.jar:/home/jenkins/.m2/repository/org/apache/hadoop/hadoop-client/2.7.4/hadoop-client-2.7.4.jar:/home/jenkins/.m2/repository/org/objenesis/objenesis/2.6/objenesis-2.6.jar:/home/jenkins/.m2/repository/org/fusesource/leveldbjni/leveldbjni-all/1.8/leveldbjni-all-1.8.jar:/home/jenkins/.m2/repository/xml-apis/xml-apis/1.4.01/xml-apis-1.4.01.jar:/home/jenkins/.m2/repository/org/apache/commons/commons-text/1.6/commons-text-1.6.jar:/home/jenkins/.m2/repository/com/fasterxml/jackson/core/jackson-core/2.10.0/jackson-core-2.10.0.jar:/home/jenkins/.m2/repository/jakarta/ws/rs/jakarta.ws.rs-api/2.1.6/jakarta.ws.rs-api-2.1.6.jar:/home/jenkins/.m2/repository/org/glassfish/hk2/external/aopalliance-repackaged/2.6.1/aopalliance-repackaged-2.6.1.jar:/home/jenkins/.m2/repository/org/tukaani/xz/1.5/xz-1.5.jar:/home/jenkins/.m2/repository/com/google/protobuf/protobuf-java/2.6.1/protobuf-java-2.6.1.jar:/home/jenkins/workspace/spark-branch-3.1-test-maven-hadoop-2.7-scala-2.13/common/kvstore/target/scala-2.13/classes:/home/jenkins/.m2/repository/com/amazonaws/aws-java-sdk-sts/1.11.655/aws-java-sdk-sts-1.11.655.jar:/home/jenkins/.m2/repository/com/amazonaws/aws-java-sdk-cloudwatch/1.11.655/aws-java-sdk-cloudwatch-1.11.655.jar:/home/jenkins/.m2/repository/org/apache/hadoop/hadoop-common/2.7.4/hadoop-common-2.7.4.jar:/home/jenkins/.m2/repository/commons-io/commons-io/2.4/commons-io-2.4.jar:/home/jenkins/.m2/repository/com/fasterxml/jackson/module/jackson-module-paranamer/2.10.0/jackson-module-paranamer-2.10.0.jar:/home/jenkins/.m2/repository/org/scalatestplus/scalatestplus-mockito_2.13/1.0.0-SNAP5/scalatestplus-mockito_2.13-1.0.0-SNAP5.jar:/home/jenkins/.m2/repository/org/apache/hadoop/hadoop-yarn-client/2.7.4/hadoop-yarn-client-2.7.4.jar:/home/jenkins/.m2/repository/com/esotericsoftware/kryo-shaded/4.0.2/kryo-shaded-4.0.2.jar:/home/jenkins/.m2/repository/com/esotericsoftware/minlog/1.3.0/minlog-1.3.0.jar:/home/jenkins/.m2/repository/org/codehaus/jackson/jackson-core-asl/1.9.13/jackson-core-asl-1.9.13.jar:/home/jenkins/.m2/repository/net/sf/py4j/py4j/0.10.9/py4j-0.10.9.jar:/home/jenkins/.m2/repository/org/scalatest/scalatest-diagrams_2.13/3.2.3/scalatest-diagrams_2.13-3.2.3.jar:/home/jenkins/.m2/repository/org/eclipse/jetty/jetty-util-ajax/9.4.40.v20210413/jetty-util-ajax-9.4.40.v20210413.jar:/home/jenkins/.m2/repository/com/squareup/okhttp3/okhttp/3.11.0/okhttp-3.11.0.jar:/home/jenkins/.m2/repository/org/slf4j/jul-to-slf4j/1.7.30/jul-to-slf4j-1.7.30.jar:/home/jenkins/.m2/repository/org/seleniumhq/selenium/selenium-ie-driver/3.141.59/selenium-ie-driver-3.141.59.jar:/home/jenkins/.m2/repository/org/lz4/lz4-java/1.7.1/lz4-java-1.7.1.jar:/home/jenkins/.m2/repository/javax/xml/bind/jaxb-api/2.2.2/jaxb-api-2.2.2.jar:/home/jenkins/.m2/repository/org/scala-lang/scala-library/2.13.4/scala-library-2.13.4.jar:/home/jenkins/.m2/repository/io/dropwizard/metrics/metrics-graphite/4.1.1/metrics-graphite-4.1.1.jar:/home/jenkins/.m2/repository/org/mortbay/jetty/jetty-sslengine/6.1.26/jetty-sslengine-6.1.26.jar:/home/jenkins/.m2/repository/com/amazonaws/aws-java-sdk-dynamodb/1.11.655/aws-java-sdk-dynamodb-1.11.655.jar:/home/jenkins/.m2/repository/org/scalatest/scalatest-mustmatchers_2.13/3.2.3/scalatest-mustmatchers_2.13-3.2.3.jar:/home/jenkins/.m2/repository/commons-codec/commons-codec/1.10/commons-codec-1.10.jar:/home/jenkins/.m2/repository/org/apache/httpcomponents/httpcore/4.4.12/httpcore-4.4.12.jar:/home/jenkins/.m2/repository/com/google/guava/guava/14.0.1/guava-14.0.1.jar:/home/jenkins/.m2/repository/org/eclipse/jetty/jetty-xml/9.4.40.v20210413/jetty-xml-9.4.40.v20210413.jar:/home/jenkins/.m2/repository/org/eclipse/jetty/jetty-io/9.4.40.v20210413/jetty-io-9.4.40.v20210413.jar:/home/jenkins/.m2/repository/org/apache/hadoop/hadoop-mapreduce-client-core/2.7.4/hadoop-mapreduce-client-core-2.7.4.jar:/home/jenkins/.m2/repository/javax/servlet/javax.servlet-api/3.1.0/javax.servlet-api-3.1.0.jar:/home/jenkins/.m2/repository/org/apache/commons/commons-math3/3.4.1/commons-math3-3.4.1.jar:/home/jenkins/workspace/spark-branch-3.1-test-maven-hadoop-2.7-scala-2.13/external/kinesis-asl/target/scala-2.13/classes:/home/jenkins/.m2/repository/javax/xml/stream/stax-api/1.0-2/stax-api-1.0-2.jar:/home/jenkins/.m2/repository/org/json4s/json4s-jackson_2.13/3.7.0-M5/json4s-jackson_2.13-3.7.0-M5.jar:/home/jenkins/.m2/repository/com/amazonaws/amazon-kinesis-client/1.12.0/amazon-kinesis-client-1.12.0.jar:/home/jenkins/.m2/repository/org/codehaus/jackson/jackson-xc/1.9.13/jackson-xc-1.9.13.jar:/home/jenkins/workspace/spark-branch-3.1-test-maven-hadoop-2.7-scala-2.13/common/tags/target/scala-2.13/classes:/home/jenkins/.m2/repository/org/eclipse/jetty/jetty-webapp/9.4.40.v20210413/jetty-webapp-9.4.40.v20210413.jar:/home/jenkins/.m2/repository/org/glassfish/jersey/core/jersey-common/2.30/jersey-common-2.30.jar:/home/jenkins/.m2/repository/oro/oro/2.0.8/oro-2.0.8.jar:/home/jenkins/.m2/repository/com/novocode/junit-interface/0.11/junit-interface-0.11.jar:/home/jenkins/.m2/repository/org/apache/xbean/xbean-asm7-shaded/4.15/xbean-asm7-shaded-4.15.jar:/home/jenkins/.m2/repository/com/github/luben/zstd-jni/1.4.8-1/zstd-jni-1.4.8-1.jar:/home/jenkins/.m2/repository/org/scala-lang/modules/scala-xml_2.13/1.2.0/scala-xml_2.13-1.2.0.jar:/home/jenkins/.m2/repository/com/amazonaws/aws-java-sdk-kinesis/1.11.655/aws-java-sdk-kinesis-1.11.655.jar:/home/jenkins/.m2/repository/org/glassfish/hk2/hk2-api/2.6.1/hk2-api-2.6.1.jar:/home/jenkins/.m2/repository/org/apache/zookeeper/zookeeper/3.4.14/zookeeper-3.4.14.jar:/home/jenkins/.m2/repository/org/seleniumhq/selenium/selenium-chrome-driver/3.141.59/selenium-chrome-driver-3.141.59.jar:/home/jenkins/.m2/repository/org/seleniumhq/selenium/selenium-opera-driver/3.141.59/selenium-opera-driver-3.141.59.jar:/home/jenkins/.m2/repository/jakarta/annotation/jakarta.annotation-api/1.3.5/jakarta.annotation-api-1.3.5.jar:/home/jenkins/.m2/repository/org/mortbay/jetty/jetty-util/6.1.26/jetty-util-6.1.26.jar:/home/jenkins/.m2/repository/org/apache/hadoop/hadoop-yarn-api/2.7.4/hadoop-yarn-api-2.7.4.jar:/home/jenkins/.m2/repository/org/apache/yetus/audience-annotations/0.5.0/audience-annotations-0.5.0.jar:/home/jenkins/.m2/repository/io/dropwizard/metrics/metrics-jvm/4.1.1/metrics-jvm-4.1.1.jar:/home/jenkins/.m2/repository/org/hamcrest/hamcrest-core/1.3/hamcrest-core-1.3.jar:/home/jenkins/.m2/repository/org/seleniumhq/selenium/selenium-support/3.141.59/selenium-support-3.141.59.jar:/home/jenkins/.m2/repository/org/apache/hadoop/hadoop-yarn-server-common/2.7.4/hadoop-yarn-server-common-2.7.4.jar:/home/jenkins/.m2/repository/org/apache/hadoop/hadoop-mapreduce-client-app/2.7.4/hadoop-mapreduce-client-app-2.7.4.jar:/home/jenkins/.m2/repository/xmlenc/xmlenc/0.52/xmlenc-0.52.jar:/home/jenkins/.m2/repository/org/apache/avro/avro-ipc/1.8.2/avro-ipc-1.8.2.jar:/home/jenkins/.m2/repository/com/fasterxml/jackson/core/jackson-databind/2.10.0/jackson-databind-2.10.0.jar:/home/jenkins/.m2/repository/org/apache/directory/api/api-util/1.0.0-M20/api-util-1.0.0-M20.jar:/home/jenkins/.m2/repository/org/apache/hadoop/hadoop-yarn-common/2.7.4/hadoop-yarn-common-2.7.4.jar:/home/jenkins/.m2/repository/org/apache/directory/api/api-asn1-api/1.0.0-M20/api-asn1-api-1.0.0-M20.jar:/home/jenkins/.m2/repository/org/eclipse/jetty/jetty-client/9.4.40.v20210413/jetty-client-9.4.40.v20210413.jar:/home/jenkins/.m2/repository/org/scalatestplus/scalatestplus-selenium_2.13/1.0.0-SNAP5/scalatestplus-selenium_2.13-1.0.0-SNAP5.jar:/home/jenkins/.m2/repository/org/apache/commons/commons-crypto/1.1.0/commons-crypto-1.1.0.jar:/home/jenkins/.m2/repository/org/apache/commons/commons-lang3/3.10/commons-lang3-3.10.jar:/home/jenkins/.m2/repository/org/seleniumhq/selenium/selenium-api/3.141.59/selenium-api-3.141.59.jar:/home/jenkins/.m2/repository/org/seleniumhq/selenium/selenium-java/3.141.59/selenium-java-3.141.59.jar:/home/jenkins/workspace/spark-branch-3.1-test-maven-hadoop-2.7-scala-2.13/common/network-common/target/scala-2.13/classes:/home/jenkins/.m2/repository/org/roaringbitmap/RoaringBitmap/0.9.0/RoaringBitmap-0.9.0.jar:/home/jenkins/.m2/repository/org/slf4j/jcl-over-slf4j/1.7.30/jcl-over-slf4j-1.7.30.jar:/home/jenkins/.m2/repository/io/dropwizard/metrics/metrics-jmx/4.1.1/metrics-jmx-4.1.1.jar:/home/jenkins/.m2/repository/org/glassfish/jersey/core/jersey-server/2.30/jersey-server-2.30.jar:/home/jenkins/.m2/repository/org/glassfish/jersey/core/jersey-client/2.30/jersey-client-2.30.jar:/home/jenkins/.m2/repository/org/seleniumhq/selenium/selenium-firefox-driver/3.141.59/selenium-firefox-driver-3.141.59.jar:/home/jenkins/.m2/repository/commons-logging/commons-logging/1.1.3/commons-logging-1.1.3.jar:/home/jenkins/.m2/repository/org/eclipse/jetty/jetty-proxy/9.4.40.v20210413/jetty-proxy-9.4.40.v20210413.jar:/home/jenkins/.m2/repository/com/amazonaws/jmespath-java/1.11.655/jmespath-java-1.11.655.jar:/home/jenkins/.m2/repository/org/seleniumhq/selenium/selenium-safari-driver/3.141.59/selenium-safari-driver-3.141.59.jar:/home/jenkins/.m2/repository/software/amazon/ion/ion-java/1.0.2/ion-java-1.0.2.jar:/home/jenkins/.m2/repository/org/scalatest/scalatest-refspec_2.13/3.2.3/scalatest-refspec_2.13-3.2.3.jar
[INFO] 
[INFO] --- scala-maven-plugin:4.3.0:testCompile (scala-test-compile-first) @ spark-streaming-kinesis-asl-assembly_2.13 ---
[INFO] compile in 0.0 s
[INFO] No sources to compile
[INFO] 
[INFO] --- maven-surefire-plugin:3.0.0-M5:test (default-test) @ spark-streaming-kinesis-asl-assembly_2.13 ---
[INFO] 
[INFO] --- maven-surefire-plugin:3.0.0-M5:test (test) @ spark-streaming-kinesis-asl-assembly_2.13 ---
[INFO] Skipping execution of surefire because it has already been run for this configuration
[INFO] 
[INFO] --- scalatest-maven-plugin:2.0.0:test (test) @ spark-streaming-kinesis-asl-assembly_2.13 ---
Discovery starting.
Discovery completed in 45 milliseconds.
Run starting. Expected test count is: 0
DiscoverySuite:
Run completed in 96 milliseconds.
Total number of tests run: 0
Suites: completed 1, aborted 0
Tests: succeeded 0, failed 0, canceled 0, ignored 0, pending 0
No tests were executed.
[INFO] ------------------------------------------------------------------------
[INFO] Reactor Summary for Spark Project Parent POM 3.1.3-SNAPSHOT:
[INFO] 
[INFO] Spark Project Parent POM ........................... SUCCESS [  3.172 s]
[INFO] Spark Project Tags ................................. SUCCESS [  3.470 s]
[INFO] Spark Project Sketch ............................... SUCCESS [  9.473 s]
[INFO] Spark Project Local DB ............................. SUCCESS [  3.630 s]
[INFO] Spark Project Networking ........................... SUCCESS [ 51.198 s]
[INFO] Spark Project Shuffle Streaming Service ............ SUCCESS [ 10.698 s]
[INFO] Spark Project Unsafe ............................... SUCCESS [  3.004 s]
[INFO] Spark Project Launcher ............................. SUCCESS [  3.452 s]
[INFO] Spark Project Core ................................. SUCCESS [33:38 min]
[INFO] Spark Project ML Local Library ..................... SUCCESS [ 29.353 s]
[INFO] Spark Project GraphX ............................... SUCCESS [02:45 min]
[INFO] Spark Project Streaming ............................ SUCCESS [05:39 min]
[INFO] Spark Project Catalyst ............................. SUCCESS [18:30 min]
[INFO] Spark Project SQL .................................. FAILURE [ 34.461 s]
[INFO] Spark Project ML Library ........................... SKIPPED
[INFO] Spark Project Tools ................................ SUCCESS [  8.247 s]
[INFO] Spark Project Hive ................................. SKIPPED
[INFO] Spark Project REPL ................................. SKIPPED
[INFO] Spark Project YARN Shuffle Service ................. SUCCESS [  1.780 s]
[INFO] Spark Project YARN ................................. SUCCESS [08:04 min]
[INFO] Spark Project Mesos ................................ SUCCESS [01:02 min]
[INFO] Spark Project Hive Thrift Server ................... SKIPPED
[INFO] Spark Project Assembly ............................. SKIPPED
[INFO] Kafka 0.10+ Token Provider for Streaming ........... SUCCESS [ 28.243 s]
[INFO] Spark Integration for Kafka 0.10 ................... SUCCESS [01:51 min]
[INFO] Kafka 0.10+ Source for Structured Streaming ........ SKIPPED
[INFO] Spark Kinesis Integration .......................... SUCCESS [ 45.368 s]
[INFO] Spark Project Examples ............................. SKIPPED
[INFO] Spark Integration for Kafka 0.10 Assembly .......... SUCCESS [  2.138 s]
[INFO] Spark Avro ......................................... SKIPPED
[INFO] Spark Project Kinesis Assembly ..................... SUCCESS [  2.477 s]
[INFO] ------------------------------------------------------------------------
[INFO] BUILD FAILURE
[INFO] ------------------------------------------------------------------------
[INFO] Total time:  01:15 h
[INFO] Finished at: 2021-10-25T02:28:50-07:00
[INFO] ------------------------------------------------------------------------
[ERROR] Failed to execute goal net.alchim31.maven:scala-maven-plugin:4.3.0:compile (scala-compile-first) on project spark-sql_2.13: Execution scala-compile-first of goal net.alchim31.maven:scala-maven-plugin:4.3.0:compile failed.: CompileFailed -> [Help 1]
[ERROR] 
[ERROR] To see the full stack trace of the errors, re-run Maven with the -e switch.
[ERROR] Re-run Maven using the -X switch to enable full debug logging.
[ERROR] 
[ERROR] For more information about the errors and possible solutions, please read the following articles:
[ERROR] [Help 1] http://cwiki.apache.org/confluence/display/MAVEN/PluginExecutionException
[ERROR] 
[ERROR] After correcting the problems, you can resume the build with the command
[ERROR]   mvn <args> -rf :spark-sql_2.13
+ retcode2=1
+ [[ 1 -ne 0 ]]
+ [[ 1 -ne 0 ]]
+ echo 'Packaging Spark with Maven failed'
Packaging Spark with Maven failed
+ [[ 1 -ne 0 ]]
+ echo 'Testing Spark with Maven failed'
Testing Spark with Maven failed
+ exit 1
Build step 'Execute shell' marked build as failure
Archiving artifacts
Recording test results
[Checks API] No suitable checks publisher found.
Finished: FAILURE